build checks.x86_64-linux.nixos-theoden
807.52 s
Progress: 197 of 711 built (16 building), 678 of 1199 downloaded from cache (4 downloading)
807.52 s
Progress: 197 of 711 built (16 building), 679 of 1199 downloaded from cache (3 downloading)
807.52 s
Progress: 197 of 711 built (16 building), 680 of 1199 downloaded from cache (2 downloading)
807.52 s
Progress: 197 of 711 built (16 building), 681 of 1199 downloaded from cache (1 downloading)
807.57 s
[cargo-package-windows_i686_gnu:post-build] Uploading to the NixCI cache: /nix/store/rwjvzi2v0hw7anxgc6h4sbwfh1m1kbfm-cargo-package-windows_i686_gnu-0.53.1
807.61 s
Downloaded cached dotnet-aspnetcore-runtime (101.3 MiB) in 507ms
807.62 s
[cargo-package-windows_i686_gnu:post-build] warning: 'warn-short-path-literals' is deprecated, use 'lint-short-path-literals = ignore' instead
807.63 s
[cargo-package-windows_i686_gnu:post-build] copying 1 paths...
807.63 s
[cargo-package-windows_i686_gnu:post-build] copying path '/nix/store/rwjvzi2v0hw7anxgc6h4sbwfh1m1kbfm-cargo-package-windows_i686_gnu-0.53.1' to 'https://cache.nix-ci.com'...
809.48 s
[cargo-package-windows_i686_gnu:post-build] warning: 'warn-short-path-literals' is deprecated, use 'lint-short-path-literals = ignore' instead
809.64 s
[cargo-package-windows_i686_gnu:post-build] copying 2 paths...
809.64 s
[cargo-package-windows_i686_gnu:post-build] copying path '/nix/store/rxbs9s7xync1k8akc9jb261by1a37j7x-cargo-src-windows_i686_gnu-0.53.1.drv' to 'https://cache.nix-ci.com'...
809.78 s
[cargo-package-windows_i686_gnu:post-build] copying path '/nix/store/bl0r5l01wx6pwd5br7685w0l0lh8hgm3-cargo-package-windows_i686_gnu-0.53.1.drv' to 'https://cache.nix-ci.com'...
809.93 s
Uploaded cargo-package-windows_i686_gnu in 2.3s
809.93 s
Progress: 198 of 712 built (15 building), 681 of 1199 downloaded from cache (1 downloading)
809.93 s
Built cargo-package-windows_i686_gnu in 3.1s
809.96 s
[cargo-package-windows_x86_64_msvc:post-build] Uploading to the NixCI cache: /nix/store/6qqh0fq3z44nav1nhljyn3zz0pjhjxrj-cargo-package-windows_x86_64_msvc-0.53.1
810.00 s
[cargo-package-windows_x86_64_msvc:post-build] warning: 'warn-short-path-literals' is deprecated, use 'lint-short-path-literals = ignore' instead
810.01 s
[cargo-package-windows_x86_64_msvc:post-build] copying 1 paths...
810.01 s
[cargo-package-windows_x86_64_msvc:post-build] copying path '/nix/store/6qqh0fq3z44nav1nhljyn3zz0pjhjxrj-cargo-package-windows_x86_64_msvc-0.53.1' to 'https://cache.nix-ci.com'...
810.95 s
[cargo-package-windows_x86_64_msvc:post-build] warning: 'warn-short-path-literals' is deprecated, use 'lint-short-path-literals = ignore' instead
811.11 s
[cargo-package-windows_x86_64_msvc:post-build] copying 2 paths...
811.11 s
[cargo-package-windows_x86_64_msvc:post-build] copying path '/nix/store/4sm66gfbrmv0w56bj2vqagcxyrcfxvd3-cargo-src-windows_x86_64_msvc-0.53.1.drv' to 'https://cache.nix-ci.com'...
811.24 s
[cargo-package-windows_x86_64_msvc:post-build] copying path '/nix/store/yi6767sv0mkmzyymbp2zkvcqv1nx3px3-cargo-package-windows_x86_64_msvc-0.53.1.drv' to 'https://cache.nix-ci.com'...
811.38 s
Uploaded cargo-package-windows_x86_64_msvc in 1.4s
811.38 s
Progress: 199 of 713 built (14 building), 681 of 1199 downloaded from cache (1 downloading)
811.38 s
Built cargo-package-windows_x86_64_msvc in 4.5s
811.42 s
[cargo-package-winnow:post-build] Uploading to the NixCI cache: /nix/store/4xx18bdcf7k9hymbgdiaqm7v68wf8niz-cargo-package-winnow-1.0.3
811.46 s
[cargo-package-winnow:post-build] warning: 'warn-short-path-literals' is deprecated, use 'lint-short-path-literals = ignore' instead
811.46 s
[cargo-package-winnow:post-build] copying 1 paths...
811.46 s
[cargo-package-winnow:post-build] copying path '/nix/store/4xx18bdcf7k9hymbgdiaqm7v68wf8niz-cargo-package-winnow-1.0.3' to 'https://cache.nix-ci.com'...
811.70 s
[cargo-package-winnow:post-build] warning: 'warn-short-path-literals' is deprecated, use 'lint-short-path-literals = ignore' instead
811.86 s
[cargo-package-winnow:post-build] copying 2 paths...
811.86 s
[cargo-package-winnow:post-build] copying path '/nix/store/m5gyayz8fanlzrgvmxrfkg7120m55s57-cargo-src-winnow-1.0.3.drv' to 'https://cache.nix-ci.com'...
811.99 s
[cargo-package-winnow:post-build] copying path '/nix/store/m2pfvk0y5v51mnmi8nz7lv1vl35b9wpf-cargo-package-winnow-1.0.3.drv' to 'https://cache.nix-ci.com'...
812.13 s
Uploaded cargo-package-winnow in 733ms
812.13 s
Progress: 200 of 714 built (13 building), 681 of 1199 downloaded from cache (1 downloading)
812.13 s
Built cargo-package-winnow in 5.2s
812.16 s
[cargo-package-wit-bindgen:post-build] Uploading to the NixCI cache: /nix/store/yij2lb4siyh6aljizfs60gk2vhacfyvs-cargo-package-wit-bindgen-0.57.1
812.20 s
[cargo-package-wit-bindgen:post-build] warning: 'warn-short-path-literals' is deprecated, use 'lint-short-path-literals = ignore' instead
812.20 s
[cargo-package-wit-bindgen:post-build] copying 1 paths...
812.20 s
[cargo-package-wit-bindgen:post-build] copying path '/nix/store/yij2lb4siyh6aljizfs60gk2vhacfyvs-cargo-package-wit-bindgen-0.57.1' to 'https://cache.nix-ci.com'...
812.33 s
[cargo-package-wit-bindgen:post-build] warning: 'warn-short-path-literals' is deprecated, use 'lint-short-path-literals = ignore' instead
812.50 s
[cargo-package-wit-bindgen:post-build] copying 2 paths...
812.50 s
[cargo-package-wit-bindgen:post-build] copying path '/nix/store/ckkvii8wdjrs5yxkr8dw29mip6mvx58p-cargo-src-wit-bindgen-0.57.1.drv' to 'https://cache.nix-ci.com'...
812.63 s
[cargo-package-wit-bindgen:post-build] copying path '/nix/store/0kxfzc4qsa0pjwrch73d5pkrxq9k48q0-cargo-package-wit-bindgen-0.57.1.drv' to 'https://cache.nix-ci.com'...
812.76 s
Uploaded cargo-package-wit-bindgen in 621ms
812.76 s
Progress: 201 of 715 built (12 building), 681 of 1199 downloaded from cache (1 downloading)
812.76 s
Built cargo-package-wit-bindgen in 6.0s
812.79 s
[cargo-package-yansi:post-build] Uploading to the NixCI cache: /nix/store/lajwhqbyx07na8pfm1akh0w8gmrc0nrm-cargo-package-yansi-1.0.1
812.83 s
[cargo-package-yansi:post-build] warning: 'warn-short-path-literals' is deprecated, use 'lint-short-path-literals = ignore' instead
812.83 s
[cargo-package-yansi:post-build] copying 1 paths...
812.83 s
[cargo-package-yansi:post-build] copying path '/nix/store/lajwhqbyx07na8pfm1akh0w8gmrc0nrm-cargo-package-yansi-1.0.1' to 'https://cache.nix-ci.com'...
812.94 s
[cargo-package-yansi:post-build] warning: 'warn-short-path-literals' is deprecated, use 'lint-short-path-literals = ignore' instead
813.10 s
[cargo-package-yansi:post-build] copying 2 paths...
813.10 s
[cargo-package-yansi:post-build] copying path '/nix/store/n0dxy4frj2547qfk0ppb103zxr76anyb-cargo-src-yansi-1.0.1.drv' to 'https://cache.nix-ci.com'...
813.22 s
[cargo-package-yansi:post-build] copying path '/nix/store/2pnn8zrzpg9djswiqfn3y8i1w905za0g-cargo-package-yansi-1.0.1.drv' to 'https://cache.nix-ci.com'...
813.36 s
Uploaded cargo-package-yansi in 586ms
813.36 s
Progress: 202 of 716 built (11 building), 681 of 1199 downloaded from cache (1 downloading)
813.36 s
Built cargo-package-yansi in 6.4s
813.38 s
[cargo-package-yoke:post-build] Uploading to the NixCI cache: /nix/store/14pchryqxyhba8j91sr6i6n72q8bldp8-cargo-package-yoke-0.8.3
813.42 s
[cargo-package-yoke:post-build] warning: 'warn-short-path-literals' is deprecated, use 'lint-short-path-literals = ignore' instead
813.43 s
[cargo-package-yoke:post-build] copying 1 paths...
813.43 s
[cargo-package-yoke:post-build] copying path '/nix/store/14pchryqxyhba8j91sr6i6n72q8bldp8-cargo-package-yoke-0.8.3' to 'https://cache.nix-ci.com'...
813.53 s
[cargo-package-yoke:post-build] warning: 'warn-short-path-literals' is deprecated, use 'lint-short-path-literals = ignore' instead
813.70 s
[cargo-package-yoke:post-build] copying 2 paths...
813.70 s
[cargo-package-yoke:post-build] copying path '/nix/store/c9z73pjkp23ill9wi87pf19xdzmxw7sp-cargo-src-yoke-0.8.3.drv' to 'https://cache.nix-ci.com'...
813.83 s
[cargo-package-yoke:post-build] copying path '/nix/store/wjbaz1pisaixca9qp4bblfqnqi6cpkdb-cargo-package-yoke-0.8.3.drv' to 'https://cache.nix-ci.com'...
813.97 s
Uploaded cargo-package-yoke in 605ms
813.97 s
Progress: 203 of 717 built (10 building), 681 of 1199 downloaded from cache (1 downloading)
813.97 s
Built cargo-package-yoke in 6.9s
813.97 s
[cargo-package-yoke-derive] Phase: unpackPhase
813.97 s
[cargo-package-yoke-derive] setting SOURCE_DATE_EPOCH to timestamp 1153704088 of file "./crate/src/visitor.rs"
813.97 s
[cargo-package-yoke-derive] Phase: patchPhase
813.97 s
[cargo-package-yoke-derive] Phase: updateAutotoolsGnuConfigScriptsPhase
813.97 s
[cargo-package-yoke-derive] Phase: installPhase
813.97 s
[cargo-package-zerocopy] Phase: unpackPhase
813.97 s
[cargo-package-zerocopy] setting SOURCE_DATE_EPOCH to timestamp 1153704088 of file "./crate/win-cargo.bat"
813.97 s
[cargo-package-zerocopy] Phase: patchPhase
813.97 s
[cargo-package-zerocopy] Phase: updateAutotoolsGnuConfigScriptsPhase
813.97 s
[cargo-package-zerocopy] Phase: installPhase
813.97 s
[cargo-package-zerocopy-derive] Phase: unpackPhase
813.97 s
[cargo-package-zerocopy-derive] setting SOURCE_DATE_EPOCH to timestamp 1153704088 of file "./crate/tests/unsafe_cell.rs"
813.97 s
[cargo-package-zerocopy-derive] Phase: patchPhase
813.97 s
[cargo-package-zerocopy-derive] Phase: updateAutotoolsGnuConfigScriptsPhase
813.97 s
[cargo-package-zerocopy-derive] Phase: installPhase
813.97 s
[cargo-package-zerofrom] Phase: unpackPhase
813.97 s
[cargo-package-zerofrom] setting SOURCE_DATE_EPOCH to timestamp 1153704088 of file "./crate/src/zero_from.rs"
813.97 s
[cargo-package-zerofrom] Phase: patchPhase
813.97 s
[cargo-package-zerofrom] Phase: updateAutotoolsGnuConfigScriptsPhase
813.97 s
[cargo-package-zerofrom] Phase: installPhase
813.97 s
[cargo-package-zerofrom-derive] Phase: unpackPhase
813.97 s
[cargo-package-zerofrom-derive] setting SOURCE_DATE_EPOCH to timestamp 1153704088 of file "./crate/src/visitor.rs"
813.97 s
[cargo-package-zerofrom-derive] Phase: patchPhase
813.97 s
[cargo-package-zerofrom-derive] Phase: updateAutotoolsGnuConfigScriptsPhase
813.97 s
[cargo-package-zerofrom-derive] Phase: installPhase
813.97 s
[cargo-package-zeroize] Phase: unpackPhase
813.97 s
[cargo-package-zeroize] setting SOURCE_DATE_EPOCH to timestamp 1153704088 of file "./crate/tests/zeroize_derive.rs"
813.97 s
[cargo-package-zeroize] Phase: patchPhase
813.97 s
[cargo-package-zeroize] Phase: updateAutotoolsGnuConfigScriptsPhase
813.97 s
[cargo-package-zeroize] Phase: installPhase
813.97 s
[cargo-package-zerovec] Phase: unpackPhase
813.97 s
[cargo-package-zerovec] setting SOURCE_DATE_EPOCH to timestamp 1153704088 of file "./crate/src/zerovec/slice.rs"
813.97 s
[cargo-package-zerovec] Phase: patchPhase
813.97 s
[cargo-package-zerovec] Phase: updateAutotoolsGnuConfigScriptsPhase
813.97 s
[cargo-package-zerovec] Phase: installPhase
813.97 s
[cargo-package-zerovec-derive] Phase: unpackPhase
813.97 s
[cargo-package-zerovec-derive] setting SOURCE_DATE_EPOCH to timestamp 1153704088 of file "./crate/src/varule.rs"
813.97 s
[cargo-package-zerovec-derive] Phase: patchPhase
813.97 s
[cargo-package-zerovec-derive] Phase: updateAutotoolsGnuConfigScriptsPhase
813.97 s
[cargo-package-zerovec-derive] Phase: installPhase
813.97 s
Downloading cached containers.conf from https://cache.nix-ci.com
813.97 s
Downloading cached fc-cache from https://cache.nix-ci.com
813.97 s
Downloading cached file-5.48-dev from https://cache.nix-ci.com
813.97 s
Downloading cached geos from https://cache.nix-ci.com
813.97 s
Downloading cached grpcurl from https://cache.nix-ci.com
813.97 s
Downloading cached grub from https://cache.nix-ci.com
813.97 s
Downloading cached hashbrown from https://cache.nix-ci.com
813.97 s
Downloading cached hm-session-vars.fish from https://cache.nix-ci.com
813.97 s
Downloaded cached hm-session-vars.fish in 0ms
813.97 s
Downloading cached hm-session-vars.fish-fish-completions from https://cache.nix-ci.com
813.97 s
Downloading cached hm-session-vars.sh from https://cache.nix-ci.com
813.97 s
Downloading cached hm-session-vars.sh-fish-completions from https://cache.nix-ci.com
813.97 s
Downloaded cached hm-session-vars.sh in 0ms
813.97 s
Downloading cached hm_environment.d10homemanager.conf from https://cache.nix-ci.com
813.97 s
Downloading cached hm_hmfontconfigdefaultfonts.xml from https://cache.nix-ci.com
813.97 s
Downloading cached htop from https://cache.nix-ci.com
813.97 s
Downloading cached htop-3.5.3-man from https://cache.nix-ci.com
813.98 s
Downloaded cached hm-session-vars.sh-fish-completions (96 B) in 7ms
813.98 s
Downloaded cached hm-session-vars.fish-fish-completions (96 B) in 7ms
813.98 s
Downloaded cached hm_hmfontconfigdefaultfonts.xml (232 B) in 7ms
813.98 s
Downloaded cached hm_environment.d10homemanager.conf (224 B) in 7ms
814.00 s
Downloaded cached file-5.48-dev (7896 B) in 22ms
814.00 s
Downloaded cached fc-cache (9256 B) in 22ms
814.00 s
Downloaded cached containers.conf (344 B) in 23ms
814.00 s
Downloaded cached htop (502 KiB) in 26ms
814.01 s
Downloaded cached htop-3.5.3-man (10 KiB) in 31ms
814.01 s
Downloaded cached hashbrown (876 KiB) in 40ms
814.02 s
Building /nix/store/0kmvxj8shdy0yxf9wpys5j4dsf0rc6mw-cargo-package-zstd-sys-2.0.16+zstd.1.5.7.drv
814.07 s
Building /nix/store/v3kwk0mas9ry1dvgj725xcry5k9drpdl-paperless-ngx-tiktoken-cache.drv
814.08 s
Downloaded cached geos (9.5 MiB) in 109ms
814.13 s
Building /nix/store/gph8mn34k0ap61hgw7gb8ix5m8l3kkmp-comin-0.14.0_fish-completions.drv
814.17 s
Downloaded cached grpcurl (29.9 MiB) in 200ms
814.18 s
Building /nix/store/91lsgb7m3rhwg1ia63p196kjwyfxiq12-unit-cloudflared-tunnel-b33ec739-7324-4c6f-b6fa-daedbe0828c8.service.drv
814.22 s
Building /nix/store/f76990ifiwm3k4vwc78m9v53bkm6gfcv-unit-comin.service.drv
814.23 s
Downloaded cached grub (36.3 MiB) in 256ms
814.27 s
Building /nix/store/r1km9jwy4qrc88wwnfl4rw3img1qa87x-unit-vault-agent-default.service.drv
814.27 s
Progress: 203 of 701 built (16 building), 682 of 1199 downloaded from cache (15 downloading)
814.27 s
Progress: 203 of 701 built (16 building), 683 of 1199 downloaded from cache (14 downloading)
814.27 s
Progress: 203 of 701 built (16 building), 684 of 1199 downloaded from cache (13 downloading)
814.27 s
Progress: 203 of 701 built (16 building), 685 of 1199 downloaded from cache (12 downloading)
814.27 s
Progress: 203 of 701 built (16 building), 686 of 1199 downloaded from cache (11 downloading)
814.27 s
Progress: 203 of 701 built (16 building), 687 of 1199 downloaded from cache (10 downloading)
814.27 s
Progress: 203 of 701 built (16 building), 688 of 1199 downloaded from cache (9 downloading)
814.27 s
Progress: 203 of 701 built (16 building), 689 of 1199 downloaded from cache (8 downloading)
814.27 s
Progress: 203 of 701 built (16 building), 690 of 1199 downloaded from cache (7 downloading)
814.27 s
Progress: 203 of 701 built (16 building), 691 of 1199 downloaded from cache (6 downloading)
814.27 s
Progress: 203 of 701 built (16 building), 692 of 1199 downloaded from cache (5 downloading)
814.27 s
Progress: 203 of 701 built (16 building), 693 of 1199 downloaded from cache (4 downloading)
814.27 s
Progress: 203 of 701 built (16 building), 694 of 1199 downloaded from cache (3 downloading)
814.27 s
Progress: 203 of 701 built (16 building), 695 of 1199 downloaded from cache (2 downloading)
814.27 s
Progress: 203 of 701 built (16 building), 696 of 1199 downloaded from cache (1 downloading)
814.27 s
Progress: 203 of 701 built (16 building), 697 of 1199 downloaded from cache
814.30 s
[cargo-package-yoke-derive:post-build] Uploading to the NixCI cache: /nix/store/0xjx7adnf878gg85m3i83g7a5qm4jp1z-cargo-package-yoke-derive-0.8.2
814.34 s
[cargo-package-yoke-derive:post-build] warning: 'warn-short-path-literals' is deprecated, use 'lint-short-path-literals = ignore' instead
814.34 s
[cargo-package-yoke-derive:post-build] copying 1 paths...
814.34 s
[cargo-package-yoke-derive:post-build] copying path '/nix/store/0xjx7adnf878gg85m3i83g7a5qm4jp1z-cargo-package-yoke-derive-0.8.2' to 'https://cache.nix-ci.com'...
814.44 s
[cargo-package-yoke-derive:post-build] warning: 'warn-short-path-literals' is deprecated, use 'lint-short-path-literals = ignore' instead
814.59 s
[cargo-package-yoke-derive:post-build] copying 2 paths...
814.59 s
[cargo-package-yoke-derive:post-build] copying path '/nix/store/k4wrb9zrnsc9mjrbzsjzjw886n6ppvp6-cargo-src-yoke-derive-0.8.2.drv' to 'https://cache.nix-ci.com'...
814.72 s
[cargo-package-yoke-derive:post-build] copying path '/nix/store/5in92a3xzrs2a8hqdyf2k43r3xpff9ax-cargo-package-yoke-derive-0.8.2.drv' to 'https://cache.nix-ci.com'...
814.85 s
Uploaded cargo-package-yoke-derive in 572ms
814.85 s
Progress: 204 of 702 built (15 building), 697 of 1199 downloaded from cache
814.85 s
Built cargo-package-yoke-derive in 7.8s
814.91 s
[cargo-package-zerocopy:post-build] Uploading to the NixCI cache: /nix/store/qr88nn50xngyfcd41zm3h071k6n17r9y-cargo-package-zerocopy-0.8.52
814.96 s
[cargo-package-zerocopy:post-build] warning: 'warn-short-path-literals' is deprecated, use 'lint-short-path-literals = ignore' instead
814.96 s
[cargo-package-zerocopy:post-build] copying 1 paths...
814.96 s
[cargo-package-zerocopy:post-build] copying path '/nix/store/qr88nn50xngyfcd41zm3h071k6n17r9y-cargo-package-zerocopy-0.8.52' to 'https://cache.nix-ci.com'...
815.30 s
[cargo-package-zerocopy:post-build] warning: 'warn-short-path-literals' is deprecated, use 'lint-short-path-literals = ignore' instead
815.46 s
[cargo-package-zerocopy:post-build] copying 2 paths...
815.46 s
[cargo-package-zerocopy:post-build] copying path '/nix/store/76c3x6dcx2nv0j6ssxbfxiph3avacmhz-cargo-src-zerocopy-0.8.52.drv' to 'https://cache.nix-ci.com'...
815.60 s
[cargo-package-zerocopy:post-build] copying path '/nix/store/zn4izlcxac505lq69m3k85irw8ff9gqq-cargo-package-zerocopy-0.8.52.drv' to 'https://cache.nix-ci.com'...
815.74 s
Uploaded cargo-package-zerocopy in 855ms
815.74 s
Progress: 205 of 703 built (14 building), 697 of 1199 downloaded from cache
815.74 s
Built cargo-package-zerocopy in 8.6s
815.78 s
[cargo-package-zerocopy-derive:post-build] Uploading to the NixCI cache: /nix/store/6gdw5dgyi8qgrkbl1b6d7qgj8c5gcfrd-cargo-package-zerocopy-derive-0.8.52
815.82 s
[cargo-package-zerocopy-derive:post-build] warning: 'warn-short-path-literals' is deprecated, use 'lint-short-path-literals = ignore' instead
815.82 s
[cargo-package-zerocopy-derive:post-build] copying 1 paths...
815.82 s
[cargo-package-zerocopy-derive:post-build] copying path '/nix/store/6gdw5dgyi8qgrkbl1b6d7qgj8c5gcfrd-cargo-package-zerocopy-derive-0.8.52' to 'https://cache.nix-ci.com'...
816.00 s
[cargo-package-zerocopy-derive:post-build] warning: 'warn-short-path-literals' is deprecated, use 'lint-short-path-literals = ignore' instead
816.16 s
[cargo-package-zerocopy-derive:post-build] copying 2 paths...
816.16 s
[cargo-package-zerocopy-derive:post-build] copying path '/nix/store/sch21c7dza8a0rph1r4h1q7sxljlh4wl-cargo-src-zerocopy-derive-0.8.52.drv' to 'https://cache.nix-ci.com'...
816.29 s
[cargo-package-zerocopy-derive:post-build] copying path '/nix/store/hqj58nbgi8r5jfryhzcm22lmfjwiz5z4-cargo-package-zerocopy-derive-0.8.52.drv' to 'https://cache.nix-ci.com'...
816.43 s
Uploaded cargo-package-zerocopy-derive in 677ms
816.43 s
Progress: 206 of 704 built (13 building), 697 of 1199 downloaded from cache
816.43 s
Built cargo-package-zerocopy-derive in 9.2s
816.46 s
[cargo-package-zerofrom:post-build] Uploading to the NixCI cache: /nix/store/4wbwxj3d1fm0lgn6igka4md6mmi7p2r9-cargo-package-zerofrom-0.1.8
816.50 s
[cargo-package-zerofrom:post-build] warning: 'warn-short-path-literals' is deprecated, use 'lint-short-path-literals = ignore' instead
816.51 s
[cargo-package-zerofrom:post-build] copying 1 paths...
816.51 s
[cargo-package-zerofrom:post-build] copying path '/nix/store/4wbwxj3d1fm0lgn6igka4md6mmi7p2r9-cargo-package-zerofrom-0.1.8' to 'https://cache.nix-ci.com'...
816.59 s
[cargo-package-zerofrom:post-build] warning: 'warn-short-path-literals' is deprecated, use 'lint-short-path-literals = ignore' instead
816.78 s
[cargo-package-zerofrom:post-build] copying 2 paths...
816.78 s
[cargo-package-zerofrom:post-build] copying path '/nix/store/gi6fwx3czyvlhmav16v0cwammh0krnf3-cargo-src-zerofrom-0.1.8.drv' to 'https://cache.nix-ci.com'...
816.91 s
[cargo-package-zerofrom:post-build] copying path '/nix/store/nbcfxw2jan9vy21n6x1h8vrwrxq4nfqc-cargo-package-zerofrom-0.1.8.drv' to 'https://cache.nix-ci.com'...
817.05 s
Uploaded cargo-package-zerofrom in 613ms
817.05 s
Progress: 207 of 705 built (12 building), 697 of 1199 downloaded from cache
817.05 s
Built cargo-package-zerofrom in 9.8s
817.08 s
[cargo-package-zerofrom-derive:post-build] Uploading to the NixCI cache: /nix/store/wkz7pnizyadvm47diwkynmj0zgyf6m8p-cargo-package-zerofrom-derive-0.1.7
817.12 s
[cargo-package-zerofrom-derive:post-build] warning: 'warn-short-path-literals' is deprecated, use 'lint-short-path-literals = ignore' instead
817.13 s
[cargo-package-zerofrom-derive:post-build] copying 1 paths...
817.13 s
[cargo-package-zerofrom-derive:post-build] copying path '/nix/store/wkz7pnizyadvm47diwkynmj0zgyf6m8p-cargo-package-zerofrom-derive-0.1.7' to 'https://cache.nix-ci.com'...
817.21 s
[cargo-package-zerofrom-derive:post-build] warning: 'warn-short-path-literals' is deprecated, use 'lint-short-path-literals = ignore' instead
817.37 s
[cargo-package-zerofrom-derive:post-build] copying 2 paths...
817.37 s
[cargo-package-zerofrom-derive:post-build] copying path '/nix/store/511dpzcwx24n3pv59rri2jsgghr0avc0-cargo-src-zerofrom-derive-0.1.7.drv' to 'https://cache.nix-ci.com'...
817.50 s
[cargo-package-zerofrom-derive:post-build] copying path '/nix/store/gjyinbrvkxf6gvrxc9v6n0i361kczx3m-cargo-package-zerofrom-derive-0.1.7.drv' to 'https://cache.nix-ci.com'...
817.65 s
Uploaded cargo-package-zerofrom-derive in 584ms
817.65 s
Progress: 208 of 706 built (11 building), 697 of 1199 downloaded from cache
817.65 s
Built cargo-package-zerofrom-derive in 10.3s
817.67 s
[cargo-package-zeroize:post-build] Uploading to the NixCI cache: /nix/store/4nq6z877nn8gjpwv8cx38znly29ibzpx-cargo-package-zeroize-1.9.0
817.71 s
[cargo-package-zeroize:post-build] warning: 'warn-short-path-literals' is deprecated, use 'lint-short-path-literals = ignore' instead
817.72 s
[cargo-package-zeroize:post-build] copying 1 paths...
817.72 s
[cargo-package-zeroize:post-build] copying path '/nix/store/4nq6z877nn8gjpwv8cx38znly29ibzpx-cargo-package-zeroize-1.9.0' to 'https://cache.nix-ci.com'...
817.81 s
[cargo-package-zeroize:post-build] warning: 'warn-short-path-literals' is deprecated, use 'lint-short-path-literals = ignore' instead
817.97 s
[cargo-package-zeroize:post-build] copying 2 paths...
817.97 s
[cargo-package-zeroize:post-build] copying path '/nix/store/2cnhf5qzzy7sg56hr9fgsbkjm0bvjkb2-cargo-src-zeroize-1.9.0.drv' to 'https://cache.nix-ci.com'...
818.11 s
[cargo-package-zeroize:post-build] copying path '/nix/store/lpf4lhm9b7hza9ixfxws4fm04ypcrajr-cargo-package-zeroize-1.9.0.drv' to 'https://cache.nix-ci.com'...
818.25 s
Uploaded cargo-package-zeroize in 600ms
818.25 s
Progress: 209 of 707 built (10 building), 697 of 1199 downloaded from cache
818.25 s
Built cargo-package-zeroize in 10.9s
818.29 s
[cargo-package-zerovec:post-build] Uploading to the NixCI cache: /nix/store/7xpx6cb45xyg91jsr5b2dknljxqfl2n4-cargo-package-zerovec-0.11.6
818.33 s
[cargo-package-zerovec:post-build] warning: 'warn-short-path-literals' is deprecated, use 'lint-short-path-literals = ignore' instead
818.34 s
[cargo-package-zerovec:post-build] copying 1 paths...
818.34 s
[cargo-package-zerovec:post-build] copying path '/nix/store/7xpx6cb45xyg91jsr5b2dknljxqfl2n4-cargo-package-zerovec-0.11.6' to 'https://cache.nix-ci.com'...
818.52 s
[cargo-package-zerovec:post-build] warning: 'warn-short-path-literals' is deprecated, use 'lint-short-path-literals = ignore' instead
818.69 s
[cargo-package-zerovec:post-build] copying 2 paths...
818.69 s
[cargo-package-zerovec:post-build] copying path '/nix/store/pd8hlkwnwyhzg6s5fvwqllv17hg8qp73-cargo-src-zerovec-0.11.6.drv' to 'https://cache.nix-ci.com'...
818.82 s
[cargo-package-zerovec:post-build] copying path '/nix/store/rpfqdhd9ccs7m0cgrd4jhb9l423mdm04-cargo-package-zerovec-0.11.6.drv' to 'https://cache.nix-ci.com'...
818.97 s
Uploaded cargo-package-zerovec in 699ms
818.97 s
Progress: 210 of 708 built (9 building), 697 of 1199 downloaded from cache
818.97 s
Built cargo-package-zerovec in 11.6s
819.00 s
[cargo-package-zerovec-derive:post-build] Uploading to the NixCI cache: /nix/store/72862g5ymwfnr5h3aqmlka2cr51sj8ym-cargo-package-zerovec-derive-0.11.3
819.04 s
[cargo-package-zerovec-derive:post-build] warning: 'warn-short-path-literals' is deprecated, use 'lint-short-path-literals = ignore' instead
819.04 s
[cargo-package-zerovec-derive:post-build] copying 1 paths...
819.04 s
[cargo-package-zerovec-derive:post-build] copying path '/nix/store/72862g5ymwfnr5h3aqmlka2cr51sj8ym-cargo-package-zerovec-derive-0.11.3' to 'https://cache.nix-ci.com'...
819.14 s
[cargo-package-zerovec-derive:post-build] warning: 'warn-short-path-literals' is deprecated, use 'lint-short-path-literals = ignore' instead
819.31 s
[cargo-package-zerovec-derive:post-build] copying 2 paths...
819.31 s
[cargo-package-zerovec-derive:post-build] copying path '/nix/store/vg9sp9y4mxhb6bxa1ss5gfbckckp923j-cargo-src-zerovec-derive-0.11.3.drv' to 'https://cache.nix-ci.com'...
819.43 s
[cargo-package-zerovec-derive:post-build] copying path '/nix/store/6sr78qdilrcr5iin5f2dndcgmwlim6gr-cargo-package-zerovec-derive-0.11.3.drv' to 'https://cache.nix-ci.com'...
819.56 s
Uploaded cargo-package-zerovec-derive in 587ms
819.56 s
Progress: 211 of 709 built (8 building), 697 of 1199 downloaded from cache
819.56 s
Built cargo-package-zerovec-derive in 12.1s
819.56 s
[cargo-package-zmij] Phase: unpackPhase
819.56 s
[cargo-package-zmij] setting SOURCE_DATE_EPOCH to timestamp 1153704088 of file "./crate/tests/test.rs"
819.56 s
[cargo-package-zmij] Phase: patchPhase
819.56 s
[cargo-package-zmij] Phase: updateAutotoolsGnuConfigScriptsPhase
819.56 s
[cargo-package-zmij] Phase: installPhase
819.56 s
[cargo-package-zstd-safe] Phase: unpackPhase
819.56 s
[cargo-package-zstd-safe] setting SOURCE_DATE_EPOCH to timestamp 1153704088 of file "./crate/src/tests.rs"
819.56 s
[cargo-package-zstd-safe] Phase: patchPhase
819.56 s
[cargo-package-zstd-safe] Phase: updateAutotoolsGnuConfigScriptsPhase
819.56 s
[cargo-package-zstd-safe] Phase: installPhase
819.56 s
[cargo-package-zstd-sys] Phase: unpackPhase
819.56 s
[cargo-package-zstd-sys] setting SOURCE_DATE_EPOCH to timestamp 1153704088 of file "./crate/zstd_seekable.h"
819.56 s
[cargo-package-zstd-sys] Phase: patchPhase
819.56 s
[cargo-package-zstd-sys] Phase: updateAutotoolsGnuConfigScriptsPhase
819.56 s
[cargo-package-zstd-sys] Phase: installPhase
819.59 s
[comin-0.14.0_fish-completions:post-build] Uploading to the NixCI cache: /nix/store/ydnxk9ivsf60b8h93r3c5gi6q64dyg9d-comin-0.14.0_fish-completions
819.63 s
[comin-0.14.0_fish-completions:post-build] warning: 'warn-short-path-literals' is deprecated, use 'lint-short-path-literals = ignore' instead
819.66 s
[comin-0.14.0_fish-completions:post-build] copying 0 paths...
819.70 s
[comin-0.14.0_fish-completions:post-build] warning: 'warn-short-path-literals' is deprecated, use 'lint-short-path-literals = ignore' instead
819.77 s
[comin-0.14.0_fish-completions:post-build] copying 0 paths...
819.79 s
Uploaded comin-0.14.0_fish-completions in 221ms
819.79 s
Progress: 212 of 710 built (7 building), 697 of 1199 downloaded from cache
819.79 s
Built comin-0.14.0_fish-completions in 5.6s
819.82 s
[paperless-ngx-tiktoken-cache:post-build] Uploading to the NixCI cache: /nix/store/hby2dgv4aqz0lm18ni695b8fk2azb3la-paperless-ngx-tiktoken-cache
819.86 s
[paperless-ngx-tiktoken-cache:post-build] warning: 'warn-short-path-literals' is deprecated, use 'lint-short-path-literals = ignore' instead
819.88 s
[paperless-ngx-tiktoken-cache:post-build] copying 0 paths...
819.93 s
[paperless-ngx-tiktoken-cache:post-build] warning: 'warn-short-path-literals' is deprecated, use 'lint-short-path-literals = ignore' instead
819.98 s
[paperless-ngx-tiktoken-cache:post-build] copying 0 paths...
819.99 s
Uploaded paperless-ngx-tiktoken-cache in 190ms
819.99 s
Progress: 213 of 711 built (6 building), 697 of 1199 downloaded from cache
819.99 s
Built paperless-ngx-tiktoken-cache in 5.9s
819.99 s
[unit-cloudflared-tunnel-b33ec739-7324-4c6f-b6fa-daedbe0828c8.service] structuredAttrs is enabled
819.99 s
[unit-comin.service] structuredAttrs is enabled
819.99 s
Downloading cached imagemagick-7.1.2 from https://cache.nix-ci.com
819.99 s
Downloading cached immich-geodata from https://cache.nix-ci.com
819.99 s
Downloading cached indexmap from https://cache.nix-ci.com
819.99 s
Downloading cached inheritCargoArtifactsHook from https://cache.nix-ci.com
819.99 s
Downloading cached installCargoArtifactsHook from https://cache.nix-ci.com
819.99 s
Downloading cached installFromCargoBuildLogHook from https://cache.nix-ci.com
819.99 s
Downloading cached iotop from https://cache.nix-ci.com
819.99 s
Downloading cached ipset from https://cache.nix-ci.com
819.99 s
Downloading cached ipvsadm from https://cache.nix-ci.com
819.99 s
Downloading cached itoa from https://cache.nix-ci.com
819.99 s
Downloading cached jellyfin-ffmpeg-8.1.2-5-data from https://cache.nix-ci.com
819.99 s
Downloading cached jellyfin-web from https://cache.nix-ci.com
819.99 s
Downloading cached jq-1.8.2-dev from https://cache.nix-ci.com
819.99 s
Downloading cached k3s-bin from https://cache.nix-ci.com
819.99 s
Downloading cached k3s-cni-plugins-1.9.1-k3s1 from https://cache.nix-ci.com
819.99 s
Downloading cached k3s-containerd-2.3.4-k3s1.36 from https://cache.nix-ci.com
820.00 s
Downloaded cached inheritCargoArtifactsHook (5944 B) in 7ms
820.00 s
Downloaded cached installFromCargoBuildLogHook (4472 B) in 9ms
820.00 s
Downloaded cached installCargoArtifactsHook (4624 B) in 10ms
820.02 s
Downloaded cached indexmap (530 KiB) in 30ms
820.02 s
Downloaded cached ipvsadm (96 KiB) in 31ms
820.03 s
Downloaded cached ipset (319 KiB) in 33ms
820.03 s
Downloaded cached jq-1.8.2-dev (14 KiB) in 36ms
820.03 s
Downloaded cached jellyfin-ffmpeg-8.1.2-5-data (272 KiB) in 42ms
820.04 s
Downloaded cached itoa (53 KiB) in 47ms
820.05 s
Downloaded cached iotop (256 KiB) in 55ms
820.05 s
Building /nix/store/zgxmh92ii8f6bvffajid78425ma2j5ns-grub-2.14_fish-completions.drv
820.10 s
Building /nix/store/k5x6mjpchvxs3fy83rihh54s5pg96jbp-unit-comin-ci-gate.service.drv
820.10 s
Progress: 213 of 695 built (8 building), 698 of 1199 downloaded from cache (15 downloading)
820.10 s
Progress: 213 of 695 built (8 building), 699 of 1199 downloaded from cache (14 downloading)
820.10 s
Progress: 213 of 695 built (8 building), 700 of 1199 downloaded from cache (13 downloading)
820.10 s
Progress: 213 of 695 built (8 building), 701 of 1199 downloaded from cache (12 downloading)
820.10 s
Progress: 213 of 695 built (8 building), 702 of 1199 downloaded from cache (11 downloading)
820.10 s
Progress: 213 of 695 built (8 building), 703 of 1199 downloaded from cache (10 downloading)
820.10 s
Progress: 213 of 695 built (8 building), 704 of 1199 downloaded from cache (9 downloading)
820.10 s
Progress: 213 of 695 built (8 building), 705 of 1199 downloaded from cache (8 downloading)
820.10 s
Progress: 213 of 695 built (8 building), 706 of 1199 downloaded from cache (7 downloading)
820.10 s
Progress: 213 of 695 built (8 building), 707 of 1199 downloaded from cache (6 downloading)
820.13 s
[cargo-package-zmij:post-build] Uploading to the NixCI cache: /nix/store/3is6l3smjhc0i2m9fd3j4h1h150jjq5j-cargo-package-zmij-1.0.21
820.14 s
Downloaded cached k3s-cni-plugins-1.9.1-k3s1 (5.4 MiB) in 143ms
820.18 s
Downloaded cached imagemagick-7.1.2 (8.3 MiB) in 186ms
820.18 s
[cargo-package-zmij:post-build] warning: 'warn-short-path-literals' is deprecated, use 'lint-short-path-literals = ignore' instead
820.19 s
[cargo-package-zmij:post-build] copying 1 paths...
820.19 s
[cargo-package-zmij:post-build] copying path '/nix/store/3is6l3smjhc0i2m9fd3j4h1h150jjq5j-cargo-package-zmij-1.0.21' to 'https://cache.nix-ci.com'...
820.25 s
Downloaded cached k3s-containerd-2.3.4-k3s1.36 (15.7 MiB) in 255ms
820.31 s
[cargo-package-zmij:post-build] warning: 'warn-short-path-literals' is deprecated, use 'lint-short-path-literals = ignore' instead
820.49 s
[cargo-package-zmij:post-build] copying 2 paths...
820.49 s
[cargo-package-zmij:post-build] copying path '/nix/store/zan0phhcp9g5m2rdrwbc2p53zmm2kcwz-cargo-src-zmij-1.0.21.drv' to 'https://cache.nix-ci.com'...
820.62 s
[cargo-package-zmij:post-build] copying path '/nix/store/ddq6bn4bhvpkb9844nrjrv2hzxdqci26-cargo-package-zmij-1.0.21.drv' to 'https://cache.nix-ci.com'...
820.66 s
Downloaded cached immich-geodata (54.1 MiB) in 664ms
820.76 s
Uploaded cargo-package-zmij in 653ms
820.76 s
Progress: 214 of 696 built (7 building), 707 of 1199 downloaded from cache (6 downloading)
820.76 s
Built cargo-package-zmij in 13.2s
820.80 s
[cargo-package-zstd-safe:post-build] Uploading to the NixCI cache: /nix/store/3mhbsnsnk7d4ds26ggrns4lphlfl3f1v-cargo-package-zstd-safe-7.2.4
820.85 s
[cargo-package-zstd-safe:post-build] warning: 'warn-short-path-literals' is deprecated, use 'lint-short-path-literals = ignore' instead
820.85 s
[cargo-package-zstd-safe:post-build] copying 1 paths...
820.86 s
[cargo-package-zstd-safe:post-build] copying path '/nix/store/3mhbsnsnk7d4ds26ggrns4lphlfl3f1v-cargo-package-zstd-safe-7.2.4' to 'https://cache.nix-ci.com'...
820.90 s
Downloaded cached jellyfin-web (55.6 MiB) in 903ms
820.97 s
[cargo-package-zstd-safe:post-build] warning: 'warn-short-path-literals' is deprecated, use 'lint-short-path-literals = ignore' instead
821.15 s
[cargo-package-zstd-safe:post-build] copying 2 paths...
821.15 s
[cargo-package-zstd-safe:post-build] copying path '/nix/store/5dx0aanhlk1rsnn3rwmkl64y6ywqmly7-cargo-src-zstd-safe-7.2.4.drv' to 'https://cache.nix-ci.com'...
821.30 s
[cargo-package-zstd-safe:post-build] copying path '/nix/store/08pcl8vdjqx9hm94hjsm7vw5kmf6kckh-cargo-package-zstd-safe-7.2.4.drv' to 'https://cache.nix-ci.com'...
821.43 s
Downloaded cached k3s-bin (309.2 MiB) in 1.4s
821.44 s
Uploaded cargo-package-zstd-safe in 665ms
821.44 s
Progress: 215 of 697 built (6 building), 707 of 1199 downloaded from cache (6 downloading)
821.44 s
Built cargo-package-zstd-safe in 13.9s
821.48 s
[cargo-package-zstd-sys:post-build] Uploading to the NixCI cache: /nix/store/g7d5nibzammh53xv0b4k4y7p5br7433i-cargo-package-zstd-sys-2.0.16+zstd.1.5.7
821.52 s
[cargo-package-zstd-sys:post-build] warning: 'warn-short-path-literals' is deprecated, use 'lint-short-path-literals = ignore' instead
821.53 s
[cargo-package-zstd-sys:post-build] copying 1 paths...
821.53 s
[cargo-package-zstd-sys:post-build] copying path '/nix/store/g7d5nibzammh53xv0b4k4y7p5br7433i-cargo-package-zstd-sys-2.0.16+zstd.1.5.7' to 'https://cache.nix-ci.com'...
822.20 s
[cargo-package-zstd-sys:post-build] warning: 'warn-short-path-literals' is deprecated, use 'lint-short-path-literals = ignore' instead
822.38 s
[cargo-package-zstd-sys:post-build] copying 2 paths...
822.38 s
[cargo-package-zstd-sys:post-build] copying path '/nix/store/hl4mzd2jnrhgpl7z0km11946zq87s98w-cargo-src-zstd-sys-2.0.16+zstd.1.5.7.drv' to 'https://cache.nix-ci.com'...
822.50 s
[cargo-package-zstd-sys:post-build] copying path '/nix/store/0kmvxj8shdy0yxf9wpys5j4dsf0rc6mw-cargo-package-zstd-sys-2.0.16+zstd.1.5.7.drv' to 'https://cache.nix-ci.com'...
822.64 s
Uploaded cargo-package-zstd-sys in 1.1s
822.64 s
Progress: 216 of 698 built (5 building), 707 of 1199 downloaded from cache (6 downloading)
822.64 s
Built cargo-package-zstd-sys in 8.6s
822.67 s
[unit-cloudflared-tunnel-b33ec739-7324-4c6f-b6fa-daedbe0828c8.service:post-build] Uploading to the NixCI cache: /nix/store/syi18pwvsh88drfwnsjiqalsjyhmx3v6-unit-cloudflared-tunnel-b33ec739-7324-4c6f-b6fa-daedbe0828c8.service
822.71 s
[unit-cloudflared-tunnel-b33ec739-7324-4c6f-b6fa-daedbe0828c8.service:post-build] warning: 'warn-short-path-literals' is deprecated, use 'lint-short-path-literals = ignore' instead
822.74 s
[unit-cloudflared-tunnel-b33ec739-7324-4c6f-b6fa-daedbe0828c8.service:post-build] copying 0 paths...
822.78 s
[unit-cloudflared-tunnel-b33ec739-7324-4c6f-b6fa-daedbe0828c8.service:post-build] warning: 'warn-short-path-literals' is deprecated, use 'lint-short-path-literals = ignore' instead
822.91 s
[unit-cloudflared-tunnel-b33ec739-7324-4c6f-b6fa-daedbe0828c8.service:post-build] copying 0 paths...
822.93 s
Uploaded unit-cloudflared-tunnel-b33ec739-7324-4c6f-b6fa-daedbe0828c8.service in 281ms
822.93 s
Progress: 217 of 699 built (4 building), 707 of 1199 downloaded from cache (6 downloading)
822.93 s
Built unit-cloudflared-tunnel-b33ec739-7324-4c6f-b6fa-daedbe0828c8.service in 8.7s
822.96 s
[unit-comin.service:post-build] Uploading to the NixCI cache: /nix/store/5rkw18ifhis8xlvyhfr1vazmdqag5g5z-unit-comin.service
823.00 s
[unit-comin.service:post-build] warning: 'warn-short-path-literals' is deprecated, use 'lint-short-path-literals = ignore' instead
823.14 s
[unit-comin.service:post-build] copying 1 paths...
823.14 s
[unit-comin.service:post-build] copying path '/nix/store/5rkw18ifhis8xlvyhfr1vazmdqag5g5z-unit-comin.service' to 'https://cache.nix-ci.com'...
823.34 s
[unit-comin.service:post-build] warning: 'warn-short-path-literals' is deprecated, use 'lint-short-path-literals = ignore' instead
823.58 s
[unit-comin.service:post-build] copying 1 paths...
823.58 s
[unit-comin.service:post-build] copying path '/nix/store/f76990ifiwm3k4vwc78m9v53bkm6gfcv-unit-comin.service.drv' to 'https://cache.nix-ci.com'...
823.73 s
Uploaded unit-comin.service in 792ms
823.73 s
Progress: 218 of 700 built (3 building), 707 of 1199 downloaded from cache (6 downloading)
823.73 s
Built unit-comin.service in 9.5s
823.73 s
[unit-vault-agent-default.service] structuredAttrs is enabled
823.73 s
Downloading cached config.fish from https://cache.nix-ci.com
823.74 s
Downloading cached dotnet-aspnetcore-runtime-wrapped from https://cache.nix-ci.com
823.74 s
Downloading cached fc-00-nixos-cache.conf from https://cache.nix-ci.com
823.74 s
Downloading cached htop-3.5.3-fish-completions from https://cache.nix-ci.com
823.74 s
Downloading cached krb5-1.22.2-dev from https://cache.nix-ci.com
823.74 s
Downloading cached kubectl from https://cache.nix-ci.com
823.74 s
Downloading cached kubernetes-helm from https://cache.nix-ci.com
823.74 s
Downloading cached kvazaar-2.3.2-lib from https://cache.nix-ci.com
823.74 s
Downloading cached lcevcdec-4.2.2-lib from https://cache.nix-ci.com
823.74 s
Downloading cached leptonica from https://cache.nix-ci.com
823.74 s
Downloaded cached config.fish (2048 B) in 7ms
823.74 s
Downloaded cached htop-3.5.3-fish-completions (1752 B) in 7ms
823.75 s
Downloaded cached fc-00-nixos-cache.conf (368 B) in 17ms
823.76 s
Downloaded cached dotnet-aspnetcore-runtime-wrapped (4344 B) in 21ms
823.76 s
Downloaded cached krb5-1.22.2-dev (748 KiB) in 23ms
823.76 s
Downloaded cached kvazaar-2.3.2-lib (785 KiB) in 23ms
823.77 s
Downloaded cached lcevcdec-4.2.2-lib (624 KiB) in 29ms
823.82 s
Building /nix/store/5p2zi5ikmyhf31snfxwkzv8lzjbkg285-ipvsadm-1.31_fish-completions.drv
823.90 s
Building /nix/store/lh6h8x8rkwi76m8jvdpw018hw7wx386v-vendor-registry.drv
823.94 s
Building /nix/store/n1z0app69qs8rk90s10srd3kcdjs0y23-zot-config.json.drv
823.94 s
Progress: 218 of 687 built (6 building), 708 of 1199 downloaded from cache (15 downloading)
823.94 s
Progress: 218 of 687 built (6 building), 709 of 1199 downloaded from cache (14 downloading)
823.94 s
Progress: 218 of 687 built (6 building), 710 of 1199 downloaded from cache (13 downloading)
823.94 s
Progress: 218 of 687 built (6 building), 711 of 1199 downloaded from cache (12 downloading)
823.94 s
Progress: 218 of 687 built (6 building), 712 of 1199 downloaded from cache (11 downloading)
823.94 s
Progress: 218 of 687 built (6 building), 713 of 1199 downloaded from cache (10 downloading)
823.94 s
Progress: 218 of 687 built (6 building), 714 of 1199 downloaded from cache (9 downloading)
823.94 s
Progress: 218 of 687 built (6 building), 715 of 1199 downloaded from cache (8 downloading)
823.94 s
Progress: 218 of 687 built (6 building), 716 of 1199 downloaded from cache (7 downloading)
823.94 s
Progress: 218 of 687 built (6 building), 717 of 1199 downloaded from cache (6 downloading)
823.94 s
Progress: 218 of 687 built (6 building), 718 of 1199 downloaded from cache (5 downloading)
823.94 s
Progress: 218 of 687 built (6 building), 719 of 1199 downloaded from cache (4 downloading)
823.94 s
Progress: 218 of 687 built (6 building), 720 of 1199 downloaded from cache (3 downloading)
823.98 s
[grub-2.14_fish-completions:post-build] Uploading to the NixCI cache: /nix/store/l8cn6hrqy4did95vvzxdpqamg5j6ajs3-grub-2.14_fish-completions
824.00 s
Downloaded cached leptonica (4 MiB) in 266ms
824.03 s
[grub-2.14_fish-completions:post-build] warning: 'warn-short-path-literals' is deprecated, use 'lint-short-path-literals = ignore' instead
824.06 s
[grub-2.14_fish-completions:post-build] copying 0 paths...
824.07 s
Downloaded cached kubectl (59.1 MiB) in 337ms
824.13 s
[grub-2.14_fish-completions:post-build] warning: 'warn-short-path-literals' is deprecated, use 'lint-short-path-literals = ignore' instead
824.13 s
Downloaded cached kubernetes-helm (81.8 MiB) in 399ms
824.23 s
[grub-2.14_fish-completions:post-build] copying 0 paths...
824.25 s
Uploaded grub-2.14_fish-completions in 297ms
824.25 s
Progress: 219 of 688 built (5 building), 720 of 1199 downloaded from cache (3 downloading)
824.25 s
Built grub-2.14_fish-completions in 4.1s
824.25 s
[unit-comin-ci-gate.service] structuredAttrs is enabled
824.28 s
[unit-vault-agent-default.service:post-build] Uploading to the NixCI cache: /nix/store/qdm2a27xgabd5rrvjfr72fkm5a64qz8m-unit-vault-agent-default.service
824.32 s
[unit-vault-agent-default.service:post-build] warning: 'warn-short-path-literals' is deprecated, use 'lint-short-path-literals = ignore' instead
824.45 s
[unit-vault-agent-default.service:post-build] copying 1 paths...
824.45 s
[unit-vault-agent-default.service:post-build] copying path '/nix/store/qdm2a27xgabd5rrvjfr72fkm5a64qz8m-unit-vault-agent-default.service' to 'https://cache.nix-ci.com'...
824.63 s
[unit-vault-agent-default.service:post-build] warning: 'warn-short-path-literals' is deprecated, use 'lint-short-path-literals = ignore' instead
824.90 s
[unit-vault-agent-default.service:post-build] copying 1 paths...
824.91 s
[unit-vault-agent-default.service:post-build] copying path '/nix/store/r1km9jwy4qrc88wwnfl4rw3img1qa87x-unit-vault-agent-default.service.drv' to 'https://cache.nix-ci.com'...
825.06 s
Uploaded unit-vault-agent-default.service in 807ms
825.06 s
Progress: 220 of 689 built (4 building), 720 of 1199 downloaded from cache (3 downloading)
825.06 s
Built unit-vault-agent-default.service in 10.7s
825.07 s
Downloading cached iotop-0.6-fish-completions from https://cache.nix-ci.com
825.07 s
Downloading cached libarchive-3.8.9-dev from https://cache.nix-ci.com
825.07 s
Downloading cached libaribcaption from https://cache.nix-ci.com
825.07 s
Downloading cached libidn2-2.3.8-bin from https://cache.nix-ci.com
825.07 s
Downloading cached libilbc from https://cache.nix-ci.com
825.07 s
Downloading cached libkrunfw from https://cache.nix-ci.com
825.07 s
Downloading cached libmnl-1.0.5-dev from https://cache.nix-ci.com
825.07 s
Downloading cached libnet from https://cache.nix-ci.com
825.07 s
Downloading cached libnetfilter_cthelper from https://cache.nix-ci.com
825.07 s
Downloading cached libnetfilter_cttimeout from https://cache.nix-ci.com
825.07 s
Downloading cached libnetfilter_queue from https://cache.nix-ci.com
825.07 s
Downloading cached libnl-3.12.0-bin from https://cache.nix-ci.com
825.07 s
Downloading cached libpsl-0.21.5-dev from https://cache.nix-ci.com
825.07 s
Progress: 220 of 687 built (4 building), 721 of 1199 downloaded from cache (15 downloading)
825.07 s
Progress: 220 of 687 built (4 building), 722 of 1199 downloaded from cache (14 downloading)
825.07 s
Progress: 220 of 687 built (4 building), 723 of 1199 downloaded from cache (13 downloading)
825.07 s
Downloaded cached iotop-0.6-fish-completions (1712 B) in 7ms
825.09 s
Downloaded cached libilbc (129 KiB) in 24ms
825.09 s
Downloaded cached libnetfilter_cthelper (28 KiB) in 24ms
825.09 s
Downloaded cached libnet (168 KiB) in 25ms
825.09 s
Downloaded cached libarchive-3.8.9-dev (91 KiB) in 26ms
825.09 s
Downloaded cached libnetfilter_cttimeout (27 KiB) in 26ms
825.09 s
Downloaded cached libpsl-0.21.5-dev (7800 B) in 26ms
825.09 s
Downloaded cached libmnl-1.0.5-dev (10112 B) in 27ms
825.09 s
Downloaded cached libidn2-2.3.8-bin (37 KiB) in 28ms
825.10 s
Downloaded cached libnetfilter_queue (59 KiB) in 27ms
825.10 s
Downloaded cached libaribcaption (427 KiB) in 29ms
825.10 s
Downloaded cached libnl-3.12.0-bin (902 KiB) in 32ms
825.10 s
[ipvsadm-1.31_fish-completions:post-build] Uploading to the NixCI cache: /nix/store/c3cnca439xpgvpj634q836nalr7x6v32-ipvsadm-1.31_fish-completions
825.15 s
[ipvsadm-1.31_fish-completions:post-build] warning: 'warn-short-path-literals' is deprecated, use 'lint-short-path-literals = ignore' instead
825.17 s
Downloaded cached libkrunfw (22.4 MiB) in 99ms
825.18 s
[ipvsadm-1.31_fish-completions:post-build] copying 0 paths...
825.23 s
[ipvsadm-1.31_fish-completions:post-build] warning: 'warn-short-path-literals' is deprecated, use 'lint-short-path-literals = ignore' instead
825.31 s
[ipvsadm-1.31_fish-completions:post-build] copying 0 paths...
825.32 s
Uploaded ipvsadm-1.31_fish-completions in 245ms
825.32 s
Progress: 221 of 688 built (3 building), 723 of 1199 downloaded from cache (13 downloading)
825.32 s
Built ipvsadm-1.31_fish-completions in 1.5s
825.35 s
[unit-comin-ci-gate.service:post-build] Uploading to the NixCI cache: /nix/store/d462449zxy9ffhznz8h00js35b4wx8lk-unit-comin-ci-gate.service
825.39 s
[unit-comin-ci-gate.service:post-build] warning: 'warn-short-path-literals' is deprecated, use 'lint-short-path-literals = ignore' instead
825.55 s
[unit-comin-ci-gate.service:post-build] copying 1 paths...
825.55 s
[unit-comin-ci-gate.service:post-build] copying path '/nix/store/d462449zxy9ffhznz8h00js35b4wx8lk-unit-comin-ci-gate.service' to 'https://cache.nix-ci.com'...
825.74 s
[unit-comin-ci-gate.service:post-build] warning: 'warn-short-path-literals' is deprecated, use 'lint-short-path-literals = ignore' instead
825.97 s
[unit-comin-ci-gate.service:post-build] copying 1 paths...
825.97 s
[unit-comin-ci-gate.service:post-build] copying path '/nix/store/k5x6mjpchvxs3fy83rihh54s5pg96jbp-unit-comin-ci-gate.service.drv' to 'https://cache.nix-ci.com'...
826.11 s
Uploaded unit-comin-ci-gate.service in 781ms
826.11 s
Progress: 222 of 689 built (2 building), 723 of 1199 downloaded from cache (13 downloading)
826.11 s
Built unit-comin-ci-gate.service in 6.0s
826.20 s
[vendor-registry:post-build] Uploading to the NixCI cache: /nix/store/3xpj5r1n245bq09xha9yh5abb9sahbqi-vendor-registry
826.24 s
[vendor-registry:post-build] warning: 'warn-short-path-literals' is deprecated, use 'lint-short-path-literals = ignore' instead
826.39 s
[vendor-registry:post-build] copying 1 paths...
826.39 s
[vendor-registry:post-build] copying path '/nix/store/3xpj5r1n245bq09xha9yh5abb9sahbqi-vendor-registry' to 'https://cache.nix-ci.com'...
826.60 s
[vendor-registry:post-build] warning: 'warn-short-path-literals' is deprecated, use 'lint-short-path-literals = ignore' instead
827.05 s
[vendor-registry:post-build] copying 3 paths...
827.05 s
[vendor-registry:post-build] copying path '/nix/store/pa2g5iv18r68ambxbxzysk6szpf99bf3-cargo-src-windows_aarch64_gnullvm-0.53.1.drv' to 'https://cache.nix-ci.com'...
827.19 s
[vendor-registry:post-build] copying path '/nix/store/cjzpvzqir1qmbx53n12d7y43xip1v67j-cargo-package-windows_aarch64_gnullvm-0.53.1.drv' to 'https://cache.nix-ci.com'...
827.32 s
[vendor-registry:post-build] copying path '/nix/store/lh6h8x8rkwi76m8jvdpw018hw7wx386v-vendor-registry.drv' to 'https://cache.nix-ci.com'...
827.49 s
Uploaded vendor-registry in 1.3s
827.49 s
Progress: 223 of 690 built (1 building), 723 of 1199 downloaded from cache (13 downloading)
827.49 s
Built vendor-registry in 3.5s
827.49 s
[zot-config.json] structuredAttrs is enabled
827.49 s
Downloading cached fontconfig-conf from https://cache.nix-ci.com
827.49 s
Downloading cached libssh2-1.11.1-dev from https://cache.nix-ci.com
827.49 s
Downloading cached man-cache from https://cache.nix-ci.com
827.50 s
Downloaded cached man-cache (85 KiB) in 6ms
827.50 s
Downloaded cached libssh2-1.11.1-dev (83 KiB) in 13ms
827.50 s
Downloaded cached fontconfig-conf (9464 B) in 14ms
827.55 s
Building /nix/store/6gbnh6vlqhv8251xzx0agd9av62ss2sa-k3s-drain.drv
827.59 s
Building /nix/store/y2vsqbrqwkkifrr584b7qg8nkzrq2qbn-kubectl-1.37.1_fish-completions.drv
827.63 s
Building /nix/store/a48zspjg4f1yhpdk4la3sz89mvx9pay9-kubernetes-helm-4.3.0_fish-completions.drv
827.67 s
Building /nix/store/1f81r9aifl4nagxkzylq1yrj8mpnhrmx-unit-k3s-coredns-ha.service.drv
827.71 s
Building /nix/store/b26qlxzx7dlyxi6296xhj6qi6adw068j-unit-script-k3s-auto-uncordon-start.drv
827.77 s
Building /nix/store/qjanfd03q9awlzwh7v4nrmp09y8s1r7c-vendor-cargo-deps.drv
827.77 s
Progress: 223 of 685 built (7 building), 724 of 1199 downloaded from cache (15 downloading)
827.78 s
Progress: 223 of 685 built (7 building), 725 of 1199 downloaded from cache (14 downloading)
827.78 s
Progress: 223 of 685 built (7 building), 726 of 1199 downloaded from cache (13 downloading)
827.78 s
Progress: 223 of 685 built (7 building), 727 of 1199 downloaded from cache (12 downloading)
827.78 s
Progress: 223 of 685 built (7 building), 728 of 1199 downloaded from cache (11 downloading)
827.78 s
Progress: 223 of 685 built (7 building), 729 of 1199 downloaded from cache (10 downloading)
827.78 s
Progress: 223 of 685 built (7 building), 730 of 1199 downloaded from cache (9 downloading)
827.78 s
Progress: 223 of 685 built (7 building), 731 of 1199 downloaded from cache (8 downloading)
827.78 s
Progress: 223 of 685 built (7 building), 732 of 1199 downloaded from cache (7 downloading)
827.78 s
Progress: 223 of 685 built (7 building), 733 of 1199 downloaded from cache (6 downloading)
827.78 s
Progress: 223 of 685 built (7 building), 734 of 1199 downloaded from cache (5 downloading)
827.78 s
Progress: 223 of 685 built (7 building), 735 of 1199 downloaded from cache (4 downloading)
827.78 s
Progress: 223 of 685 built (7 building), 736 of 1199 downloaded from cache (3 downloading)
827.78 s
Progress: 223 of 685 built (7 building), 737 of 1199 downloaded from cache (2 downloading)
827.78 s
Progress: 223 of 685 built (7 building), 738 of 1199 downloaded from cache (1 downloading)
827.78 s
Progress: 223 of 685 built (7 building), 739 of 1199 downloaded from cache
827.78 s
[k3s-drain] structuredAttrs is enabled
827.81 s
[kubectl-1.37.1_fish-completions:post-build] Uploading to the NixCI cache: /nix/store/538lzc8ki5fnnmycrpvs5mqjw3wqp57y-kubectl-1.37.1_fish-completions
827.85 s
[kubectl-1.37.1_fish-completions:post-build] warning: 'warn-short-path-literals' is deprecated, use 'lint-short-path-literals = ignore' instead
827.87 s
[kubectl-1.37.1_fish-completions:post-build] copying 0 paths...
827.91 s
[kubectl-1.37.1_fish-completions:post-build] warning: 'warn-short-path-literals' is deprecated, use 'lint-short-path-literals = ignore' instead
827.99 s
[kubectl-1.37.1_fish-completions:post-build] copying 0 paths...
828.00 s
Uploaded kubectl-1.37.1_fish-completions in 220ms
828.00 s
Progress: 224 of 686 built (6 building), 739 of 1199 downloaded from cache
828.00 s
Built kubectl-1.37.1_fish-completions in 416ms
828.03 s
[kubernetes-helm-4.3.0_fish-completions:post-build] Uploading to the NixCI cache: /nix/store/3ycnjfwgyx67c60c4vz0qmslv1psl0h7-kubernetes-helm-4.3.0_fish-completions
828.07 s
[kubernetes-helm-4.3.0_fish-completions:post-build] warning: 'warn-short-path-literals' is deprecated, use 'lint-short-path-literals = ignore' instead
828.15 s
[kubernetes-helm-4.3.0_fish-completions:post-build] copying 0 paths...
828.20 s
[kubernetes-helm-4.3.0_fish-completions:post-build] warning: 'warn-short-path-literals' is deprecated, use 'lint-short-path-literals = ignore' instead
828.28 s
[kubernetes-helm-4.3.0_fish-completions:post-build] copying 0 paths...
828.29 s
Uploaded kubernetes-helm-4.3.0_fish-completions in 283ms
828.29 s
Progress: 225 of 687 built (5 building), 739 of 1199 downloaded from cache
828.29 s
Built kubernetes-helm-4.3.0_fish-completions in 666ms
828.29 s
[unit-k3s-coredns-ha.service] structuredAttrs is enabled
828.29 s
[unit-script-k3s-auto-uncordon-start] structuredAttrs is enabled
828.32 s
[zot-config.json:post-build] Uploading to the NixCI cache: /nix/store/ijpq8p3szc0q9crn2kqsc2wlnfc1qxxp-zot-config.json
828.36 s
[zot-config.json:post-build] warning: 'warn-short-path-literals' is deprecated, use 'lint-short-path-literals = ignore' instead
828.37 s
[zot-config.json:post-build] copying 1 paths...
828.37 s
[zot-config.json:post-build] copying path '/nix/store/ijpq8p3szc0q9crn2kqsc2wlnfc1qxxp-zot-config.json' to 'https://cache.nix-ci.com'...
828.45 s
[zot-config.json:post-build] warning: 'warn-short-path-literals' is deprecated, use 'lint-short-path-literals = ignore' instead
828.61 s
[zot-config.json:post-build] copying 1 paths...
828.61 s
[zot-config.json:post-build] copying path '/nix/store/n1z0app69qs8rk90s10srd3kcdjs0y23-zot-config.json.drv' to 'https://cache.nix-ci.com'...
828.74 s
Uploaded zot-config.json in 443ms
828.74 s
Progress: 226 of 688 built (4 building), 739 of 1199 downloaded from cache
828.74 s
Built zot-config.json in 4.8s
828.74 s
Downloading cached jbig2enc from https://cache.nix-ci.com
828.75 s
Downloading cached memchr from https://cache.nix-ci.com
828.75 s
Downloading cached mergerfs from https://cache.nix-ci.com
828.75 s
Downloading cached meson from https://cache.nix-ci.com
828.75 s
Downloading cached mimalloc from https://cache.nix-ci.com
828.75 s
Downloading cached ncdu from https://cache.nix-ci.com
828.75 s
Downloading cached net-snmp-5.9.5.2-bin from https://cache.nix-ci.com
828.75 s
Downloading cached netavark from https://cache.nix-ci.com
828.75 s
Downloading cached nginx-config-formatter from https://cache.nix-ci.com
828.75 s
Downloading cached ninja from https://cache.nix-ci.com
828.75 s
Downloading cached nix-perl from https://cache.nix-ci.com
828.75 s
Downloading cached nix-util from https://cache.nix-ci.com
828.75 s
Downloading cached nix-util from https://cache.nix-ci.com
828.75 s
Downloading cached nix-util-c from https://cache.nix-ci.com
828.75 s
Downloading cached nix-wallpaper-simple-dark-gray_bootloader.png from https://cache.nix-ci.com
828.75 s
Downloading cached nlohmann_json from https://cache.nix-ci.com
828.77 s
Downloaded cached jbig2enc (170 KiB) in 27ms
828.78 s
Downloaded cached nix-wallpaper-simple-dark-gray_bootloader.png (9176 B) in 30ms
828.78 s
Downloaded cached ninja (583 KiB) in 36ms
828.79 s
Downloaded cached mergerfs (1.7 MiB) in 45ms
828.80 s
Downloaded cached nix-perl (214 KiB) in 55ms
828.80 s
Building /nix/store/3299r9ddpjmajc8c54iy7fc8qag4cl1c-etc-containers-systemd-zot.container.drv
828.81 s
Downloaded cached nlohmann_json (970 KiB) in 62ms
828.81 s
Downloaded cached memchr (585 KiB) in 63ms
828.81 s
Downloaded cached ncdu (828 KiB) in 64ms
828.81 s
Downloaded cached mimalloc (1 MiB) in 66ms
828.83 s
Downloaded cached net-snmp-5.9.5.2-bin (821 KiB) in 80ms
828.83 s
Downloaded cached nginx-config-formatter (17 KiB) in 81ms
828.83 s
Downloaded cached nix-util-c (105 KiB) in 81ms
828.84 s
Downloaded cached nix-util (2 MiB) in 92ms
828.84 s
Downloaded cached nix-util (2.6 MiB) in 97ms
828.85 s
Building /nix/store/s97s2f8kbj1ydp35v9iis0kx4kwrhnxw-fontconfig-etc.drv
828.86 s
Progress: 226 of 683 built (6 building), 740 of 1199 downloaded from cache (15 downloading)
828.86 s
Progress: 226 of 683 built (6 building), 741 of 1199 downloaded from cache (14 downloading)
828.86 s
Progress: 226 of 683 built (6 building), 742 of 1199 downloaded from cache (13 downloading)
828.86 s
Progress: 226 of 683 built (6 building), 743 of 1199 downloaded from cache (12 downloading)
828.86 s
Progress: 226 of 683 built (6 building), 744 of 1199 downloaded from cache (11 downloading)
828.86 s
Progress: 226 of 683 built (6 building), 745 of 1199 downloaded from cache (10 downloading)
828.86 s
Progress: 226 of 683 built (6 building), 746 of 1199 downloaded from cache (9 downloading)
828.86 s
Progress: 226 of 683 built (6 building), 747 of 1199 downloaded from cache (8 downloading)
828.86 s
Progress: 226 of 683 built (6 building), 748 of 1199 downloaded from cache (7 downloading)
828.86 s
Progress: 226 of 683 built (6 building), 749 of 1199 downloaded from cache (6 downloading)
828.86 s
Progress: 226 of 683 built (6 building), 750 of 1199 downloaded from cache (5 downloading)
828.86 s
Progress: 226 of 683 built (6 building), 751 of 1199 downloaded from cache (4 downloading)
828.86 s
Progress: 226 of 683 built (6 building), 752 of 1199 downloaded from cache (3 downloading)
828.86 s
Progress: 226 of 683 built (6 building), 753 of 1199 downloaded from cache (2 downloading)
828.86 s
[etc-containers-systemd-zot.container] structuredAttrs is enabled
828.89 s
[k3s-drain:post-build] Uploading to the NixCI cache: /nix/store/vrvifinap3mdn74nd1n4112bwg9famg3-k3s-drain
828.89 s
Downloaded cached netavark (20.7 MiB) in 149ms
828.91 s
Downloaded cached meson (16.4 MiB) in 163ms
828.93 s
[k3s-drain:post-build] warning: 'warn-short-path-literals' is deprecated, use 'lint-short-path-literals = ignore' instead
828.96 s
[k3s-drain:post-build] copying 0 paths...
829.00 s
[k3s-drain:post-build] warning: 'warn-short-path-literals' is deprecated, use 'lint-short-path-literals = ignore' instead
829.06 s
[k3s-drain:post-build] copying 0 paths...
829.07 s
Uploaded k3s-drain in 206ms
829.07 s
Progress: 227 of 684 built (5 building), 753 of 1199 downloaded from cache (2 downloading)
829.07 s
Built k3s-drain in 1.5s
829.10 s
[unit-k3s-coredns-ha.service:post-build] Uploading to the NixCI cache: /nix/store/7yp572g7sh4gd36c39dr9k5469k8hm58-unit-k3s-coredns-ha.service
829.14 s
[unit-k3s-coredns-ha.service:post-build] warning: 'warn-short-path-literals' is deprecated, use 'lint-short-path-literals = ignore' instead
829.17 s
[unit-k3s-coredns-ha.service:post-build] copying 0 paths...
829.22 s
[unit-k3s-coredns-ha.service:post-build] warning: 'warn-short-path-literals' is deprecated, use 'lint-short-path-literals = ignore' instead
829.35 s
[unit-k3s-coredns-ha.service:post-build] copying 0 paths...
829.37 s
Uploaded unit-k3s-coredns-ha.service in 288ms
829.37 s
Progress: 228 of 685 built (4 building), 753 of 1199 downloaded from cache (2 downloading)
829.37 s
Built unit-k3s-coredns-ha.service in 1.7s
829.39 s
[unit-script-k3s-auto-uncordon-start:post-build] Uploading to the NixCI cache: /nix/store/11dgiclg24qlg877aw6gwrmmys0np3ff-unit-script-k3s-auto-uncordon-start
829.43 s
[unit-script-k3s-auto-uncordon-start:post-build] warning: 'warn-short-path-literals' is deprecated, use 'lint-short-path-literals = ignore' instead
829.46 s
[unit-script-k3s-auto-uncordon-start:post-build] copying 0 paths...
829.50 s
[unit-script-k3s-auto-uncordon-start:post-build] warning: 'warn-short-path-literals' is deprecated, use 'lint-short-path-literals = ignore' instead
829.56 s
[unit-script-k3s-auto-uncordon-start:post-build] copying 0 paths...
829.57 s
Uploaded unit-script-k3s-auto-uncordon-start in 198ms
829.57 s
Progress: 229 of 686 built (3 building), 753 of 1199 downloaded from cache (2 downloading)
829.57 s
Built unit-script-k3s-auto-uncordon-start in 1.8s
829.62 s
[vendor-cargo-deps:post-build] Uploading to the NixCI cache: /nix/store/2czmahfcansym00pmv6savk66w42np7c-vendor-cargo-deps
829.66 s
[vendor-cargo-deps:post-build] warning: 'warn-short-path-literals' is deprecated, use 'lint-short-path-literals = ignore' instead
829.80 s
[vendor-cargo-deps:post-build] copying 1 paths...
829.80 s
[vendor-cargo-deps:post-build] copying path '/nix/store/2czmahfcansym00pmv6savk66w42np7c-vendor-cargo-deps' to 'https://cache.nix-ci.com'...
829.98 s
[vendor-cargo-deps:post-build] warning: 'warn-short-path-literals' is deprecated, use 'lint-short-path-literals = ignore' instead
830.20 s
[vendor-cargo-deps:post-build] copying 1 paths...
830.20 s
[vendor-cargo-deps:post-build] copying path '/nix/store/qjanfd03q9awlzwh7v4nrmp09y8s1r7c-vendor-cargo-deps.drv' to 'https://cache.nix-ci.com'...
830.34 s
Uploaded vendor-cargo-deps in 738ms
830.34 s
Progress: 230 of 687 built (2 building), 753 of 1199 downloaded from cache (2 downloading)
830.34 s
Built vendor-cargo-deps in 2.5s
830.34 s
Downloading cached conntrack-tools from https://cache.nix-ci.com
830.34 s
Downloading cached criu from https://cache.nix-ci.com
830.34 s
Downloading cached hm_.manpath from https://cache.nix-ci.com
830.34 s
Downloading cached libidn2-2.3.8-dev from https://cache.nix-ci.com
830.34 s
Downloading cached libkrun from https://cache.nix-ci.com
830.34 s
Downloading cached libnl-3.12.0-dev from https://cache.nix-ci.com
830.35 s
Downloading cached node_exporter from https://cache.nix-ci.com
830.35 s
Downloading cached open-isns-0.103-lib from https://cache.nix-ci.com
830.35 s
Downloading cached opencv from https://cache.nix-ci.com
830.35 s
Downloading cached openssh-10.5p1-dev from https://cache.nix-ci.com
830.35 s
Downloading cached openssl from https://cache.nix-ci.com
830.35 s
Downloading cached optipng from https://cache.nix-ci.com
830.35 s
Downloading cached pam.d from https://cache.nix-ci.com
830.35 s
Downloading cached paperless-ngx-frontend from https://cache.nix-ci.com
830.35 s
Downloaded cached hm_.manpath (216 B) in 7ms
830.35 s
Downloaded cached pam.d (24 KiB) in 8ms
830.37 s
Downloaded cached libidn2-2.3.8-dev (15 KiB) in 23ms
830.37 s
Downloaded cached criu (2.5 MiB) in 26ms
830.37 s
Downloaded cached conntrack-tools (628 KiB) in 27ms
830.37 s
Downloaded cached openssh-10.5p1-dev (536 B) in 25ms
830.37 s
Downloaded cached optipng (103 KiB) in 28ms
830.38 s
Downloaded cached libnl-3.12.0-dev (326 KiB) in 31ms
830.38 s
Downloaded cached open-isns-0.103-lib (548 KiB) in 32ms
830.44 s
Building /nix/store/iapwxawdqf4zzc0rqk9l634p2ca14zgv-comin-auto-reboot.drv
830.45 s
Downloaded cached libkrun (5.1 MiB) in 101ms
830.50 s
Downloaded cached openssl (8.9 MiB) in 158ms
830.53 s
Building /nix/store/agv08ys2iqxm56a89xpr9mipggc01vfv-home-manager-path.drv
830.58 s
Building /nix/store/y05v9jfdqcp322515m81zqchhvkfhycp-mergerfs-2.42.0_fish-completions.drv
830.65 s
Building /nix/store/c02q0khwxxgy99319dr4pr347qhdljk7-unit-k3s-auto-uncordon.service.drv
830.69 s
Downloaded cached node_exporter (18.3 MiB) in 343ms
830.70 s
Building /nix/store/9134xaxw98iz0kfh20223n3r9qd9qb39-unit-k3s-graceful-drain.service.drv
830.70 s
Progress: 230 of 677 built (7 building), 754 of 1199 downloaded from cache (15 downloading)
830.70 s
Progress: 230 of 677 built (7 building), 755 of 1199 downloaded from cache (14 downloading)
830.70 s
Progress: 230 of 677 built (7 building), 756 of 1199 downloaded from cache (13 downloading)
830.70 s
Progress: 230 of 677 built (7 building), 757 of 1199 downloaded from cache (12 downloading)
830.70 s
Progress: 230 of 677 built (7 building), 758 of 1199 downloaded from cache (11 downloading)
830.70 s
Progress: 230 of 677 built (7 building), 759 of 1199 downloaded from cache (10 downloading)
830.70 s
Progress: 230 of 677 built (7 building), 760 of 1199 downloaded from cache (9 downloading)
830.70 s
Progress: 230 of 677 built (7 building), 761 of 1199 downloaded from cache (8 downloading)
830.70 s
Progress: 230 of 677 built (7 building), 762 of 1199 downloaded from cache (7 downloading)
830.70 s
Progress: 230 of 677 built (7 building), 763 of 1199 downloaded from cache (6 downloading)
830.70 s
Progress: 230 of 677 built (7 building), 764 of 1199 downloaded from cache (5 downloading)
830.70 s
Progress: 230 of 677 built (7 building), 765 of 1199 downloaded from cache (4 downloading)
830.70 s
Progress: 230 of 677 built (7 building), 766 of 1199 downloaded from cache (3 downloading)
830.71 s
Progress: 230 of 677 built (7 building), 767 of 1199 downloaded from cache (2 downloading)
830.71 s
[comin-auto-reboot] structuredAttrs is enabled
830.74 s
[etc-containers-systemd-zot.container:post-build] Uploading to the NixCI cache: /nix/store/2psp5jr0ll1rhif1znnsvvi75abfw4k3-etc-containers-systemd-zot.container
830.79 s
[etc-containers-systemd-zot.container:post-build] warning: 'warn-short-path-literals' is deprecated, use 'lint-short-path-literals = ignore' instead
830.94 s
[etc-containers-systemd-zot.container:post-build] copying 1 paths...
830.94 s
[etc-containers-systemd-zot.container:post-build] copying path '/nix/store/2psp5jr0ll1rhif1znnsvvi75abfw4k3-etc-containers-systemd-zot.container' to 'https://cache.nix-ci.com'...
831.00 s
Downloaded cached opencv (90.9 MiB) in 656ms
831.16 s
[etc-containers-systemd-zot.container:post-build] warning: 'warn-short-path-literals' is deprecated, use 'lint-short-path-literals = ignore' instead
831.34 s
[etc-containers-systemd-zot.container:post-build] copying 1 paths...
831.34 s
[etc-containers-systemd-zot.container:post-build] copying path '/nix/store/3299r9ddpjmajc8c54iy7fc8qag4cl1c-etc-containers-systemd-zot.container.drv' to 'https://cache.nix-ci.com'...
831.47 s
Downloaded cached paperless-ngx-frontend (242.2 MiB) in 1.1s
831.49 s
Uploaded etc-containers-systemd-zot.container in 774ms
831.49 s
Progress: 231 of 678 built (6 building), 767 of 1199 downloaded from cache (2 downloading)
831.49 s
Built etc-containers-systemd-zot.container in 2.6s
831.49 s
[fontconfig-etc] structuredAttrs is enabled
831.49 s
[fontconfig-etc] created 1 symlinks in user environment
831.49 s
[home-manager-path] structuredAttrs is enabled
831.49 s
[unit-k3s-auto-uncordon.service] structuredAttrs is enabled
831.49 s
Downloading cached home-manager-path from https://cache.nix-ci.com
831.49 s
Downloading cached mimalloc-3.5.3-dev from https://cache.nix-ci.com
831.49 s
Downloading cached ncdu-2.11.1-fish-completions from https://cache.nix-ci.com
831.49 s
Downloading cached net-snmp-5.9.5.2-dev from https://cache.nix-ci.com
831.49 s
Downloading cached nix-fetchers-c from https://cache.nix-ci.com
831.49 s
Downloading cached nix-main-c from https://cache.nix-ci.com
831.49 s
Downloading cached nix-store from https://cache.nix-ci.com
831.49 s
Downloading cached nix-store-c from https://cache.nix-ci.com
831.49 s
Downloading cached nix-util-2.34.8-dev from https://cache.nix-ci.com
831.49 s
Downloading cached nix-util-2.35.2-dev from https://cache.nix-ci.com
831.49 s
Downloading cached passt from https://cache.nix-ci.com
831.49 s
Downloading cached pdfium from https://cache.nix-ci.com
831.49 s
Downloading cached perl5.42.3-List-Compare from https://cache.nix-ci.com
831.49 s
Downloading cached nix-store from https://cache.nix-ci.com
831.50 s
Downloaded cached ncdu-2.11.1-fish-completions (4408 B) in 6ms
831.51 s
Downloaded cached nix-fetchers-c (66 KiB) in 24ms
831.51 s
Downloaded cached mimalloc-3.5.3-dev (76 KiB) in 25ms
831.52 s
Downloaded cached nix-main-c (16 KiB) in 28ms
831.52 s
Downloaded cached nix-store-c (254 KiB) in 26ms
831.52 s
Downloaded cached perl5.42.3-List-Compare (184 KiB) in 28ms
831.52 s
Downloaded cached passt (1 MiB) in 30ms
831.52 s
Downloaded cached nix-util-2.35.2-dev (370 KiB) in 30ms
831.52 s
Downloaded cached nix-util-2.34.8-dev (342 KiB) in 31ms
831.54 s
Downloaded cached net-snmp-5.9.5.2-dev (729 KiB) in 46ms
831.54 s
Building /nix/store/nfvwj1qga764xmmmibswg90xw74x4hyh-unit-prometheus-node-exporter.service.drv
831.55 s
Progress: 231 of 673 built (7 building), 768 of 1199 downloaded from cache (15 downloading)
831.55 s
Progress: 231 of 673 built (7 building), 769 of 1199 downloaded from cache (14 downloading)
831.55 s
Progress: 231 of 673 built (7 building), 770 of 1199 downloaded from cache (13 downloading)
831.55 s
Progress: 231 of 673 built (7 building), 771 of 1199 downloaded from cache (12 downloading)
831.55 s
Progress: 231 of 673 built (7 building), 772 of 1199 downloaded from cache (11 downloading)
831.55 s
Progress: 231 of 673 built (7 building), 773 of 1199 downloaded from cache (10 downloading)
831.55 s
Progress: 231 of 673 built (7 building), 774 of 1199 downloaded from cache (9 downloading)
831.55 s
Progress: 231 of 673 built (7 building), 775 of 1199 downloaded from cache (8 downloading)
831.55 s
Progress: 231 of 673 built (7 building), 776 of 1199 downloaded from cache (7 downloading)
831.55 s
Progress: 231 of 673 built (7 building), 777 of 1199 downloaded from cache (6 downloading)
831.55 s
Progress: 231 of 673 built (7 building), 778 of 1199 downloaded from cache (5 downloading)
831.55 s
Progress: 231 of 673 built (7 building), 779 of 1199 downloaded from cache (4 downloading)
831.55 s
Downloaded cached nix-store (5.1 MiB) in 59ms
831.57 s
Downloaded cached pdfium (4.8 MiB) in 81ms
831.58 s
Downloaded cached nix-store (6.8 MiB) in 83ms
831.58 s
[comin-auto-reboot:post-build] Uploading to the NixCI cache: /nix/store/96vyppv8l0pc5gaxnp1jcdl1krp8mmg8-comin-auto-reboot
831.62 s
[comin-auto-reboot:post-build] warning: 'warn-short-path-literals' is deprecated, use 'lint-short-path-literals = ignore' instead
831.65 s
[comin-auto-reboot:post-build] copying 0 paths...
831.69 s
[comin-auto-reboot:post-build] warning: 'warn-short-path-literals' is deprecated, use 'lint-short-path-literals = ignore' instead
831.82 s
[comin-auto-reboot:post-build] copying 0 paths...
831.84 s
Uploaded comin-auto-reboot in 287ms
831.84 s
Progress: 232 of 674 built (6 building), 779 of 1199 downloaded from cache (4 downloading)
831.84 s
Built comin-auto-reboot in 1.4s
831.87 s
[fontconfig-etc:post-build] Uploading to the NixCI cache: /nix/store/xc30mw81djclx9fgmranwih441i9w0hf-fontconfig-etc
831.91 s
[fontconfig-etc:post-build] warning: 'warn-short-path-literals' is deprecated, use 'lint-short-path-literals = ignore' instead
831.94 s
[fontconfig-etc:post-build] copying 0 paths...
831.99 s
[fontconfig-etc:post-build] warning: 'warn-short-path-literals' is deprecated, use 'lint-short-path-literals = ignore' instead
832.07 s
[fontconfig-etc:post-build] copying 0 paths...
832.09 s
Uploaded fontconfig-etc in 236ms
832.09 s
Progress: 233 of 675 built (5 building), 779 of 1199 downloaded from cache (4 downloading)
832.09 s
Built fontconfig-etc in 3.2s
832.09 s
[home-manager-path] created 860 symlinks in user environment
832.11 s
[mergerfs-2.42.0_fish-completions:post-build] Uploading to the NixCI cache: /nix/store/fkw8vg5b6lxx2y5sibzd0hrrw1maz9na-mergerfs-2.42.0_fish-completions
832.16 s
[mergerfs-2.42.0_fish-completions:post-build] warning: 'warn-short-path-literals' is deprecated, use 'lint-short-path-literals = ignore' instead
832.18 s
[mergerfs-2.42.0_fish-completions:post-build] copying 0 paths...
832.23 s
[mergerfs-2.42.0_fish-completions:post-build] warning: 'warn-short-path-literals' is deprecated, use 'lint-short-path-literals = ignore' instead
832.34 s
[mergerfs-2.42.0_fish-completions:post-build] copying 0 paths...
832.36 s
Uploaded mergerfs-2.42.0_fish-completions in 272ms
832.36 s
Progress: 234 of 676 built (4 building), 779 of 1199 downloaded from cache (4 downloading)
832.36 s
Built mergerfs-2.42.0_fish-completions in 1.7s
832.39 s
[unit-k3s-auto-uncordon.service:post-build] Uploading to the NixCI cache: /nix/store/m169rmvq6yrwg7877rvskrrv8y8d62rc-unit-k3s-auto-uncordon.service
832.43 s
[unit-k3s-auto-uncordon.service:post-build] warning: 'warn-short-path-literals' is deprecated, use 'lint-short-path-literals = ignore' instead
832.46 s
[unit-k3s-auto-uncordon.service:post-build] copying 0 paths...
832.51 s
[unit-k3s-auto-uncordon.service:post-build] warning: 'warn-short-path-literals' is deprecated, use 'lint-short-path-literals = ignore' instead
832.64 s
[unit-k3s-auto-uncordon.service:post-build] copying 0 paths...
832.66 s
Uploaded unit-k3s-auto-uncordon.service in 292ms
832.66 s
Progress: 235 of 677 built (3 building), 779 of 1199 downloaded from cache (4 downloading)
832.67 s
Built unit-k3s-auto-uncordon.service in 2.0s
832.67 s
[unit-k3s-graceful-drain.service] structuredAttrs is enabled
832.67 s
Downloading cached crun from https://cache.nix-ci.com
832.67 s
Downloading cached curl-8.22.0-dev from https://cache.nix-ci.com
832.67 s
Downloading cached open-iscsi from https://cache.nix-ci.com
832.67 s
Downloading cached pgvector from https://cache.nix-ci.com
832.67 s
Downloading cached pngquant from https://cache.nix-ci.com
832.67 s
Downloading cached podman-tmpfiles-nixos from https://cache.nix-ci.com
832.67 s
Downloading cached postgres_exporter from https://cache.nix-ci.com
832.67 s
Downloading cached postgresql-16.15-lib from https://cache.nix-ci.com
832.67 s
Downloading cached postgresql-16.15-man from https://cache.nix-ci.com
832.67 s
Downloading cached pretty_assertions from https://cache.nix-ci.com
832.67 s
Downloading cached proc-macro2 from https://cache.nix-ci.com
832.67 s
Downloading cached profile from https://cache.nix-ci.com
832.68 s
Downloaded cached profile (216 B) in 7ms
832.70 s
Downloaded cached curl-8.22.0-dev (277 KiB) in 37ms
832.71 s
Downloaded cached pgvector (682 KiB) in 39ms
832.71 s
Downloaded cached crun (2.5 MiB) in 44ms
832.71 s
Downloaded cached podman-tmpfiles-nixos (1384 B) in 43ms
832.71 s
Downloaded cached proc-macro2 (271 KiB) in 43ms
832.71 s
Downloaded cached pretty_assertions (127 KiB) in 44ms
832.72 s
Downloaded cached postgresql-16.15-lib (577 KiB) in 50ms
832.72 s
Downloaded cached open-iscsi (1.8 MiB) in 51ms
832.72 s
Downloaded cached pngquant (823 KiB) in 51ms
832.72 s
Building /nix/store/37f35xq1z0rlc5h31smx943nv29h1iwj-perl-5.42.3-env.drv
832.74 s
Downloaded cached postgresql-16.15-man (771 KiB) in 75ms
832.76 s
Downloaded cached postgres_exporter (13.9 MiB) in 91ms
832.77 s
Building /nix/store/xb1qivkgas177x6ixrk5505hykxi79y6-unit-comin-auto-reboot.service.drv
832.78 s
Progress: 235 of 671 built (5 building), 780 of 1199 downloaded from cache (15 downloading)
832.78 s
Progress: 235 of 671 built (5 building), 781 of 1199 downloaded from cache (14 downloading)
832.78 s
Progress: 235 of 671 built (5 building), 782 of 1199 downloaded from cache (13 downloading)
832.78 s
Progress: 235 of 671 built (5 building), 783 of 1199 downloaded from cache (12 downloading)
832.78 s
Progress: 235 of 671 built (5 building), 784 of 1199 downloaded from cache (11 downloading)
832.78 s
Progress: 235 of 671 built (5 building), 785 of 1199 downloaded from cache (10 downloading)
832.78 s
Progress: 235 of 671 built (5 building), 786 of 1199 downloaded from cache (9 downloading)
832.78 s
Progress: 235 of 671 built (5 building), 787 of 1199 downloaded from cache (8 downloading)
832.78 s
Progress: 235 of 671 built (5 building), 788 of 1199 downloaded from cache (7 downloading)
832.78 s
Progress: 235 of 671 built (5 building), 789 of 1199 downloaded from cache (6 downloading)
832.78 s
Progress: 235 of 671 built (5 building), 790 of 1199 downloaded from cache (5 downloading)
832.78 s
Progress: 235 of 671 built (5 building), 791 of 1199 downloaded from cache (4 downloading)
832.78 s
Progress: 235 of 671 built (5 building), 792 of 1199 downloaded from cache (3 downloading)
832.78 s
Progress: 235 of 671 built (5 building), 793 of 1199 downloaded from cache (2 downloading)
832.78 s
Progress: 235 of 671 built (5 building), 794 of 1199 downloaded from cache (1 downloading)
832.95 s
[home-manager-path:post-build] Uploading to the NixCI cache: /nix/store/a6savbjdznwaazbh5y0alfvfmkn4vzsw-home-manager-path
833.00 s
[home-manager-path:post-build] warning: 'warn-short-path-literals' is deprecated, use 'lint-short-path-literals = ignore' instead
833.04 s
[home-manager-path:post-build] copying 0 paths...
833.09 s
[home-manager-path:post-build] warning: 'warn-short-path-literals' is deprecated, use 'lint-short-path-literals = ignore' instead
833.45 s
[home-manager-path:post-build] copying 0 paths...
833.50 s
Uploaded home-manager-path in 569ms
833.50 s
Progress: 236 of 672 built (4 building), 794 of 1199 downloaded from cache (1 downloading)
833.50 s
Built home-manager-path in 2.9s
833.50 s
[perl-5.42.3-env] structuredAttrs is enabled
833.52 s
Downloaded cached home-manager-path (3.8 MiB) in 2.0s
833.53 s
[unit-k3s-graceful-drain.service:post-build] Uploading to the NixCI cache: /nix/store/p7zf1y3ya8v81fr833pysmxanbjp83rx-unit-k3s-graceful-drain.service
833.58 s
[unit-k3s-graceful-drain.service:post-build] warning: 'warn-short-path-literals' is deprecated, use 'lint-short-path-literals = ignore' instead
833.61 s
[unit-k3s-graceful-drain.service:post-build] copying 0 paths...
833.66 s
[unit-k3s-graceful-drain.service:post-build] warning: 'warn-short-path-literals' is deprecated, use 'lint-short-path-literals = ignore' instead
833.79 s
[unit-k3s-graceful-drain.service:post-build] copying 0 paths...
833.82 s
Uploaded unit-k3s-graceful-drain.service in 310ms
833.82 s
Progress: 237 of 673 built (3 building), 794 of 1199 downloaded from cache (1 downloading)
833.82 s
Built unit-k3s-graceful-drain.service in 3.1s
833.82 s
[unit-prometheus-node-exporter.service] structuredAttrs is enabled
833.82 s
Downloading cached ammar-fish-completions from https://cache.nix-ci.com
833.82 s
Downloading cached keepalived from https://cache.nix-ci.com
833.82 s
Downloading cached nix-expr-c from https://cache.nix-ci.com
833.82 s
Downloading cached nix-store-2.34.8-dev from https://cache.nix-ci.com
833.82 s
Downloading cached nix-util-c-2.34.8-dev from https://cache.nix-ci.com
833.82 s
Downloading cached python-catch-conflicts-hook from https://cache.nix-ci.com
833.82 s
Downloading cached python-imports-check-hook.sh from https://cache.nix-ci.com
833.82 s
Downloading cached python-namespaces-hook.sh from https://cache.nix-ci.com
833.82 s
Downloading cached python-output-dist-hook from https://cache.nix-ci.com
833.82 s
Downloading cached python-remove-bin-bytecode-hook from https://cache.nix-ci.com
833.82 s
Downloading cached python-remove-tests-dir-hook from https://cache.nix-ci.com
833.82 s
Downloading cached python-runtime-deps-check-hook.sh from https://cache.nix-ci.com
833.82 s
Downloading cached python3-3.14.7-env from https://cache.nix-ci.com
833.82 s
Downloading cached python3.14-aiocache from https://cache.nix-ci.com
833.82 s
Downloading cached python3.14-aiosqlite from https://cache.nix-ci.com
833.83 s
Downloaded cached ammar-fish-completions (30 KiB) in 10ms
833.84 s
Downloaded cached python-catch-conflicts-hook (920 B) in 13ms
833.84 s
Downloaded cached nix-util-c-2.34.8-dev (15 KiB) in 15ms
833.84 s
Downloaded cached nix-expr-c (414 KiB) in 19ms
833.84 s
Downloaded cached python-remove-bin-bytecode-hook (1096 B) in 20ms
833.84 s
Downloaded cached python-imports-check-hook.sh (1768 B) in 20ms
833.84 s
Downloaded cached python-remove-tests-dir-hook (960 B) in 20ms
833.84 s
Downloaded cached python-namespaces-hook.sh (2960 B) in 21ms
833.84 s
Downloaded cached python-output-dist-hook (1208 B) in 21ms
833.84 s
Downloaded cached python-runtime-deps-check-hook.sh (1456 B) in 21ms
833.84 s
Downloaded cached python3.14-aiosqlite (251 KiB) in 20ms
833.84 s
Downloaded cached nix-store-2.34.8-dev (425 KiB) in 22ms
833.84 s
Downloaded cached keepalived (1.1 MiB) in 22ms
833.85 s
Downloaded cached python3.14-aiocache (353 KiB) in 23ms
833.85 s
Downloaded cached python3-3.14.7-env (217 KiB) in 27ms
833.91 s
Building /nix/store/dfpqrcqvfxnp2fyxk8j1vrh35bp7bj50-open-iscsi-2.1.13_fish-completions.drv
833.96 s
Building /nix/store/r13sy6cpjz7sqnjn7qdiz8dxi3vrqw5m-tmpfiles.d.drv
834.01 s
Building /nix/store/r0g7mf43n4nfl7hhdp1f2h2zs1lxig5g-unit-prometheus-postgres-exporter.service.drv
834.09 s
Building /nix/store/0swvdm3bb87l1pvcx2c8ag9wvzkqrild-user-environment.drv
834.09 s
Progress: 237 of 663 built (7 building), 795 of 1199 downloaded from cache (15 downloading)
834.09 s
Progress: 237 of 663 built (7 building), 796 of 1199 downloaded from cache (14 downloading)
834.09 s
Progress: 237 of 663 built (7 building), 797 of 1199 downloaded from cache (13 downloading)
834.09 s
Progress: 237 of 663 built (7 building), 798 of 1199 downloaded from cache (12 downloading)
834.09 s
Progress: 237 of 663 built (7 building), 799 of 1199 downloaded from cache (11 downloading)
834.09 s
Progress: 237 of 663 built (7 building), 800 of 1199 downloaded from cache (10 downloading)
834.09 s
Progress: 237 of 663 built (7 building), 801 of 1199 downloaded from cache (9 downloading)
834.09 s
Progress: 237 of 663 built (7 building), 802 of 1199 downloaded from cache (8 downloading)
834.09 s
Progress: 237 of 663 built (7 building), 803 of 1199 downloaded from cache (7 downloading)
834.09 s
Progress: 237 of 663 built (7 building), 804 of 1199 downloaded from cache (6 downloading)
834.09 s
Progress: 237 of 663 built (7 building), 805 of 1199 downloaded from cache (5 downloading)
834.09 s
Progress: 237 of 663 built (7 building), 806 of 1199 downloaded from cache (4 downloading)
834.09 s
Progress: 237 of 663 built (7 building), 807 of 1199 downloaded from cache (3 downloading)
834.09 s
Progress: 237 of 663 built (7 building), 808 of 1199 downloaded from cache (2 downloading)
834.09 s
Progress: 237 of 663 built (7 building), 809 of 1199 downloaded from cache (1 downloading)
834.09 s
Progress: 237 of 663 built (7 building), 810 of 1199 downloaded from cache
834.13 s
[open-iscsi-2.1.13_fish-completions:post-build] Uploading to the NixCI cache: /nix/store/8ws9si5k3wd0nhymkf6viaw16bbqmry0-open-iscsi-2.1.13_fish-completions
834.17 s
[open-iscsi-2.1.13_fish-completions:post-build] warning: 'warn-short-path-literals' is deprecated, use 'lint-short-path-literals = ignore' instead
834.20 s
[open-iscsi-2.1.13_fish-completions:post-build] copying 0 paths...
834.26 s
[open-iscsi-2.1.13_fish-completions:post-build] warning: 'warn-short-path-literals' is deprecated, use 'lint-short-path-literals = ignore' instead
834.40 s
[open-iscsi-2.1.13_fish-completions:post-build] copying 0 paths...
834.42 s
Uploaded open-iscsi-2.1.13_fish-completions in 319ms
834.42 s
Progress: 238 of 664 built (6 building), 810 of 1199 downloaded from cache
834.42 s
Built open-iscsi-2.1.13_fish-completions in 515ms
834.42 s
[perl-5.42.3-env] created 203 symlinks in user environment
834.46 s
[tmpfiles.d:post-build] Uploading to the NixCI cache: /nix/store/csh7777lh8qb4yc1mcf2p0b6cyx10r7z-tmpfiles.d
834.50 s
[tmpfiles.d:post-build] warning: 'warn-short-path-literals' is deprecated, use 'lint-short-path-literals = ignore' instead
834.66 s
[tmpfiles.d:post-build] copying 1 paths...
834.66 s
[tmpfiles.d:post-build] copying path '/nix/store/csh7777lh8qb4yc1mcf2p0b6cyx10r7z-tmpfiles.d' to 'https://cache.nix-ci.com'...
834.86 s
[tmpfiles.d:post-build] warning: 'warn-short-path-literals' is deprecated, use 'lint-short-path-literals = ignore' instead
835.14 s
[tmpfiles.d:post-build] copying 1 paths...
835.14 s
[tmpfiles.d:post-build] copying path '/nix/store/r13sy6cpjz7sqnjn7qdiz8dxi3vrqw5m-tmpfiles.d.drv' to 'https://cache.nix-ci.com'...
835.30 s
Uploaded tmpfiles.d in 867ms
835.30 s
Progress: 239 of 665 built (5 building), 810 of 1199 downloaded from cache
835.30 s
Built tmpfiles.d in 1.3s
835.30 s
[unit-comin-auto-reboot.service] structuredAttrs is enabled
835.34 s
[unit-prometheus-node-exporter.service:post-build] Uploading to the NixCI cache: /nix/store/c98p6rqbz68k4bflbgxhh10qz9vr86d6-unit-prometheus-node-exporter.service
835.38 s
[unit-prometheus-node-exporter.service:post-build] warning: 'warn-short-path-literals' is deprecated, use 'lint-short-path-literals = ignore' instead
835.41 s
[unit-prometheus-node-exporter.service:post-build] copying 0 paths...
835.47 s
[unit-prometheus-node-exporter.service:post-build] warning: 'warn-short-path-literals' is deprecated, use 'lint-short-path-literals = ignore' instead
835.60 s
[unit-prometheus-node-exporter.service:post-build] copying 0 paths...
835.62 s
Uploaded unit-prometheus-node-exporter.service in 307ms
835.62 s
Progress: 240 of 666 built (4 building), 810 of 1199 downloaded from cache
835.62 s
Built unit-prometheus-node-exporter.service in 4.0s
835.62 s
[unit-prometheus-postgres-exporter.service] structuredAttrs is enabled
835.62 s
Downloading cached cachix-1.12.1-bin from https://cache.nix-ci.com
835.62 s
Downloading cached nix-fetchers from https://cache.nix-ci.com
835.62 s
Downloading cached nix-main from https://cache.nix-ci.com
835.62 s
Downloading cached nix-store-2.35.2-dev from https://cache.nix-ci.com
835.62 s
Downloading cached pdfium-8066-dev from https://cache.nix-ci.com
835.62 s
Downloading cached postgresql from https://cache.nix-ci.com
835.62 s
Downloading cached python3.14-annotated-doc from https://cache.nix-ci.com
835.63 s
Downloading cached python3.14-annotated-types from https://cache.nix-ci.com
835.63 s
Downloading cached python3.14-antlr4-python3-runtime from https://cache.nix-ci.com
835.63 s
Downloading cached python3.14-asgiref from https://cache.nix-ci.com
835.63 s
Downloading cached python3.14-asttokens from https://cache.nix-ci.com
835.63 s
Downloading cached python3.14-atpublic from https://cache.nix-ci.com
835.63 s
Downloading cached python3.14-azure-core from https://cache.nix-ci.com
835.63 s
Downloading cached python3.14-bleach from https://cache.nix-ci.com
835.63 s
Downloading cached python3.14-babel from https://cache.nix-ci.com
835.63 s
Downloading cached python3.14-billiard from https://cache.nix-ci.com
835.65 s
Downloaded cached nix-main (389 KiB) in 29ms
835.66 s
Downloaded cached nix-store-2.35.2-dev (454 KiB) in 34ms
835.67 s
Downloaded cached nix-fetchers (1.6 MiB) in 44ms
835.67 s
Downloaded cached python3.14-annotated-doc (19 KiB) in 48ms
835.67 s
Downloaded cached python3.14-annotated-types (114 KiB) in 47ms
835.68 s
Downloaded cached python3.14-asttokens (258 KiB) in 50ms
835.68 s
Downloaded cached python3.14-atpublic (25 KiB) in 51ms
835.68 s
Downloaded cached pdfium-8066-dev (426 KiB) in 58ms
835.68 s
Downloaded cached python3.14-asgiref (263 KiB) in 59ms
835.69 s
Downloaded cached python3.14-billiard (1.1 MiB) in 68ms
835.70 s
Downloaded cached python3.14-antlr4-python3-runtime (1.5 MiB) in 75ms
835.70 s
Building /nix/store/f0z0wdvfid0s2dvwkyim6jlfali7awck-X-Restart-Triggers-systemd-tmpfiles-resetup.drv
835.71 s
Downloaded cached python3.14-bleach (2.1 MiB) in 82ms
835.72 s
Downloaded cached python3.14-azure-core (2.2 MiB) in 98ms
835.76 s
Building /nix/store/x9blcgwhkvcjvcnhws86cwhh95svs69q-unit-keepalived.service.drv
835.76 s
Progress: 240 of 654 built (6 building), 811 of 1199 downloaded from cache (15 downloading)
835.76 s
Progress: 240 of 654 built (6 building), 812 of 1199 downloaded from cache (14 downloading)
835.76 s
Progress: 240 of 654 built (6 building), 813 of 1199 downloaded from cache (13 downloading)
835.76 s
Progress: 240 of 654 built (6 building), 814 of 1199 downloaded from cache (12 downloading)
835.76 s
Progress: 240 of 654 built (6 building), 815 of 1199 downloaded from cache (11 downloading)
835.76 s
Progress: 240 of 654 built (6 building), 816 of 1199 downloaded from cache (10 downloading)
835.76 s
Progress: 240 of 654 built (6 building), 817 of 1199 downloaded from cache (9 downloading)
835.76 s
Progress: 240 of 654 built (6 building), 818 of 1199 downloaded from cache (8 downloading)
835.76 s
Progress: 240 of 654 built (6 building), 819 of 1199 downloaded from cache (7 downloading)
835.76 s
Progress: 240 of 654 built (6 building), 820 of 1199 downloaded from cache (6 downloading)
835.76 s
Progress: 240 of 654 built (6 building), 821 of 1199 downloaded from cache (5 downloading)
835.76 s
Progress: 240 of 654 built (6 building), 822 of 1199 downloaded from cache (4 downloading)
835.76 s
Progress: 240 of 654 built (6 building), 823 of 1199 downloaded from cache (3 downloading)
835.76 s
[X-Restart-Triggers-systemd-tmpfiles-resetup] structuredAttrs is enabled
835.80 s
Downloaded cached cachix-1.12.1-bin (24.9 MiB) in 178ms
835.81 s
[perl-5.42.3-env:post-build] Uploading to the NixCI cache: /nix/store/i0ga7r7cy4iv768k7czmbx0mfwdsmdym-perl-5.42.3-env
835.86 s
[perl-5.42.3-env:post-build] warning: 'warn-short-path-literals' is deprecated, use 'lint-short-path-literals = ignore' instead
835.87 s
Downloaded cached postgresql (22.3 MiB) in 245ms
835.89 s
[perl-5.42.3-env:post-build] copying 0 paths...
835.90 s
Downloaded cached python3.14-babel (30.8 MiB) in 271ms
835.94 s
[perl-5.42.3-env:post-build] warning: 'warn-short-path-literals' is deprecated, use 'lint-short-path-literals = ignore' instead
835.99 s
[perl-5.42.3-env:post-build] copying 0 paths...
836.01 s
Uploaded perl-5.42.3-env in 220ms
836.01 s
Progress: 241 of 655 built (5 building), 823 of 1199 downloaded from cache (3 downloading)
836.01 s
Built perl-5.42.3-env in 3.2s
836.04 s
[unit-comin-auto-reboot.service:post-build] Uploading to the NixCI cache: /nix/store/23hix9x60s96ggjgh4cvdkncdqyhlhwi-unit-comin-auto-reboot.service
836.08 s
[unit-comin-auto-reboot.service:post-build] warning: 'warn-short-path-literals' is deprecated, use 'lint-short-path-literals = ignore' instead
836.11 s
[unit-comin-auto-reboot.service:post-build] copying 0 paths...
836.16 s
[unit-comin-auto-reboot.service:post-build] warning: 'warn-short-path-literals' is deprecated, use 'lint-short-path-literals = ignore' instead
836.31 s
[unit-comin-auto-reboot.service:post-build] copying 0 paths...
836.33 s
Uploaded unit-comin-auto-reboot.service in 318ms
836.33 s
Progress: 242 of 656 built (4 building), 823 of 1199 downloaded from cache (3 downloading)
836.33 s
Built unit-comin-auto-reboot.service in 3.5s
836.36 s
[unit-prometheus-postgres-exporter.service:post-build] Uploading to the NixCI cache: /nix/store/b533xbfvvvav96q3mpx1wkjlq3rsv9h5-unit-prometheus-postgres-exporter.service
836.40 s
[unit-prometheus-postgres-exporter.service:post-build] warning: 'warn-short-path-literals' is deprecated, use 'lint-short-path-literals = ignore' instead
836.43 s
[unit-prometheus-postgres-exporter.service:post-build] copying 0 paths...
836.48 s
[unit-prometheus-postgres-exporter.service:post-build] warning: 'warn-short-path-literals' is deprecated, use 'lint-short-path-literals = ignore' instead
836.72 s
[unit-prometheus-postgres-exporter.service:post-build] copying 4 paths...
836.72 s
[unit-prometheus-postgres-exporter.service:post-build] copying path '/nix/store/c0ihvaz3rbhk2m1i562yjngasjn133sh-source.drv' to 'https://cache.nix-ci.com'...
836.86 s
[unit-prometheus-postgres-exporter.service:post-build] copying path '/nix/store/51jn3qgw8rc7cqz7220ilbp1wb7ia7d9-postgres_exporter-0.20.1-go-modules.drv' to 'https://cache.nix-ci.com'...
836.98 s
[unit-prometheus-postgres-exporter.service:post-build] copying path '/nix/store/8j4mldj5whx1mrfg2yzhx5ixqww77fh4-postgres_exporter-0.20.1.drv' to 'https://cache.nix-ci.com'...
837.10 s
[unit-prometheus-postgres-exporter.service:post-build] copying path '/nix/store/r0g7mf43n4nfl7hhdp1f2h2zs1lxig5g-unit-prometheus-postgres-exporter.service.drv' to 'https://cache.nix-ci.com'...
837.41 s
Uploaded unit-prometheus-postgres-exporter.service in 1.0s
837.41 s
Progress: 243 of 657 built (3 building), 823 of 1199 downloaded from cache (3 downloading)
837.41 s
Built unit-prometheus-postgres-exporter.service in 3.4s
837.41 s
[user-environment] structuredAttrs is enabled
837.41 s
[user-environment] created 245 symlinks in user environment
837.41 s
Downloading cached hm_hmfontconfigfonts.xml from https://cache.nix-ci.com
837.41 s
Downloading cached nix-fetchers-2.34.8-dev from https://cache.nix-ci.com
837.41 s
Downloading cached nix-flake-c from https://cache.nix-ci.com
837.41 s
Downloading cached nix-store-c-2.34.8-dev from https://cache.nix-ci.com
837.41 s
Downloading cached python-metadata-check-hook.sh from https://cache.nix-ci.com
837.41 s
Downloading cached python3.14-blis from https://cache.nix-ci.com
837.41 s
Downloading cached python3.14-brotlicffi from https://cache.nix-ci.com
837.41 s
Downloading cached python3.14-buildbot_pkg from https://cache.nix-ci.com
837.41 s
Downloading cached python3.14-cached-property from https://cache.nix-ci.com
837.41 s
Downloading cached python3.14-catalogue from https://cache.nix-ci.com
837.41 s
Downloading cached python3.14-click-didyoumean from https://cache.nix-ci.com
837.41 s
Downloading cached python3.14-click-plugins from https://cache.nix-ci.com
837.41 s
Downloading cached python3.14-cloudpathlib from https://cache.nix-ci.com
837.42 s
Progress: 243 of 645 built (3 building), 824 of 1199 downloaded from cache (15 downloading)
837.42 s
Progress: 243 of 645 built (3 building), 825 of 1199 downloaded from cache (14 downloading)
837.42 s
Progress: 243 of 645 built (3 building), 826 of 1199 downloaded from cache (13 downloading)
837.42 s
Downloaded cached hm_hmfontconfigfonts.xml (880 B) in 6ms
837.43 s
Downloaded cached python-metadata-check-hook.sh (2464 B) in 13ms
837.43 s
Downloaded cached nix-store-c-2.34.8-dev (17 KiB) in 14ms
837.43 s
Downloaded cached nix-fetchers-2.34.8-dev (34 KiB) in 14ms
837.43 s
Downloaded cached python3.14-buildbot_pkg (35 KiB) in 15ms
837.45 s
Downloaded cached nix-flake-c (145 KiB) in 34ms
837.45 s
Downloaded cached python3.14-brotlicffi (136 KiB) in 34ms
837.45 s
Downloaded cached python3.14-click-plugins (30 KiB) in 34ms
837.45 s
Downloaded cached python3.14-catalogue (182 KiB) in 35ms
837.45 s
Downloaded cached python3.14-click-didyoumean (18 KiB) in 35ms
837.45 s
Downloaded cached python3.14-cached-property (33 KiB) in 35ms
837.45 s
Downloaded cached python3.14-cloudpathlib (830 KiB) in 39ms
837.46 s
[X-Restart-Triggers-systemd-tmpfiles-resetup:post-build] Uploading to the NixCI cache: /nix/store/l1nkcbsj300gw6ykn8wlnlkfxab7hx3r-X-Restart-Triggers-systemd-tmpfiles-resetup
837.47 s
Downloaded cached python3.14-blis (8.6 MiB) in 53ms
837.50 s
[X-Restart-Triggers-systemd-tmpfiles-resetup:post-build] warning: 'warn-short-path-literals' is deprecated, use 'lint-short-path-literals = ignore' instead
837.66 s
[X-Restart-Triggers-systemd-tmpfiles-resetup:post-build] copying 1 paths...
837.66 s
[X-Restart-Triggers-systemd-tmpfiles-resetup:post-build] copying path '/nix/store/l1nkcbsj300gw6ykn8wlnlkfxab7hx3r-X-Restart-Triggers-systemd-tmpfiles-resetup' to 'https://cache.nix-ci.com'...
837.84 s
[X-Restart-Triggers-systemd-tmpfiles-resetup:post-build] warning: 'warn-short-path-literals' is deprecated, use 'lint-short-path-literals = ignore' instead
838.09 s
[X-Restart-Triggers-systemd-tmpfiles-resetup:post-build] copying 1 paths...
838.09 s
[X-Restart-Triggers-systemd-tmpfiles-resetup:post-build] copying path '/nix/store/f0z0wdvfid0s2dvwkyim6jlfali7awck-X-Restart-Triggers-systemd-tmpfiles-resetup.drv' to 'https://cache.nix-ci.com'...
838.24 s
Uploaded X-Restart-Triggers-systemd-tmpfiles-resetup in 813ms
838.24 s
Progress: 244 of 646 built (2 building), 826 of 1199 downloaded from cache (13 downloading)
838.24 s
Built X-Restart-Triggers-systemd-tmpfiles-resetup in 2.5s
838.24 s
[unit-keepalived.service] structuredAttrs is enabled
838.38 s
[user-environment:post-build] Uploading to the NixCI cache: /nix/store/wc4p1rrw51vfph02j0589v3ajjvjr34h-user-environment
838.42 s
[user-environment:post-build] warning: 'warn-short-path-literals' is deprecated, use 'lint-short-path-literals = ignore' instead
838.47 s
[user-environment:post-build] copying 0 paths...
838.52 s
[user-environment:post-build] warning: 'warn-short-path-literals' is deprecated, use 'lint-short-path-literals = ignore' instead
838.86 s
[user-environment:post-build] copying 0 paths...
838.90 s
Uploaded user-environment in 546ms
838.90 s
Progress: 245 of 647 built (1 building), 826 of 1199 downloaded from cache (13 downloading)
838.90 s
Built user-environment in 4.8s
838.90 s
Downloading cached nix-expr from https://cache.nix-ci.com
838.90 s
Downloading cached nix-fetchers-2.35.2-dev from https://cache.nix-ci.com
838.90 s
Downloading cached python3.14-aiosmtpd from https://cache.nix-ci.com
838.92 s
Downloaded cached nix-fetchers-2.35.2-dev (36 KiB) in 13ms
838.94 s
Downloaded cached python3.14-aiosmtpd (1.6 MiB) in 33ms
838.94 s
Downloaded cached nix-expr (3.4 MiB) in 37ms
838.96 s
Building /nix/store/4i37z9v13rmc2rc8cp387zwxzah8wyrc-backupPrepareCommand.drv
839.00 s
Building /nix/store/11khng39h0biapihcba6hjb74n25h1zs-unit-attic-chunk-check.service.drv
839.05 s
Building /nix/store/x6z4am2y7kinc29by8mwppvj99c5129a-unit-systemd-tmpfiles-resetup.service.drv
839.05 s
Progress: 245 of 642 built (4 building), 827 of 1199 downloaded from cache (15 downloading)
839.05 s
Progress: 245 of 642 built (4 building), 828 of 1199 downloaded from cache (14 downloading)
839.05 s
Progress: 245 of 642 built (4 building), 829 of 1199 downloaded from cache (13 downloading)
839.05 s
Progress: 245 of 642 built (4 building), 830 of 1199 downloaded from cache (12 downloading)
839.05 s
Progress: 245 of 642 built (4 building), 831 of 1199 downloaded from cache (11 downloading)
839.05 s
Progress: 245 of 642 built (4 building), 832 of 1199 downloaded from cache (10 downloading)
839.05 s
Progress: 245 of 642 built (4 building), 833 of 1199 downloaded from cache (9 downloading)
839.05 s
Progress: 245 of 642 built (4 building), 834 of 1199 downloaded from cache (8 downloading)
839.05 s
Progress: 245 of 642 built (4 building), 835 of 1199 downloaded from cache (7 downloading)
839.05 s
Progress: 245 of 642 built (4 building), 836 of 1199 downloaded from cache (6 downloading)
839.05 s
Progress: 245 of 642 built (4 building), 837 of 1199 downloaded from cache (5 downloading)
839.05 s
Progress: 245 of 642 built (4 building), 838 of 1199 downloaded from cache (4 downloading)
839.05 s
Progress: 245 of 642 built (4 building), 839 of 1199 downloaded from cache (3 downloading)
839.05 s
Progress: 245 of 642 built (4 building), 840 of 1199 downloaded from cache (2 downloading)
839.05 s
Progress: 245 of 642 built (4 building), 841 of 1199 downloaded from cache (1 downloading)
839.05 s
Progress: 245 of 642 built (4 building), 842 of 1199 downloaded from cache
839.05 s
[backupPrepareCommand] structuredAttrs is enabled
839.05 s
[unit-attic-chunk-check.service] structuredAttrs is enabled
839.08 s
[unit-keepalived.service:post-build] Uploading to the NixCI cache: /nix/store/dmaxy3zl9qpsr9cjjlbcm27mhgbn3nir-unit-keepalived.service
839.12 s
[unit-keepalived.service:post-build] warning: 'warn-short-path-literals' is deprecated, use 'lint-short-path-literals = ignore' instead
839.26 s
[unit-keepalived.service:post-build] copying 1 paths...
839.26 s
[unit-keepalived.service:post-build] copying path '/nix/store/dmaxy3zl9qpsr9cjjlbcm27mhgbn3nir-unit-keepalived.service' to 'https://cache.nix-ci.com'...
839.43 s
[unit-keepalived.service:post-build] warning: 'warn-short-path-literals' is deprecated, use 'lint-short-path-literals = ignore' instead
839.66 s
[unit-keepalived.service:post-build] copying 1 paths...
839.67 s
[unit-keepalived.service:post-build] copying path '/nix/store/x9blcgwhkvcjvcnhws86cwhh95svs69q-unit-keepalived.service.drv' to 'https://cache.nix-ci.com'...
839.81 s
Uploaded unit-keepalived.service in 754ms
839.81 s
Progress: 246 of 643 built (3 building), 842 of 1199 downloaded from cache
839.81 s
Built unit-keepalived.service in 4.0s
839.82 s
Downloading cached python3.14-colorama from https://cache.nix-ci.com
839.82 s
Downloading cached python3.14-colorlog from https://cache.nix-ci.com
839.82 s
Downloading cached python3.14-confection from https://cache.nix-ci.com
839.82 s
Downloading cached python3.14-configargparse from https://cache.nix-ci.com
839.82 s
Downloading cached python3.14-croniter from https://cache.nix-ci.com
839.82 s
Downloading cached python3.14-cymem from https://cache.nix-ci.com
839.82 s
Downloading cached python3.14-cython-test-exception-raiser from https://cache.nix-ci.com
839.82 s
Downloading cached python3.14-decorator from https://cache.nix-ci.com
839.82 s
Downloading cached python3.14-deprecation from https://cache.nix-ci.com
839.82 s
Downloading cached python3.14-dirtyjson from https://cache.nix-ci.com
839.82 s
Downloading cached python3.14-editables from https://cache.nix-ci.com
839.82 s
Downloading cached python3.14-eval-type-backport from https://cache.nix-ci.com
839.82 s
Downloading cached python3.14-exceptiongroup from https://cache.nix-ci.com
839.82 s
Downloading cached python3.14-executing from https://cache.nix-ci.com
839.82 s
Downloading cached python3.14-flit-core from https://cache.nix-ci.com
839.82 s
Downloading cached python3.14-fonttools from https://cache.nix-ci.com
839.84 s
Downloaded cached python3.14-colorlog (77 KiB) in 29ms
839.85 s
Downloaded cached python3.14-cymem (157 KiB) in 29ms
839.85 s
Downloaded cached python3.14-deprecation (53 KiB) in 29ms
839.85 s
Downloaded cached python3.14-eval-type-backport (48 KiB) in 29ms
839.85 s
Downloaded cached python3.14-colorama (271 KiB) in 30ms
839.85 s
Downloaded cached python3.14-editables (42 KiB) in 30ms
839.85 s
Downloaded cached python3.14-decorator (74 KiB) in 30ms
839.85 s
Downloaded cached python3.14-configargparse (306 KiB) in 31ms
839.85 s
Downloaded cached python3.14-confection (367 KiB) in 31ms
839.85 s
Downloaded cached python3.14-flit-core (511 KiB) in 31ms
839.85 s
Downloaded cached python3.14-executing (300 KiB) in 31ms
839.85 s
Downloaded cached python3.14-exceptiongroup (160 KiB) in 33ms
839.85 s
Downloaded cached python3.14-dirtyjson (210 KiB) in 34ms
839.85 s
[backupPrepareCommand:post-build] Uploading to the NixCI cache: /nix/store/dkm467x6ri6yg29sgn27fj2aq93gwra8-backupPrepareCommand
839.85 s
Downloaded cached python3.14-croniter (800 KiB) in 38ms
839.89 s
[backupPrepareCommand:post-build] warning: 'warn-short-path-literals' is deprecated, use 'lint-short-path-literals = ignore' instead
839.92 s
Downloaded cached python3.14-cython-test-exception-raiser (59 KiB) in 100ms
839.92 s
[backupPrepareCommand:post-build] copying 0 paths...
839.93 s
Downloaded cached python3.14-fonttools (15 MiB) in 109ms
839.97 s
[backupPrepareCommand:post-build] warning: 'warn-short-path-literals' is deprecated, use 'lint-short-path-literals = ignore' instead
840.05 s
[backupPrepareCommand:post-build] copying 0 paths...
840.06 s
Uploaded backupPrepareCommand in 238ms
840.06 s
Progress: 247 of 634 built (2 building), 842 of 1199 downloaded from cache (16 downloading)
840.06 s
Built backupPrepareCommand in 1.1s
840.10 s
[unit-attic-chunk-check.service:post-build] Uploading to the NixCI cache: /nix/store/bapjifp7pa58dcr7b7n29v86ja67whpx-unit-attic-chunk-check.service
840.13 s
[unit-attic-chunk-check.service:post-build] warning: 'warn-short-path-literals' is deprecated, use 'lint-short-path-literals = ignore' instead
840.16 s
[unit-attic-chunk-check.service:post-build] copying 0 paths...
840.20 s
[unit-attic-chunk-check.service:post-build] warning: 'warn-short-path-literals' is deprecated, use 'lint-short-path-literals = ignore' instead
840.33 s
[unit-attic-chunk-check.service:post-build] copying 0 paths...
840.36 s
Uploaded unit-attic-chunk-check.service in 283ms
840.36 s
Progress: 248 of 635 built (1 building), 842 of 1199 downloaded from cache (16 downloading)
840.36 s
Built unit-attic-chunk-check.service in 1.3s
840.36 s
[unit-systemd-tmpfiles-resetup.service] structuredAttrs is enabled
840.36 s
Progress: 248 of 633 built (1 building), 843 of 1199 downloaded from cache (15 downloading)
840.36 s
Progress: 248 of 633 built (1 building), 844 of 1199 downloaded from cache (14 downloading)
840.36 s
Progress: 248 of 633 built (1 building), 845 of 1199 downloaded from cache (13 downloading)
840.36 s
Progress: 248 of 633 built (1 building), 846 of 1199 downloaded from cache (12 downloading)
840.36 s
Progress: 248 of 633 built (1 building), 847 of 1199 downloaded from cache (11 downloading)
840.36 s
Progress: 248 of 633 built (1 building), 848 of 1199 downloaded from cache (10 downloading)
840.36 s
Progress: 248 of 633 built (1 building), 849 of 1199 downloaded from cache (9 downloading)
840.36 s
Progress: 248 of 633 built (1 building), 850 of 1199 downloaded from cache (8 downloading)
840.36 s
Progress: 248 of 633 built (1 building), 851 of 1199 downloaded from cache (7 downloading)
840.36 s
Progress: 248 of 633 built (1 building), 852 of 1199 downloaded from cache (6 downloading)
840.36 s
Progress: 248 of 633 built (1 building), 853 of 1199 downloaded from cache (5 downloading)
840.36 s
Progress: 248 of 633 built (1 building), 854 of 1199 downloaded from cache (4 downloading)
840.36 s
Progress: 248 of 633 built (1 building), 855 of 1199 downloaded from cache (3 downloading)
840.36 s
Progress: 248 of 633 built (1 building), 856 of 1199 downloaded from cache (2 downloading)
840.36 s
Progress: 248 of 633 built (1 building), 857 of 1199 downloaded from cache (1 downloading)
840.36 s
Progress: 248 of 633 built (1 building), 858 of 1199 downloaded from cache
840.40 s
[unit-systemd-tmpfiles-resetup.service:post-build] Uploading to the NixCI cache: /nix/store/jy8s3pvj5cazd4rjkl6h157avn8cwz5n-unit-systemd-tmpfiles-resetup.service
840.44 s
[unit-systemd-tmpfiles-resetup.service:post-build] warning: 'warn-short-path-literals' is deprecated, use 'lint-short-path-literals = ignore' instead
840.60 s
[unit-systemd-tmpfiles-resetup.service:post-build] copying 1 paths...
840.60 s
[unit-systemd-tmpfiles-resetup.service:post-build] copying path '/nix/store/jy8s3pvj5cazd4rjkl6h157avn8cwz5n-unit-systemd-tmpfiles-resetup.service' to 'https://cache.nix-ci.com'...
840.78 s
[unit-systemd-tmpfiles-resetup.service:post-build] warning: 'warn-short-path-literals' is deprecated, use 'lint-short-path-literals = ignore' instead
841.06 s
[unit-systemd-tmpfiles-resetup.service:post-build] copying 1 paths...
841.06 s
[unit-systemd-tmpfiles-resetup.service:post-build] copying path '/nix/store/x6z4am2y7kinc29by8mwppvj99c5129a-unit-systemd-tmpfiles-resetup.service.drv' to 'https://cache.nix-ci.com'...
841.22 s
Uploaded unit-systemd-tmpfiles-resetup.service in 851ms
841.22 s
Progress: 249 of 634 built, 858 of 1199 downloaded from cache
841.22 s
Built unit-systemd-tmpfiles-resetup.service in 2.1s
841.23 s
Downloading cached nix-expr-2.34.8-dev from https://cache.nix-ci.com
841.23 s
Downloading cached nix-expr-2.35.2-dev from https://cache.nix-ci.com
841.23 s
Downloading cached nix-flake from https://cache.nix-ci.com
841.23 s
Downloading cached python3.14-granian from https://cache.nix-ci.com
841.23 s
Downloading cached python3.14-hf-xet from https://cache.nix-ci.com
841.23 s
Downloading cached python3.14-gunicorn from https://cache.nix-ci.com
841.23 s
Downloading cached python3.14-hiredis from https://cache.nix-ci.com
841.23 s
Downloading cached python3.14-hpack from https://cache.nix-ci.com
841.23 s
Downloading cached python3.14-httptools from https://cache.nix-ci.com
841.23 s
Downloading cached python3.14-httpx-oauth from https://cache.nix-ci.com
841.23 s
Downloading cached python3.14-humanfriendly from https://cache.nix-ci.com
841.23 s
Downloading cached python3.14-humanize from https://cache.nix-ci.com
841.23 s
Downloading cached python3.14-imap-tools from https://cache.nix-ci.com
841.23 s
Downloading cached python3.14-importlib-resources from https://cache.nix-ci.com
841.23 s
Downloading cached python3.14-inflection from https://cache.nix-ci.com
841.23 s
Downloading cached python3.14-hyperframe from https://cache.nix-ci.com
841.25 s
Downloaded cached python3.14-httpx-oauth (371 KiB) in 21ms
841.25 s
Downloaded cached nix-expr-2.34.8-dev (739 KiB) in 22ms
841.25 s
Downloaded cached python3.14-httptools (364 KiB) in 21ms
841.25 s
Progress: 249 of 620 built, 859 of 1199 downloaded from cache (15 downloading)
841.25 s
Downloading cached python3.14-fpdf2 from https://cache.nix-ci.com
841.25 s
Progress: 249 of 619 built, 860 of 1199 downloaded from cache (15 downloading)
841.25 s
Progress: 249 of 619 built, 861 of 1199 downloaded from cache (14 downloading)
841.25 s
Downloaded cached nix-flake (994 KiB) in 25ms
841.25 s
Downloading cached python3.14-griffe from https://cache.nix-ci.com
841.25 s
Downloading cached python3.14-iniconfig from https://cache.nix-ci.com
841.25 s
Progress: 249 of 619 built, 862 of 1199 downloaded from cache (15 downloading)
841.25 s
Downloaded cached python3.14-inflection (52 KiB) in 25ms
841.25 s
Downloading cached nix-expr-c-2.34.8-dev from https://cache.nix-ci.com
841.25 s
Progress: 249 of 619 built, 863 of 1199 downloaded from cache (15 downloading)
841.25 s
Downloading cached nix-cmd from https://cache.nix-ci.com
841.26 s
Downloaded cached nix-expr-2.35.2-dev (747 KiB) in 33ms
841.26 s
Downloaded cached python3.14-hyperframe (156 KiB) in 32ms
841.26 s
Progress: 249 of 618 built, 864 of 1199 downloaded from cache (15 downloading)
841.26 s
Downloading cached nix-flake-2.34.8-dev from https://cache.nix-ci.com
841.26 s
Progress: 249 of 617 built, 865 of 1199 downloaded from cache (15 downloading)
841.26 s
Downloaded cached python3.14-hiredis (202 KiB) in 35ms
841.26 s
Downloading cached nix-flake-2.35.2-dev from https://cache.nix-ci.com
841.26 s
Progress: 249 of 616 built, 866 of 1199 downloaded from cache (15 downloading)
841.26 s
Downloaded cached python3.14-hpack (645 KiB) in 36ms
841.26 s
Downloaded cached python3.14-humanfriendly (917 KiB) in 37ms
841.26 s
Downloaded cached python3.14-gunicorn (2.7 MiB) in 37ms
841.26 s
Downloaded cached python3.14-humanize (546 KiB) in 37ms
841.27 s
Downloading cached nix-main-2.34.8-dev from https://cache.nix-ci.com
841.27 s
Progress: 249 of 615 built, 867 of 1199 downloaded from cache (15 downloading)
841.27 s
Downloaded cached python3.14-imap-tools (411 KiB) in 38ms
841.27 s
Progress: 249 of 615 built, 868 of 1199 downloaded from cache (14 downloading)
841.27 s
Progress: 249 of 615 built, 869 of 1199 downloaded from cache (13 downloading)
841.27 s
Progress: 249 of 615 built, 870 of 1199 downloaded from cache (12 downloading)
841.27 s
Downloaded cached python3.14-importlib-resources (463 KiB) in 39ms
841.27 s
Downloading cached nix-main-2.35.2-dev from https://cache.nix-ci.com
841.27 s
Downloading cached python3.14-installer from https://cache.nix-ci.com
841.27 s
Downloading cached python3.14-isodate from https://cache.nix-ci.com
841.27 s
Downloading cached python3.14-ipython-pygments-lexers from https://cache.nix-ci.com
841.27 s
Progress: 249 of 613 built, 871 of 1199 downloaded from cache (15 downloading)
841.27 s
Progress: 249 of 613 built, 872 of 1199 downloaded from cache (14 downloading)
841.27 s
Downloading cached python3.14-coloredlogs from https://cache.nix-ci.com
841.27 s
Downloading cached python3.14-h2 from https://cache.nix-ci.com
841.29 s
Downloaded cached nix-expr-c-2.34.8-dev (50 KiB) in 38ms
841.29 s
Downloaded cached python3.14-iniconfig (71 KiB) in 40ms
841.29 s
Progress: 249 of 611 built, 873 of 1199 downloaded from cache (15 downloading)
841.29 s
Downloading cached python3.14-jiter from https://cache.nix-ci.com
841.29 s
Progress: 249 of 611 built, 874 of 1199 downloaded from cache (15 downloading)
841.30 s
Downloading cached nix-fetchers-c-2.34.8-dev from https://cache.nix-ci.com
841.30 s
Downloaded cached nix-flake-2.34.8-dev (19 KiB) in 37ms
841.30 s
Progress: 249 of 611 built, 875 of 1199 downloaded from cache (15 downloading)
841.30 s
Downloaded cached nix-flake-2.35.2-dev (19 KiB) in 36ms
841.30 s
Downloading cached python3.14-jmespath from https://cache.nix-ci.com
841.30 s
Progress: 249 of 611 built, 876 of 1199 downloaded from cache (15 downloading)
841.30 s
Downloading cached python3.14-jsonpickle from https://cache.nix-ci.com
841.30 s
Downloaded cached nix-main-2.34.8-dev (10 KiB) in 39ms
841.30 s
Progress: 249 of 610 built, 877 of 1199 downloaded from cache (15 downloading)
841.31 s
Downloaded cached nix-main-2.35.2-dev (10 KiB) in 38ms
841.31 s
Downloading cached python3.14-langdetect from https://cache.nix-ci.com
841.31 s
Progress: 249 of 610 built, 878 of 1199 downloaded from cache (15 downloading)
841.31 s
Downloading cached nix-cmd-2.34.8-dev from https://cache.nix-ci.com
841.31 s
Downloaded cached python3.14-ipython-pygments-lexers (59 KiB) in 39ms
841.31 s
Progress: 249 of 609 built, 879 of 1199 downloaded from cache (15 downloading)
841.31 s
Downloading cached nix-main-c-2.34.8-dev from https://cache.nix-ci.com
841.31 s
Downloaded cached python3.14-isodate (184 KiB) in 41ms
841.31 s
Progress: 249 of 608 built, 880 of 1199 downloaded from cache (15 downloading)
841.31 s
Downloading cached python3.14-lz4 from https://cache.nix-ci.com
841.31 s
Downloaded cached nix-cmd (1.1 MiB) in 59ms
841.31 s
Progress: 249 of 607 built, 881 of 1199 downloaded from cache (15 downloading)
841.31 s
Downloading cached python3.14-azure-ai-documentintelligence from https://cache.nix-ci.com
841.32 s
Downloaded cached python3.14-griffe (2.3 MiB) in 63ms
841.32 s
Downloaded cached python3.14-coloredlogs (424 KiB) in 46ms
841.32 s
Progress: 249 of 607 built, 882 of 1199 downloaded from cache (15 downloading)
841.32 s
Downloading cached nix-cmd-2.35.2-dev from https://cache.nix-ci.com
841.32 s
Progress: 249 of 606 built, 883 of 1199 downloaded from cache (15 downloading)
841.32 s
Downloaded cached python3.14-h2 (767 KiB) in 47ms
841.32 s
Downloading cached python3.14-marisa-trie from https://cache.nix-ci.com
841.32 s
Progress: 249 of 606 built, 884 of 1199 downloaded from cache (15 downloading)
841.32 s
Downloading cached python3.14-marshmallow from https://cache.nix-ci.com
841.32 s
Downloaded cached python3.14-installer (1.1 MiB) in 53ms
841.32 s
Progress: 249 of 605 built, 885 of 1199 downloaded from cache (15 downloading)
841.32 s
Downloading cached python3.14-gotenberg-client from https://cache.nix-ci.com
841.32 s
Downloaded cached python3.14-fpdf2 (4.1 MiB) in 72ms
841.32 s
Progress: 249 of 605 built, 886 of 1199 downloaded from cache (15 downloading)
841.32 s
Downloading cached pypa-install-hook from https://cache.nix-ci.com
841.33 s
Downloaded cached nix-fetchers-c-2.34.8-dev (3264 B) in 39ms
841.33 s
Progress: 249 of 604 built, 887 of 1199 downloaded from cache (15 downloading)
841.34 s
Downloading cached python3.14-mistune from https://cache.nix-ci.com
841.34 s
Downloaded cached python3.14-jiter (706 KiB) in 45ms
841.34 s
Progress: 249 of 604 built, 888 of 1199 downloaded from cache (15 downloading)
841.34 s
Downloading cached nix-flake-c-2.34.8-dev from https://cache.nix-ci.com
841.34 s
Downloaded cached python3.14-jmespath (235 KiB) in 40ms
841.34 s
Progress: 249 of 603 built, 889 of 1199 downloaded from cache (15 downloading)
841.34 s
Downloading cached python3.14-ml-dtypes from https://cache.nix-ci.com
841.34 s
Downloaded cached python3.14-jsonpickle (512 KiB) in 43ms
841.34 s
Progress: 249 of 603 built, 890 of 1199 downloaded from cache (15 downloading)
841.34 s
Downloading cached python3.14-botocore from https://cache.nix-ci.com
841.34 s
Downloaded cached nix-cmd-2.34.8-dev (44 KiB) in 38ms
841.35 s
Downloaded cached nix-main-c-2.34.8-dev (3136 B) in 37ms
841.35 s
Progress: 249 of 602 built, 891 of 1199 downloaded from cache (15 downloading)
841.35 s
Downloading cached python3.14-mock from https://cache.nix-ci.com
841.35 s
Progress: 249 of 602 built, 892 of 1199 downloaded from cache (15 downloading)
841.35 s
Downloading cached python3.14-multipart from https://cache.nix-ci.com
841.35 s
Downloaded cached python3.14-hf-xet (9.4 MiB) in 124ms
841.35 s
Progress: 249 of 602 built, 893 of 1199 downloaded from cache (15 downloading)
841.35 s
Downloaded cached nix-cmd-2.35.2-dev (46 KiB) in 36ms
841.35 s
Downloading cached python3.14-murmurhash from https://cache.nix-ci.com
841.35 s
Progress: 249 of 601 built, 894 of 1199 downloaded from cache (15 downloading)
841.35 s
Downloading cached python3.14-huggingface-hub from https://cache.nix-ci.com
841.36 s
Downloaded cached python3.14-lz4 (986 KiB) in 45ms
841.36 s
Progress: 249 of 600 built, 895 of 1199 downloaded from cache (15 downloading)
841.36 s
Downloading cached python3.14-mypy-extensions from https://cache.nix-ci.com
841.36 s
Downloaded cached pypa-install-hook (1512 B) in 36ms
841.36 s
Progress: 249 of 599 built, 896 of 1199 downloaded from cache (15 downloading)
841.36 s
Downloading cached python3.14-mysqlclient from https://cache.nix-ci.com
841.36 s
Downloaded cached python3.14-marshmallow (673 KiB) in 45ms
841.36 s
Downloaded cached python3.14-azure-ai-documentintelligence (2.4 MiB) in 48ms
841.36 s
Progress: 249 of 598 built, 897 of 1199 downloaded from cache (15 downloading)
841.36 s
Downloaded cached python3.14-marisa-trie (646 KiB) in 46ms
841.36 s
Downloading cached python3.14-narwhals from https://cache.nix-ci.com
841.36 s
Downloaded cached python3.14-granian (19.4 MiB) in 137ms
841.36 s
Progress: 249 of 597 built, 898 of 1199 downloaded from cache (15 downloading)
841.36 s
Progress: 249 of 597 built, 899 of 1199 downloaded from cache (14 downloading)
841.36 s
Downloading cached python3.14-nest-asyncio from https://cache.nix-ci.com
841.36 s
Downloading cached python3.14-oauthlib from https://cache.nix-ci.com
841.37 s
Progress: 249 of 595 built, 900 of 1199 downloaded from cache (15 downloading)
841.37 s
Downloading cached python3.14-language-data from https://cache.nix-ci.com
841.37 s
Downloaded cached python3.14-gotenberg-client (984 KiB) in 47ms
841.37 s
Progress: 249 of 594 built, 901 of 1199 downloaded from cache (15 downloading)
841.37 s
Downloaded cached nix-flake-c-2.34.8-dev (11 KiB) in 29ms
841.37 s
Downloading cached python3.14-omegaconf from https://cache.nix-ci.com
841.37 s
Progress: 249 of 593 built, 902 of 1199 downloaded from cache (15 downloading)
841.37 s
Downloading cached python3.14-onnxruntime from https://cache.nix-ci.com
841.37 s
Downloaded cached python3.14-langdetect (2.4 MiB) in 67ms
841.37 s
Progress: 249 of 593 built, 903 of 1199 downloaded from cache (15 downloading)
841.37 s
Downloading cached nix-2.34.8-dev from https://cache.nix-ci.com
841.38 s
Downloaded cached python3.14-multipart (171 KiB) in 28ms
841.38 s
Progress: 249 of 592 built, 904 of 1199 downloaded from cache (15 downloading)
841.38 s
Downloading cached python3.14-opencv-python from https://cache.nix-ci.com
841.38 s
Downloaded cached python3.14-ml-dtypes (1.9 MiB) in 35ms
841.38 s
Progress: 249 of 591 built, 905 of 1199 downloaded from cache (15 downloading)
841.38 s
Downloaded cached python3.14-mistune (928 KiB) in 41ms
841.38 s
Downloading cached python3.14-opencv-python-headless from https://cache.nix-ci.com
841.38 s
Progress: 249 of 591 built, 906 of 1199 downloaded from cache (15 downloading)
841.38 s
Downloading cached python3.14-onnx from https://cache.nix-ci.com
841.38 s
Downloaded cached python3.14-mock (392 KiB) in 37ms
841.38 s
Progress: 249 of 591 built, 907 of 1199 downloaded from cache (15 downloading)
841.38 s
Downloading cached python3.14-opentelemetry-proto from https://cache.nix-ci.com
841.39 s
Downloaded cached python3.14-murmurhash (91 KiB) in 35ms
841.39 s
Progress: 249 of 590 built, 908 of 1199 downloaded from cache (15 downloading)
841.39 s
Downloading cached python3.14-buildbot_www from https://cache.nix-ci.com
841.40 s
Downloaded cached python3.14-mypy-extensions (34 KiB) in 40ms
841.40 s
Progress: 249 of 589 built, 909 of 1199 downloaded from cache (15 downloading)
841.40 s
Downloading cached python3.14-orjson from https://cache.nix-ci.com
841.41 s
Downloaded cached python3.14-nest-asyncio (40 KiB) in 43ms
841.41 s
Progress: 249 of 588 built, 910 of 1199 downloaded from cache (15 downloading)
841.41 s
Downloading cached python3.14-parameterized from https://cache.nix-ci.com
841.41 s
Downloaded cached python3.14-mysqlclient (468 KiB) in 48ms
841.41 s
Progress: 249 of 587 built, 911 of 1199 downloaded from cache (15 downloading)
841.41 s
Downloading cached python3.14-parso from https://cache.nix-ci.com
841.42 s
Downloaded cached python3.14-opencv-python-headless (2328 B) in 40ms
841.42 s
Progress: 249 of 586 built, 912 of 1199 downloaded from cache (15 downloading)
841.42 s
Downloaded cached python3.14-opencv-python (2280 B) in 41ms
841.42 s
Downloading cached python3.14-pathspec from https://cache.nix-ci.com
841.42 s
Progress: 249 of 586 built, 913 of 1199 downloaded from cache (15 downloading)
841.42 s
Downloading cached python3.14-pathvalidate from https://cache.nix-ci.com
841.43 s
Downloaded cached python3.14-omegaconf (1.5 MiB) in 58ms
841.43 s
Progress: 249 of 586 built, 914 of 1199 downloaded from cache (15 downloading)
841.43 s
Downloaded cached nix-2.34.8-dev (91 KiB) in 55ms
841.43 s
Downloading cached python3.14-pdf2image from https://cache.nix-ci.com
841.43 s
Progress: 249 of 586 built, 915 of 1199 downloaded from cache (15 downloading)
841.43 s
Downloading cached python3.14-pdfminer-six from https://cache.nix-ci.com
841.43 s
Downloaded cached python3.14-oauthlib (1.6 MiB) in 65ms
841.43 s
Progress: 249 of 585 built, 916 of 1199 downloaded from cache (15 downloading)
841.43 s
Downloading cached python3.14-pillow-heif from https://cache.nix-ci.com
841.44 s
Downloaded cached python3.14-opentelemetry-proto (404 KiB) in 54ms
841.44 s
Progress: 249 of 584 built, 917 of 1199 downloaded from cache (15 downloading)
841.44 s
Downloading cached python3.14-pip from https://cache.nix-ci.com
841.45 s
Downloaded cached python3.14-parameterized (215 KiB) in 43ms
841.45 s
Progress: 249 of 583 built, 918 of 1199 downloaded from cache (15 downloading)
841.45 s
Downloading cached python3.14-opentelemetry-exporter-otlp-proto-common from https://cache.nix-ci.com
841.46 s
Downloaded cached python3.14-buildbot_www (1.3 MiB) in 70ms
841.46 s
Progress: 249 of 582 built, 919 of 1199 downloaded from cache (15 downloading)
841.46 s
Downloading cached python3.14-pluggy from https://cache.nix-ci.com
841.46 s
Downloaded cached python3.14-orjson (776 KiB) in 61ms
841.46 s
Progress: 249 of 581 built, 920 of 1199 downloaded from cache (15 downloading)
841.46 s
Downloading cached python3.14-ply from https://cache.nix-ci.com
841.46 s
Downloaded cached python3.14-pathvalidate (310 KiB) in 45ms
841.47 s
Progress: 249 of 581 built, 921 of 1199 downloaded from cache (15 downloading)
841.47 s
Downloading cached python3.14-preshed from https://cache.nix-ci.com
841.47 s
Downloaded cached python3.14-parso (1 MiB) in 57ms
841.47 s
Progress: 249 of 580 built, 922 of 1199 downloaded from cache (15 downloading)
841.47 s
Downloaded cached python3.14-pathspec (494 KiB) in 49ms
841.47 s
Downloading cached python3.14-priority from https://cache.nix-ci.com
841.47 s
Progress: 249 of 579 built, 923 of 1199 downloaded from cache (15 downloading)
841.47 s
Downloading cached python3.14-jedi from https://cache.nix-ci.com
841.47 s
Downloaded cached python3.14-pdf2image (119 KiB) in 41ms
841.47 s
Progress: 249 of 579 built, 924 of 1199 downloaded from cache (15 downloading)
841.47 s
Downloading cached python3.14-prometheus-client from https://cache.nix-ci.com
841.48 s
Downloaded cached python3.14-pillow-heif (338 KiB) in 46ms
841.48 s
Progress: 249 of 578 built, 925 of 1199 downloaded from cache (15 downloading)
841.48 s
Downloading cached python3.14-psutil from https://cache.nix-ci.com
841.49 s
Downloaded cached python3.14-narwhals (7.8 MiB) in 123ms
841.49 s
Progress: 249 of 577 built, 926 of 1199 downloaded from cache (15 downloading)
841.49 s
Downloading cached python3.14-psycopg-c from https://cache.nix-ci.com
841.50 s
Downloaded cached python3.14-opentelemetry-exporter-otlp-proto-common (147 KiB) in 42ms
841.50 s
Progress: 249 of 576 built, 927 of 1199 downloaded from cache (15 downloading)
841.50 s
Downloading cached python3.14-psycopg-pool from https://cache.nix-ci.com
841.50 s
Downloaded cached python3.14-huggingface-hub (10.1 MiB) in 143ms
841.50 s
Progress: 249 of 575 built, 928 of 1199 downloaded from cache (15 downloading)
841.50 s
Downloading cached python3.14-psycopg2 from https://cache.nix-ci.com
841.50 s
Downloaded cached python3.14-pluggy (237 KiB) in 43ms
841.50 s
Progress: 249 of 574 built, 929 of 1199 downloaded from cache (15 downloading)
841.50 s
Downloading cached python3.14-ptyprocess from https://cache.nix-ci.com
841.51 s
Downloaded cached python3.14-ply (597 KiB) in 47ms
841.51 s
Progress: 249 of 573 built, 930 of 1199 downloaded from cache (15 downloading)
841.51 s
Downloading cached python3.14-pure-eval from https://cache.nix-ci.com
841.52 s
Downloaded cached python3.14-preshed (505 KiB) in 51ms
841.52 s
Progress: 249 of 572 built, 931 of 1199 downloaded from cache (15 downloading)
841.52 s
Downloading cached python3.14-jsonpath-ng from https://cache.nix-ci.com
841.52 s
Downloaded cached python3.14-prometheus-client (789 KiB) in 52ms
841.52 s
Progress: 249 of 571 built, 932 of 1199 downloaded from cache (15 downloading)
841.52 s
Downloading cached python3.14-py-cpuinfo-9.0.0-unstable-2022-11 from https://cache.nix-ci.com
841.54 s
Downloaded cached python3.14-psutil (1.2 MiB) in 59ms
841.54 s
Progress: 249 of 570 built, 933 of 1199 downloaded from cache (15 downloading)
841.54 s
Downloading cached python3.14-pyasn1-modules from https://cache.nix-ci.com
841.54 s
Downloaded cached python3.14-psycopg-pool (491 KiB) in 47ms
841.54 s
Progress: 249 of 569 built, 934 of 1199 downloaded from cache (15 downloading)
841.54 s
Downloading cached python3.14-joblib from https://cache.nix-ci.com
841.55 s
Downloaded cached python3.14-ptyprocess (125 KiB) in 43ms
841.55 s
Progress: 249 of 568 built, 935 of 1199 downloaded from cache (15 downloading)
841.55 s
Downloading cached python3.14-pyclipper from https://cache.nix-ci.com
841.55 s
Downloaded cached python3.14-pure-eval (114 KiB) in 41ms
841.55 s
Progress: 249 of 567 built, 936 of 1199 downloaded from cache (15 downloading)
841.55 s
Downloading cached python3.14-pexpect from https://cache.nix-ci.com
841.56 s
Downloaded cached python3.14-psycopg2 (816 KiB) in 59ms
841.56 s
Progress: 249 of 566 built, 937 of 1199 downloaded from cache (15 downloading)
841.56 s
Downloading cached python3.14-pydantic-core from https://cache.nix-ci.com
841.57 s
Downloaded cached python3.14-py-cpuinfo-9.0.0-unstable-2022-11 (315 KiB) in 45ms
841.57 s
Progress: 249 of 565 built, 938 of 1199 downloaded from cache (15 downloading)
841.57 s
Downloading cached python3.14-pyhamcrest from https://cache.nix-ci.com
841.57 s
Downloaded cached python3.14-jsonpath-ng (783 KiB) in 53ms
841.57 s
Progress: 249 of 565 built, 939 of 1199 downloaded from cache (15 downloading)
841.57 s
Downloading cached python3.14-pyjwt from https://cache.nix-ci.com
841.60 s
Downloaded cached python3.14-priority (74 KiB) in 132ms
841.60 s
Progress: 249 of 564 built, 940 of 1199 downloaded from cache (15 downloading)
841.60 s
Downloading cached python3.14-pynacl from https://cache.nix-ci.com
841.60 s
Downloaded cached python3.14-pyclipper (391 KiB) in 54ms
841.60 s
Progress: 249 of 563 built, 941 of 1199 downloaded from cache (15 downloading)
841.60 s
Downloading cached python3.14-pyparsing from https://cache.nix-ci.com
841.61 s
Downloaded cached python3.14-pexpect (637 KiB) in 55ms
841.61 s
Progress: 249 of 563 built, 942 of 1199 downloaded from cache (15 downloading)
841.61 s
Downloading cached python3.14-pypdfium2 from https://cache.nix-ci.com
841.62 s
Downloaded cached python3.14-pyjwt (414 KiB) in 48ms
841.62 s
Progress: 249 of 562 built, 943 of 1199 downloaded from cache (15 downloading)
841.62 s
Downloading cached python3.14-pyproject-hooks from https://cache.nix-ci.com
841.62 s
Downloaded cached python3.14-psycopg-c (7.6 MiB) in 134ms
841.62 s
Progress: 249 of 561 built, 944 of 1199 downloaded from cache (15 downloading)
841.62 s
Downloading cached python3.14-pypugjs from https://cache.nix-ci.com
841.63 s
Downloaded cached python3.14-pyhamcrest (565 KiB) in 57ms
841.63 s
Downloaded cached python3.14-pyasn1-modules (2.9 MiB) in 87ms
841.63 s
Progress: 249 of 560 built, 945 of 1199 downloaded from cache (15 downloading)
841.63 s
Downloading cached python3.14-psycopg from https://cache.nix-ci.com
841.63 s
Progress: 249 of 559 built, 946 of 1199 downloaded from cache (15 downloading)
841.63 s
Downloading cached python3.14-pytest from https://cache.nix-ci.com
841.65 s
Downloaded cached python3.14-joblib (2.9 MiB) in 105ms
841.65 s
Progress: 249 of 558 built, 947 of 1199 downloaded from cache (15 downloading)
841.65 s
Downloading cached python3.14-pytest-asyncio from https://cache.nix-ci.com
841.66 s
Downloaded cached python3.14-pyparsing (942 KiB) in 59ms
841.66 s
Progress: 249 of 557 built, 948 of 1199 downloaded from cache (15 downloading)
841.66 s
Downloaded cached python3.14-pynacl (1.1 MiB) in 60ms
841.66 s
Downloading cached python3.14-nltk from https://cache.nix-ci.com
841.66 s
Progress: 249 of 557 built, 949 of 1199 downloaded from cache (15 downloading)
841.66 s
Downloading cached gixy from https://cache.nix-ci.com
841.66 s
Downloaded cached python3.14-pyproject-hooks (113 KiB) in 42ms
841.66 s
Progress: 249 of 556 built, 950 of 1199 downloaded from cache (15 downloading)
841.67 s
Downloading cached python3.14-pytest-benchmark from https://cache.nix-ci.com
841.67 s
Downloaded cached python3.14-pypdfium2 (1.4 MiB) in 65ms
841.67 s
Progress: 249 of 556 built, 951 of 1199 downloaded from cache (15 downloading)
841.67 s
Downloading cached python3.14-build from https://cache.nix-ci.com
841.69 s
Downloaded cached python3.14-pypugjs (638 KiB) in 65ms
841.69 s
Progress: 249 of 555 built, 952 of 1199 downloaded from cache (15 downloading)
841.69 s
Downloading cached python3.14-python-dotenv from https://cache.nix-ci.com
841.69 s
Downloaded cached python3.14-pytest-asyncio (175 KiB) in 40ms
841.69 s
Progress: 249 of 554 built, 953 of 1199 downloaded from cache (15 downloading)
841.69 s
Downloading cached python3.14-python-gnupg from https://cache.nix-ci.com
841.72 s
Downloaded cached python3.14-psycopg (3.1 MiB) in 91ms
841.72 s
Progress: 249 of 553 built, 954 of 1199 downloaded from cache (15 downloading)
841.72 s
Downloaded cached python3.14-pytest-benchmark (485 KiB) in 54ms
841.72 s
Downloading cached python3.14-python-ipware from https://cache.nix-ci.com
841.72 s
Progress: 249 of 552 built, 955 of 1199 downloaded from cache (15 downloading)
841.72 s
Downloading cached python3.14-python-magic from https://cache.nix-ci.com
841.72 s
Downloaded cached python3.14-build (353 KiB) in 49ms
841.72 s
Progress: 249 of 551 built, 956 of 1199 downloaded from cache (15 downloading)
841.72 s
Downloading cached python3.14-python-multipart from https://cache.nix-ci.com
841.73 s
Downloaded cached gixy (624 KiB) in 63ms
841.73 s
Progress: 249 of 551 built, 957 of 1199 downloaded from cache (15 downloading)
841.73 s
Downloading cached python3.14-qrcode from https://cache.nix-ci.com
841.73 s
Downloaded cached python3.14-python-dotenv (191 KiB) in 43ms
841.73 s
Progress: 249 of 550 built, 958 of 1199 downloaded from cache (15 downloading)
841.73 s
Downloading cached python3.14-rapidfuzz from https://cache.nix-ci.com
841.74 s
Downloaded cached python3.14-python-gnupg (277 KiB) in 46ms
841.74 s
Progress: 249 of 549 built, 959 of 1199 downloaded from cache (15 downloading)
841.74 s
Downloading cached python3.14-redis from https://cache.nix-ci.com
841.76 s
Downloaded cached python3.14-python-ipware (67 KiB) in 41ms
841.76 s
Progress: 249 of 548 built, 960 of 1199 downloaded from cache (15 downloading)
841.76 s
Downloading cached python3.14-requests-oauthlib from https://cache.nix-ci.com
841.76 s
Downloaded cached python3.14-python-magic (98 KiB) in 40ms
841.76 s
Progress: 249 of 547 built, 961 of 1199 downloaded from cache (15 downloading)
841.76 s
Downloading cached python3.14-rpds-py from https://cache.nix-ci.com
841.77 s
Downloaded cached python3.14-python-multipart (297 KiB) in 43ms
841.77 s
Progress: 249 of 546 built, 962 of 1199 downloaded from cache (15 downloading)
841.77 s
Downloading cached python3.14-safetensors from https://cache.nix-ci.com
841.77 s
Downloaded cached python3.14-pytest (5 MiB) in 141ms
841.77 s
Progress: 249 of 546 built, 963 of 1199 downloaded from cache (15 downloading)
841.77 s
Downloading cached python3.14-service-identity from https://cache.nix-ci.com
841.78 s
Downloaded cached python3.14-qrcode (546 KiB) in 50ms
841.78 s
Progress: 249 of 546 built, 964 of 1199 downloaded from cache (15 downloading)
841.78 s
Downloading cached pytest-check-hook from https://cache.nix-ci.com
841.78 s
Downloaded cached python3.14-pip (16.1 MiB) in 344ms
841.78 s
Progress: 249 of 545 built, 965 of 1199 downloaded from cache (15 downloading)
841.78 s
Downloading cached python3.14-setproctitle from https://cache.nix-ci.com
841.79 s
Downloaded cached python3.14-pydantic-core (5.4 MiB) in 228ms
841.79 s
Progress: 249 of 544 built, 966 of 1199 downloaded from cache (15 downloading)
841.79 s
Downloading cached python3.14-shapely from https://cache.nix-ci.com
841.81 s
Downloaded cached python3.14-requests-oauthlib (204 KiB) in 44ms
841.81 s
Progress: 249 of 543 built, 967 of 1199 downloaded from cache (15 downloading)
841.81 s
Downloading cached python3.14-shellingham from https://cache.nix-ci.com
841.81 s
Downloaded cached python3.14-service-identity (111 KiB) in 39ms
841.81 s
Progress: 249 of 542 built, 968 of 1199 downloaded from cache (15 downloading)
841.81 s
Downloading cached python3.14-sniffio from https://cache.nix-ci.com
841.82 s
Downloaded cached pytest-check-hook (4200 B) in 38ms
841.82 s
Progress: 249 of 541 built, 969 of 1199 downloaded from cache (15 downloading)
841.82 s
Downloading cached python3.14-sortedcontainers from https://cache.nix-ci.com
841.83 s
Downloaded cached python3.14-setproctitle (49 KiB) in 45ms
841.83 s
Progress: 249 of 540 built, 970 of 1199 downloaded from cache (15 downloading)
841.83 s
Downloading cached python3.14-spacy-legacy from https://cache.nix-ci.com
841.83 s
Downloaded cached python3.14-rpds-py (739 KiB) in 65ms
841.83 s
Progress: 249 of 539 built, 971 of 1199 downloaded from cache (15 downloading)
841.83 s
Downloading cached python3.14-sqlalchemy from https://cache.nix-ci.com
841.85 s
Downloaded cached python3.14-safetensors (1.1 MiB) in 80ms
841.85 s
Progress: 249 of 538 built, 972 of 1199 downloaded from cache (15 downloading)
841.85 s
Downloaded cached python3.14-shellingham (64 KiB) in 42ms
841.85 s
Downloading cached python3.14-referencing from https://cache.nix-ci.com
841.85 s
Progress: 249 of 537 built, 973 of 1199 downloaded from cache (15 downloading)
841.85 s
Downloaded cached python3.14-sniffio (45 KiB) in 40ms
841.85 s
Downloading cached python3.14-sqlparse from https://cache.nix-ci.com
841.85 s
Progress: 249 of 536 built, 974 of 1199 downloaded from cache (15 downloading)
841.85 s
Downloading cached python3.14-srsly from https://cache.nix-ci.com
841.86 s
Downloaded cached python3.14-sortedcontainers (396 KiB) in 43ms
841.86 s
Progress: 249 of 535 built, 975 of 1199 downloaded from cache (15 downloading)
841.86 s
Downloading cached python3.14-stack-data from https://cache.nix-ci.com
841.88 s
Downloaded cached python3.14-spacy-legacy (311 KiB) in 55ms
841.88 s
Progress: 249 of 535 built, 976 of 1199 downloaded from cache (15 downloading)
841.88 s
Downloading cached python3.14-hypothesis from https://cache.nix-ci.com
842.12 s
Downloaded cached python3.14-referencing (429 KiB) in 264ms
842.12 s
Progress: 249 of 534 built, 977 of 1199 downloaded from cache (15 downloading)
842.12 s
Downloading cached python3.14-starlette from https://cache.nix-ci.com
842.12 s
Downloaded cached python3.14-stack-data (255 KiB) in 256ms
842.12 s
Progress: 249 of 533 built, 978 of 1199 downloaded from cache (15 downloading)
842.12 s
Downloading cached python3.14-jsonschema-specifications from https://cache.nix-ci.com
842.12 s
Downloaded cached python3.14-pdfminer-six (10 MiB) in 689ms
842.12 s
Progress: 249 of 532 built, 979 of 1199 downloaded from cache (15 downloading)
842.12 s
Downloading cached python3.14-tantivy from https://cache.nix-ci.com
842.13 s
Downloaded cached python3.14-sqlparse (567 KiB) in 272ms
842.13 s
Progress: 249 of 531 built, 980 of 1199 downloaded from cache (15 downloading)
842.13 s
Downloading cached python3.14-tenacity from https://cache.nix-ci.com
842.13 s
Downloaded cached python3.14-redis (8.4 MiB) in 392ms
842.13 s
Progress: 249 of 530 built, 981 of 1199 downloaded from cache (15 downloading)
842.13 s
Downloading cached python3.14-threadpoolctl from https://cache.nix-ci.com
842.14 s
Downloaded cached python3.14-shapely (4.1 MiB) in 356ms
842.14 s
Progress: 249 of 529 built, 982 of 1199 downloaded from cache (15 downloading)
842.14 s
Downloading cached python3.14-portalocker from https://cache.nix-ci.com
842.15 s
Downloaded cached python3.14-rapidfuzz (12.7 MiB) in 419ms
842.15 s
Progress: 249 of 529 built, 983 of 1199 downloaded from cache (15 downloading)
842.15 s
Downloading cached python3.14-tika-client from https://cache.nix-ci.com
842.16 s
Downloaded cached python3.14-jsonschema-specifications (65 KiB) in 43ms
842.16 s
Progress: 249 of 528 built, 984 of 1199 downloaded from cache (15 downloading)
842.16 s
Downloading cached python3.14-tinytag from https://cache.nix-ci.com
842.17 s
Downloaded cached python3.14-tenacity (354 KiB) in 45ms
842.17 s
Progress: 249 of 527 built, 985 of 1199 downloaded from cache (15 downloading)
842.17 s
Downloading cached python3.14-jsonschema from https://cache.nix-ci.com
842.17 s
Downloaded cached python3.14-srsly (5.8 MiB) in 319ms
842.17 s
Progress: 249 of 526 built, 986 of 1199 downloaded from cache (15 downloading)
842.17 s
Downloading cached python3.14-tokenizers from https://cache.nix-ci.com
842.18 s
Downloaded cached python3.14-starlette (1.1 MiB) in 59ms
842.18 s
Progress: 249 of 525 built, 987 of 1199 downloaded from cache (15 downloading)
842.18 s
Downloading cached python3.14-traitlets from https://cache.nix-ci.com
842.18 s
Downloaded cached python3.14-threadpoolctl (184 KiB) in 46ms
842.18 s
Progress: 249 of 525 built, 988 of 1199 downloaded from cache (15 downloading)
842.18 s
Downloading cached python3.14-trove-classifiers from https://cache.nix-ci.com
842.19 s
Downloaded cached python3.14-portalocker (230 KiB) in 46ms
842.19 s
Progress: 249 of 524 built, 989 of 1199 downloaded from cache (15 downloading)
842.19 s
Downloading cached python3.14-txaio from https://cache.nix-ci.com
842.19 s
Downloaded cached python3.14-hypothesis (6.3 MiB) in 308ms
842.19 s
Progress: 249 of 523 built, 990 of 1199 downloaded from cache (15 downloading)
842.19 s
Downloading cached python3.14-concurrent-log-handler from https://cache.nix-ci.com
842.20 s
Downloaded cached python3.14-tika-client (249 KiB) in 46ms
842.20 s
Progress: 249 of 522 built, 991 of 1199 downloaded from cache (15 downloading)
842.20 s
Downloading cached python3.14-typer from https://cache.nix-ci.com
842.22 s
Downloaded cached python3.14-trove-classifiers (173 KiB) in 42ms
842.22 s
Progress: 249 of 521 built, 992 of 1199 downloaded from cache (15 downloading)
842.22 s
Downloading cached python3.14-types-pyyaml from https://cache.nix-ci.com
842.23 s
Downloaded cached python3.14-traitlets (1.2 MiB) in 54ms
842.23 s
Progress: 249 of 521 built, 993 of 1199 downloaded from cache (15 downloading)
842.23 s
Downloaded cached python3.14-jsonschema (1.4 MiB) in 60ms
842.23 s
Downloading cached python3.14-hatchling from https://cache.nix-ci.com
842.23 s
Progress: 249 of 520 built, 994 of 1199 downloaded from cache (15 downloading)
842.23 s
Downloaded cached python3.14-txaio (204 KiB) in 41ms
842.23 s
Downloading cached python3.14-matplotlib-inline from https://cache.nix-ci.com
842.23 s
Progress: 249 of 519 built, 995 of 1199 downloaded from cache (15 downloading)
842.24 s
Downloading cached python3.14-flasgger from https://cache.nix-ci.com
842.24 s
Downloaded cached python3.14-concurrent-log-handler (241 KiB) in 42ms
842.24 s
Progress: 249 of 518 built, 996 of 1199 downloaded from cache (15 downloading)
842.24 s
Downloading cached python3.14-autobahn from https://cache.nix-ci.com
842.25 s
Downloaded cached python3.14-typer (882 KiB) in 46ms
842.25 s
Progress: 249 of 517 built, 997 of 1199 downloaded from cache (15 downloading)
842.25 s
Downloading cached python3.14-types-toml from https://cache.nix-ci.com
842.25 s
Downloaded cached python3.14-nltk (19.3 MiB) in 590ms
842.25 s
Progress: 249 of 516 built, 998 of 1199 downloaded from cache (15 downloading)
842.25 s
Downloading cached python3.14-typing-inspect-0.9.0-unstable-2025-10 from https://cache.nix-ci.com
842.25 s
Downloaded cached python3.14-tantivy (9.1 MiB) in 134ms
842.26 s
Progress: 249 of 515 built, 999 of 1199 downloaded from cache (15 downloading)
842.26 s
Downloading cached python3.14-typing-inspection from https://cache.nix-ci.com
842.26 s
Downloaded cached python3.14-tinytag (3.9 MiB) in 97ms
842.26 s
Progress: 249 of 514 built, 1000 of 1199 downloaded from cache (15 downloading)
842.26 s
Downloading cached python3.14-tzdata from https://cache.nix-ci.com
842.27 s
Downloaded cached python3.14-types-pyyaml (71 KiB) in 42ms
842.27 s
Progress: 249 of 513 built, 1001 of 1199 downloaded from cache (15 downloading)
842.27 s
Downloading cached python3.14-tzlocal from https://cache.nix-ci.com
842.27 s
Downloaded cached python3.14-matplotlib-inline (62 KiB) in 40ms
842.27 s
Progress: 249 of 513 built, 1002 of 1199 downloaded from cache (15 downloading)
842.27 s
Downloading cached python3.14-uharfbuzz from https://cache.nix-ci.com
842.29 s
Downloaded cached python3.14-types-toml (12 KiB) in 39ms
842.29 s
Progress: 249 of 512 built, 1003 of 1199 downloaded from cache (15 downloading)
842.29 s
Downloading cached python3.14-unidiff from https://cache.nix-ci.com
842.29 s
Downloaded cached python3.14-hatchling (1.2 MiB) in 54ms
842.29 s
Progress: 249 of 512 built, 1004 of 1199 downloaded from cache (15 downloading)
842.29 s
Downloading cached python3.14-responses from https://cache.nix-ci.com
842.29 s
Downloaded cached python3.14-language-data (28.1 MiB) in 924ms
842.29 s
Progress: 249 of 511 built, 1005 of 1199 downloaded from cache (15 downloading)
842.29 s
Downloading cached python3.14-hatch-fancy-pypi-readme from https://cache.nix-ci.com
842.29 s
Downloaded cached python3.14-typing-inspect-0.9.0-unstable-2025-10 (102 KiB) in 38ms
842.29 s
Progress: 249 of 510 built, 1006 of 1199 downloaded from cache (15 downloading)
842.29 s
Downloading cached python3.14-langcodes from https://cache.nix-ci.com
842.30 s
Downloaded cached python3.14-typing-inspection (132 KiB) in 41ms
842.30 s
Progress: 249 of 509 built, 1007 of 1199 downloaded from cache (15 downloading)
842.30 s
Downloading cached python3.14-dataclasses-json from https://cache.nix-ci.com
842.30 s
Downloaded cached python3.14-tokenizers (8.1 MiB) in 126ms
842.30 s
Progress: 249 of 508 built, 1008 of 1199 downloaded from cache (15 downloading)
842.30 s
Downloading cached python3.14-pydantic from https://cache.nix-ci.com
842.31 s
Downloaded cached python3.14-tzlocal (167 KiB) in 41ms
842.31 s
Progress: 249 of 507 built, 1009 of 1199 downloaded from cache (15 downloading)
842.31 s
Downloading cached python3.14-transformers from https://cache.nix-ci.com
842.31 s
Downloaded cached python3.14-jedi (17.3 MiB) in 846ms
842.31 s
Progress: 249 of 506 built, 1010 of 1199 downloaded from cache (15 downloading)
842.32 s
Downloading cached python3.14-dateparser from https://cache.nix-ci.com
842.32 s
Downloaded cached python3.14-sqlalchemy (27.9 MiB) in 493ms
842.32 s
Progress: 249 of 505 built, 1011 of 1199 downloaded from cache (15 downloading)
842.32 s
Downloading cached python3.14-uritemplate from https://cache.nix-ci.com
842.33 s
Downloaded cached python3.14-unidiff (140 KiB) in 40ms
842.33 s
Progress: 249 of 504 built, 1012 of 1199 downloaded from cache (15 downloading)
842.33 s
Downloading cached python3.14-alembic from https://cache.nix-ci.com
842.33 s
Downloaded cached python3.14-responses (330 KiB) in 40ms
842.33 s
Progress: 249 of 503 built, 1013 of 1199 downloaded from cache (15 downloading)
842.33 s
Downloading cached python3.14-uvicorn from https://cache.nix-ci.com
842.33 s
Downloaded cached python3.14-hatch-fancy-pypi-readme (76 KiB) in 41ms
842.33 s
Progress: 249 of 503 built, 1014 of 1199 downloaded from cache (15 downloading)
842.33 s
Downloading cached python3.14-uvloop from https://cache.nix-ci.com
842.34 s
Downloaded cached python3.14-dataclasses-json (278 KiB) in 39ms
842.34 s
Progress: 249 of 502 built, 1015 of 1199 downloaded from cache (15 downloading)
842.34 s
Downloading cached python3.14-vine from https://cache.nix-ci.com
842.34 s
Downloaded cached python3.14-tzdata (713 KiB) in 78ms
842.34 s
Progress: 249 of 501 built, 1016 of 1199 downloaded from cache (15 downloading)
842.34 s
Downloading cached python3.14-wasabi from https://cache.nix-ci.com
842.34 s
Downloaded cached python3.14-langcodes (1.5 MiB) in 52ms
842.34 s
Progress: 249 of 500 built, 1017 of 1199 downloaded from cache (15 downloading)
842.35 s
Downloading cached python3.14-django from https://cache.nix-ci.com
842.35 s
Downloaded cached python3.14-autobahn (7.8 MiB) in 116ms
842.35 s
Progress: 249 of 499 built, 1018 of 1199 downloaded from cache (15 downloading)
842.35 s
Downloading cached python3.14-pandas from https://cache.nix-ci.com
842.37 s
Downloaded cached python3.14-uritemplate (133 KiB) in 40ms
842.37 s
Progress: 249 of 498 built, 1019 of 1199 downloaded from cache (15 downloading)
842.37 s
Downloading cached python3.14-watchfiles from https://cache.nix-ci.com
842.38 s
Downloaded cached python3.14-vine (78 KiB) in 44ms
842.38 s
Progress: 249 of 497 built, 1020 of 1199 downloaded from cache (15 downloading)
842.38 s
Downloading cached python3.14-wcwidth from https://cache.nix-ci.com
842.39 s
Downloaded cached python3.14-uharfbuzz (4.2 MiB) in 112ms
842.39 s
Progress: 249 of 496 built, 1021 of 1199 downloaded from cache (15 downloading)
842.39 s
Downloading cached python3.14-amqp from https://cache.nix-ci.com
842.39 s
Downloaded cached python3.14-wasabi (284 KiB) in 45ms
842.39 s
Progress: 249 of 495 built, 1022 of 1199 downloaded from cache (15 downloading)
842.39 s
Downloading cached python3.14-wheel from https://cache.nix-ci.com
842.39 s
Downloaded cached python3.14-uvicorn (982 KiB) in 60ms
842.39 s
Progress: 249 of 494 built, 1023 of 1199 downloaded from cache (15 downloading)
842.39 s
Downloading cached python3.14-whitenoise from https://cache.nix-ci.com
842.40 s
Downloaded cached python3.14-botocore (110.9 MiB) in 1.0s
842.40 s
Progress: 249 of 494 built, 1024 of 1199 downloaded from cache (15 downloading)
842.40 s
Downloading cached python3.14-whoosh-compat from https://cache.nix-ci.com
842.42 s
Downloaded cached python3.14-alembic (3.4 MiB) in 93ms
842.42 s
Progress: 249 of 494 built, 1025 of 1199 downloaded from cache (15 downloading)
842.42 s
Downloaded cached python3.14-pydantic (6.1 MiB) in 121ms
842.42 s
Downloading cached python3.14-s3transfer from https://cache.nix-ci.com
842.42 s
Progress: 249 of 493 built, 1026 of 1199 downloaded from cache (15 downloading)
842.42 s
Downloading cached python3.14-wrapt from https://cache.nix-ci.com
842.43 s
Downloaded cached python3.14-uvloop (2.2 MiB) in 95ms
842.43 s
Progress: 249 of 492 built, 1027 of 1199 downloaded from cache (15 downloading)
842.43 s
Downloading cached python3.14-fastapi from https://cache.nix-ci.com
842.43 s
Downloaded cached python3.14-dateparser (3.7 MiB) in 116ms
842.43 s
Progress: 249 of 492 built, 1028 of 1199 downloaded from cache (15 downloading)
842.43 s
Downloading cached python3.14-ollama from https://cache.nix-ci.com
842.44 s
Downloaded cached python3.14-wheel (348 KiB) in 47ms
842.44 s
Progress: 249 of 491 built, 1029 of 1199 downloaded from cache (15 downloading)
842.44 s
Downloaded cached python3.14-whitenoise (200 KiB) in 45ms
842.44 s
Downloading cached python3.14-openai from https://cache.nix-ci.com
842.44 s
Progress: 249 of 491 built, 1030 of 1199 downloaded from cache (15 downloading)
842.44 s
Downloading cached pypa-build-hook.sh from https://cache.nix-ci.com
842.44 s
Downloaded cached python3.14-amqp (583 KiB) in 50ms
842.44 s
Progress: 249 of 490 built, 1031 of 1199 downloaded from cache (15 downloading)
842.44 s
Downloading cached python-relax-deps-hook from https://cache.nix-ci.com
842.44 s
Downloaded cached python3.14-watchfiles (1 MiB) in 73ms
842.44 s
Progress: 249 of 489 built, 1032 of 1199 downloaded from cache (15 downloading)
842.44 s
Downloading cached python3.14-kombu from https://cache.nix-ci.com
842.45 s
Downloaded cached python3.14-flasgger (13.4 MiB) in 216ms
842.45 s
Progress: 249 of 488 built, 1033 of 1199 downloaded from cache (15 downloading)
842.45 s
Downloading cached python3.14-pydantic-settings from https://cache.nix-ci.com
842.46 s
Downloaded cached python3.14-whoosh-compat (1.5 MiB) in 59ms
842.46 s
Progress: 249 of 488 built, 1034 of 1199 downloaded from cache (15 downloading)
842.46 s
Downloading cached python3.14-httpbin from https://cache.nix-ci.com
842.46 s
Downloaded cached python3.14-wcwidth (6.7 MiB) in 81ms
842.46 s
Progress: 249 of 487 built, 1035 of 1199 downloaded from cache (15 downloading)
842.46 s
Downloading cached python3.14-thinc from https://cache.nix-ci.com
842.47 s
Downloaded cached python3.14-wrapt (679 KiB) in 46ms
842.47 s
Progress: 249 of 486 built, 1036 of 1199 downloaded from cache (15 downloading)
842.47 s
Downloading cached python3.14-prompt-toolkit from https://cache.nix-ci.com
842.47 s
Downloaded cached python3.14-s3transfer (994 KiB) in 50ms
842.47 s
Progress: 249 of 485 built, 1037 of 1199 downloaded from cache (15 downloading)
842.47 s
Downloading cached python3.14-deprecated from https://cache.nix-ci.com
842.47 s
Downloaded cached python3.14-ollama (294 KiB) in 42ms
842.47 s
Progress: 249 of 485 built, 1038 of 1199 downloaded from cache (15 downloading)
842.47 s
Downloading cached python3.14-boto3 from https://cache.nix-ci.com
842.47 s
Downloaded cached pypa-build-hook.sh (1488 B) in 37ms
842.47 s
Progress: 249 of 484 built, 1039 of 1199 downloaded from cache (15 downloading)
842.48 s
Downloading cached python3.14-smart-open from https://cache.nix-ci.com
842.48 s
Downloaded cached python-relax-deps-hook (4072 B) in 38ms
842.48 s
Progress: 249 of 483 built, 1040 of 1199 downloaded from cache (15 downloading)
842.48 s
Downloading cached python3.14-xattr from https://cache.nix-ci.com
842.49 s
Downloaded cached python3.14-fastapi (2.2 MiB) in 63ms
842.49 s
Progress: 249 of 482 built, 1041 of 1199 downloaded from cache (15 downloading)
842.49 s
Downloading cached python3.14-xmltodict from https://cache.nix-ci.com
842.50 s
Downloaded cached python3.14-pydantic-settings (671 KiB) in 50ms
842.50 s
Progress: 249 of 482 built, 1042 of 1199 downloaded from cache (15 downloading)
842.50 s
Downloading cached python3.14-zxing-cpp from https://cache.nix-ci.com
842.51 s
Downloaded cached python3.14-httpbin (363 KiB) in 49ms
842.51 s
Progress: 249 of 482 built, 1043 of 1199 downloaded from cache (15 downloading)
842.51 s
Downloading cached qemu-host-cpu-only-11.1.1-ga from https://cache.nix-ci.com
842.51 s
Downloaded cached python3.14-deprecated (92 KiB) in 39ms
842.51 s
Progress: 249 of 481 built, 1044 of 1199 downloaded from cache (15 downloading)
842.51 s
Downloading cached qhull from https://cache.nix-ci.com
842.52 s
Downloaded cached python3.14-kombu (2.6 MiB) in 77ms
842.52 s
Progress: 249 of 480 built, 1045 of 1199 downloaded from cache (15 downloading)
842.52 s
Downloading cached python3.14-banks from https://cache.nix-ci.com
842.52 s
Downloaded cached python3.14-xattr (143 KiB) in 45ms
842.52 s
Progress: 249 of 479 built, 1046 of 1199 downloaded from cache (15 downloading)
842.52 s
Downloading cached python3.14-celery from https://cache.nix-ci.com
842.53 s
Downloaded cached python3.14-smart-open (585 KiB) in 52ms
842.53 s
Progress: 249 of 479 built, 1047 of 1199 downloaded from cache (15 downloading)
842.53 s
Downloading cached mergerfs-tools from https://cache.nix-ci.com
842.53 s
Downloaded cached python3.14-xmltodict (95 KiB) in 40ms
842.53 s
Progress: 249 of 478 built, 1048 of 1199 downloaded from cache (15 downloading)
842.53 s
Downloading cached python3.14-llama-index-instrumentation from https://cache.nix-ci.com
842.53 s
Downloaded cached python3.14-boto3 (1.6 MiB) in 60ms
842.53 s
Progress: 249 of 478 built, 1049 of 1199 downloaded from cache (15 downloading)
842.54 s
Downloading cached python3.14-opentelemetry-api from https://cache.nix-ci.com
842.55 s
Downloaded cached python3.14-onnxruntime (70.4 MiB) in 1.1s
842.55 s
Progress: 249 of 477 built, 1050 of 1199 downloaded from cache (15 downloading)
842.55 s
Downloading cached python3.14-moto from https://cache.nix-ci.com
842.57 s
Downloaded cached python3.14-banks (354 KiB) in 48ms
842.57 s
Progress: 249 of 477 built, 1051 of 1199 downloaded from cache (15 downloading)
842.57 s
Downloading cached python3.14-pikepdf from https://cache.nix-ci.com
842.57 s
Downloaded cached mergerfs-tools (65 KiB) in 41ms
842.57 s
Progress: 249 of 476 built, 1052 of 1199 downloaded from cache (15 downloading)
842.57 s
Downloading cached python3.14-rapidocr from https://cache.nix-ci.com
842.60 s
Downloaded cached qemu-host-cpu-only-11.1.1-ga (1.1 MiB) in 90ms
842.60 s
Downloaded cached python3.14-llama-index-instrumentation (198 KiB) in 62ms
842.62 s
Downloaded cached python3.14-opentelemetry-api (759 KiB) in 79ms
842.62 s
Downloaded cached python3.14-prompt-toolkit (5.2 MiB) in 143ms
842.62 s
Downloaded cached python3.14-zxing-cpp (1.5 MiB) in 113ms
842.62 s
Downloaded cached python3.14-thinc (5.1 MiB) in 158ms
842.63 s
Building /nix/store/bdn02n4fw4nlza9wzzyw4rq18vllq9gw-mergerfs-tools-20230912_fish-completions.drv
842.63 s
Progress: 249 of 475 built (1 building), 1053 of 1199 downloaded from cache (15 downloading)
842.63 s
Progress: 249 of 475 built (1 building), 1054 of 1199 downloaded from cache (14 downloading)
842.63 s
Progress: 249 of 475 built (1 building), 1055 of 1199 downloaded from cache (13 downloading)
842.63 s
Progress: 249 of 475 built (1 building), 1056 of 1199 downloaded from cache (12 downloading)
842.63 s
Progress: 249 of 475 built (1 building), 1057 of 1199 downloaded from cache (11 downloading)
842.63 s
Progress: 249 of 475 built (1 building), 1058 of 1199 downloaded from cache (10 downloading)
842.63 s
Downloading cached python3.14-weasel from https://cache.nix-ci.com
842.63 s
Downloading cached qpdf-12.3.2-bin from https://cache.nix-ci.com
842.63 s
Downloading cached quirc from https://cache.nix-ci.com
842.63 s
Downloading cached quote from https://cache.nix-ci.com
842.64 s
Downloading cached redis from https://cache.nix-ci.com
842.64 s
Downloading cached re2-2025-11-05-dev from https://cache.nix-ci.com
842.65 s
Downloaded cached python3.14-pikepdf (2.7 MiB) in 83ms
842.67 s
Downloaded cached qhull (6.6 MiB) in 153ms
842.68 s
Downloaded cached python3.14-celery (5.4 MiB) in 151ms
842.68 s
Downloaded cached quirc (136 KiB) in 49ms
842.69 s
Downloaded cached re2-2025-11-05-dev (61 KiB) in 49ms
842.69 s
Downloaded cached qpdf-12.3.2-bin (290 KiB) in 54ms
842.69 s
Downloaded cached quote (142 KiB) in 55ms
842.70 s
Downloaded cached python3.14-weasel (514 KiB) in 63ms
842.70 s
Building /nix/store/4w22qv8j9nxjlc9jb6w66zjvcqrmrpjm-unit-qemu-guest-agent.service.drv
842.71 s
Progress: 249 of 469 built (2 building), 1059 of 1199 downloaded from cache (15 downloading)
842.71 s
Progress: 249 of 469 built (2 building), 1060 of 1199 downloaded from cache (14 downloading)
842.71 s
Progress: 249 of 469 built (2 building), 1061 of 1199 downloaded from cache (13 downloading)
842.71 s
Progress: 249 of 469 built (2 building), 1062 of 1199 downloaded from cache (12 downloading)
842.71 s
Progress: 249 of 469 built (2 building), 1063 of 1199 downloaded from cache (11 downloading)
842.71 s
Progress: 249 of 469 built (2 building), 1064 of 1199 downloaded from cache (10 downloading)
842.71 s
Progress: 249 of 469 built (2 building), 1065 of 1199 downloaded from cache (9 downloading)
842.71 s
Progress: 249 of 469 built (2 building), 1066 of 1199 downloaded from cache (8 downloading)
842.75 s
[mergerfs-tools-20230912_fish-completions:post-build] Uploading to the NixCI cache: /nix/store/ns56wg7xv98hj3nk0ffrs16g29rvfpql-mergerfs-tools-20230912_fish-completions
842.78 s
Downloaded cached python3.14-onnx (45.1 MiB) in 1.3s
842.79 s
Downloaded cached redis (5.7 MiB) in 156ms
842.80 s
[mergerfs-tools-20230912_fish-completions:post-build] warning: 'warn-short-path-literals' is deprecated, use 'lint-short-path-literals = ignore' instead
842.83 s
[mergerfs-tools-20230912_fish-completions:post-build] copying 0 paths...
842.89 s
[mergerfs-tools-20230912_fish-completions:post-build] warning: 'warn-short-path-literals' is deprecated, use 'lint-short-path-literals = ignore' instead
842.90 s
Downloaded cached python3.14-openai (18.7 MiB) in 459ms
842.96 s
[mergerfs-tools-20230912_fish-completions:post-build] copying 0 paths...
842.98 s
Uploaded mergerfs-tools-20230912_fish-completions in 267ms
842.98 s
Progress: 250 of 470 built (1 building), 1066 of 1199 downloaded from cache (8 downloading)
842.98 s
Built mergerfs-tools-20230912_fish-completions in 352ms
842.98 s
Downloading cached python3.14-ipython from https://cache.nix-ci.com
842.98 s
Downloading cached python3.14-llama-index-workflows from https://cache.nix-ci.com
842.98 s
Downloading cached python3.14-opentelemetry-semantic-conventions from https://cache.nix-ci.com
842.99 s
Downloading cached removeReferencesToRustToolchainHook from https://cache.nix-ci.com
842.99 s
Downloading cached removeReferencesToVendoredSourcesHook from https://cache.nix-ci.com
842.99 s
Downloading cached replaceCargoLockHook from https://cache.nix-ci.com
842.99 s
Downloading cached restic from https://cache.nix-ci.com
842.99 s
Downloading cached runc from https://cache.nix-ci.com
842.99 s
Progress: 250 of 465 built (1 building), 1067 of 1199 downloaded from cache (15 downloading)
842.99 s
Progress: 250 of 465 built (1 building), 1068 of 1199 downloaded from cache (14 downloading)
842.99 s
Progress: 250 of 465 built (1 building), 1069 of 1199 downloaded from cache (13 downloading)
842.99 s
[unit-qemu-guest-agent.service] structuredAttrs is enabled
842.99 s
Downloading cached python3.14-scipy from https://cache.nix-ci.com
842.99 s
Downloading cached python3.14-flower from https://cache.nix-ci.com
842.99 s
Downloading cached grpc from https://cache.nix-ci.com
842.99 s
Downloaded cached replaceCargoLockHook (1032 B) in 7ms
842.99 s
Downloaded cached removeReferencesToRustToolchainHook (1416 B) in 8ms
842.99 s
Downloaded cached removeReferencesToVendoredSourcesHook (2120 B) in 8ms
843.06 s
Building /nix/store/fndmprjjnsk0i62lp3l8i16qyf35g90d-redis-8.10.2_fish-completions.drv
843.07 s
Downloaded cached python3.14-llama-index-workflows (2.1 MiB) in 80ms
843.09 s
Downloaded cached python3.14-flower (2.3 MiB) in 103ms
843.09 s
Downloaded cached python3.14-opentelemetry-semantic-conventions (1.9 MiB) in 107ms
843.11 s
Building /nix/store/jm7116mm4s2va9sr8jw6fswq9l3mfpg0-unit-redis-immich.service.drv
843.16 s
Downloaded cached python3.14-ipython (6.6 MiB) in 180ms
843.17 s
Building /nix/store/cl4bpnrrbj0fi8g84bsll44qcg7qxg1s-unit-redis-paperless.service.drv
843.17 s
Progress: 250 of 463 built (4 building), 1070 of 1199 downloaded from cache (15 downloading)
843.17 s
Progress: 250 of 463 built (4 building), 1071 of 1199 downloaded from cache (14 downloading)
843.17 s
Progress: 250 of 463 built (4 building), 1072 of 1199 downloaded from cache (13 downloading)
843.17 s
Progress: 250 of 463 built (4 building), 1073 of 1199 downloaded from cache (12 downloading)
843.17 s
Progress: 250 of 463 built (4 building), 1074 of 1199 downloaded from cache (11 downloading)
843.17 s
Progress: 250 of 463 built (4 building), 1075 of 1199 downloaded from cache (10 downloading)
843.17 s
Progress: 250 of 463 built (4 building), 1076 of 1199 downloaded from cache (9 downloading)
843.18 s
Downloaded cached python3.14-django (37.5 MiB) in 836ms
843.21 s
[redis-8.10.2_fish-completions:post-build] Uploading to the NixCI cache: /nix/store/wfijvxicbyvmgk3sjp4jdlqcmbxvh313-redis-8.10.2_fish-completions
843.27 s
[redis-8.10.2_fish-completions:post-build] warning: 'warn-short-path-literals' is deprecated, use 'lint-short-path-literals = ignore' instead
843.31 s
[redis-8.10.2_fish-completions:post-build] copying 0 paths...
843.34 s
Downloaded cached runc (12.8 MiB) in 354ms
843.37 s
[redis-8.10.2_fish-completions:post-build] warning: 'warn-short-path-literals' is deprecated, use 'lint-short-path-literals = ignore' instead
843.44 s
Downloaded cached python3.14-pandas (100.7 MiB) in 1.0s
843.50 s
[redis-8.10.2_fish-completions:post-build] copying 0 paths...
843.53 s
Uploaded redis-8.10.2_fish-completions in 344ms
843.53 s
Progress: 251 of 464 built (3 building), 1076 of 1199 downloaded from cache (9 downloading)
843.53 s
Built redis-8.10.2_fish-completions in 471ms
843.56 s
[unit-qemu-guest-agent.service:post-build] Uploading to the NixCI cache: /nix/store/y63h3gqf9lsz6x4sfsck3q68qgmk4krq-unit-qemu-guest-agent.service
843.61 s
[unit-qemu-guest-agent.service:post-build] warning: 'warn-short-path-literals' is deprecated, use 'lint-short-path-literals = ignore' instead
843.64 s
[unit-qemu-guest-agent.service:post-build] copying 0 paths...
843.71 s
[unit-qemu-guest-agent.service:post-build] warning: 'warn-short-path-literals' is deprecated, use 'lint-short-path-literals = ignore' instead
843.73 s
Downloaded cached restic (48.4 MiB) in 746ms
843.74 s
Downloaded cached grpc (47.2 MiB) in 750ms
843.75 s
Downloaded cached python3.14-rapidocr (32.4 MiB) in 1.1s
843.75 s
Downloaded cached python3.14-transformers (163.8 MiB) in 1.4s
843.93 s
[unit-qemu-guest-agent.service:post-build] copying 0 paths...
843.96 s
Uploaded unit-qemu-guest-agent.service in 425ms
843.96 s
Progress: 252 of 465 built (2 building), 1076 of 1199 downloaded from cache (9 downloading)
843.96 s
Built unit-qemu-guest-agent.service in 1.2s
843.96 s
[unit-redis-immich.service] structuredAttrs is enabled
843.96 s
Downloading cached rustc from https://cache.nix-ci.com
843.97 s
Downloading cached sRGC.icc from https://cache.nix-ci.com
843.97 s
Downloading cached serde from https://cache.nix-ci.com
843.97 s
Downloading cached serde_core from https://cache.nix-ci.com
843.97 s
Downloading cached serde_derive from https://cache.nix-ci.com
843.97 s
Downloading cached serde_json from https://cache.nix-ci.com
843.97 s
Downloading cached serde_spanned from https://cache.nix-ci.com
843.97 s
Progress: 252 of 456 built (2 building), 1077 of 1199 downloaded from cache (15 downloading)
843.97 s
Progress: 252 of 456 built (2 building), 1078 of 1199 downloaded from cache (14 downloading)
843.97 s
Progress: 252 of 456 built (2 building), 1079 of 1199 downloaded from cache (13 downloading)
843.97 s
Progress: 252 of 456 built (2 building), 1080 of 1199 downloaded from cache (12 downloading)
843.97 s
Progress: 252 of 456 built (2 building), 1081 of 1199 downloaded from cache (11 downloading)
843.97 s
Progress: 252 of 456 built (2 building), 1082 of 1199 downloaded from cache (10 downloading)
843.97 s
Progress: 252 of 456 built (2 building), 1083 of 1199 downloaded from cache (9 downloading)
843.97 s
Downloaded cached python3.14-scipy (128.6 MiB) in 984ms
843.99 s
Downloaded cached sRGC.icc (22 KiB) in 26ms
843.99 s
Downloaded cached serde_derive (333 KiB) in 26ms
844.00 s
Downloaded cached serde (555 KiB) in 30ms
844.00 s
Downloaded cached serde_core (389 KiB) in 30ms
844.00 s
Downloaded cached serde_spanned (35 KiB) in 31ms
844.00 s
[unit-redis-immich.service:post-build] Uploading to the NixCI cache: /nix/store/cdpwd8ky8rax2ic17zvrp4mimrxdazym-unit-redis-immich.service
844.01 s
Downloaded cached serde_json (747 KiB) in 40ms
844.05 s
[unit-redis-immich.service:post-build] warning: 'warn-short-path-literals' is deprecated, use 'lint-short-path-literals = ignore' instead
844.06 s
Downloaded cached python3.14-moto (58.9 MiB) in 1.5s
844.08 s
[unit-redis-immich.service:post-build] copying 0 paths...
844.15 s
[unit-redis-immich.service:post-build] warning: 'warn-short-path-literals' is deprecated, use 'lint-short-path-literals = ignore' instead
844.39 s
[unit-redis-immich.service:post-build] copying 1 paths...
844.39 s
[unit-redis-immich.service:post-build] copying path '/nix/store/jm7116mm4s2va9sr8jw6fswq9l3mfpg0-unit-redis-immich.service.drv' to 'https://cache.nix-ci.com'...
844.55 s
Uploaded unit-redis-immich.service in 574ms
844.55 s
Progress: 253 of 457 built (1 building), 1083 of 1199 downloaded from cache (9 downloading)
844.55 s
Built unit-redis-immich.service in 1.4s
844.55 s
[unit-redis-paperless.service] structuredAttrs is enabled
844.55 s
Downloading cached python3.14-opentelemetry-sdk from https://cache.nix-ci.com
844.55 s
Downloading cached python3.14-pyvis from https://cache.nix-ci.com
844.55 s
Downloading cached server.toml from https://cache.nix-ci.com
844.55 s
Downloading cached setuptools-build-hook from https://cache.nix-ci.com
844.55 s
Downloading cached setuptools_trial from https://cache.nix-ci.com
844.55 s
Downloading cached shine-3.1.1-unstable-2023-01 from https://cache.nix-ci.com
844.55 s
Downloading cached simple-dark-gray-bootloader-2018-08 from https://cache.nix-ci.com
844.56 s
Downloaded cached server.toml (464 B) in 9ms
844.59 s
Downloaded cached setuptools-build-hook (1960 B) in 38ms
844.59 s
Downloaded cached simple-dark-gray-bootloader-2018-08 (4344 B) in 38ms
844.61 s
Downloaded cached shine-3.1.1-unstable-2023-01 (80 KiB) in 55ms
844.61 s
Downloaded cached setuptools_trial (6344 B) in 55ms
844.63 s
Downloaded cached python3.14-pyvis (3.9 MiB) in 75ms
844.64 s
Downloaded cached python3.14-opentelemetry-sdk (2.2 MiB) in 81ms
844.64 s
Building /nix/store/js6hr3jgz8xldqjmzpzfjldwnjhsg1qz-restic-backup-game-saves.drv
844.69 s
Building /nix/store/7l0q8840mbvk2hd7xlkv58hh6c6cnxyw-restic-forget-game-saves.drv
844.75 s
Building /nix/store/miwkfk7iqbb4f7l5538rq98ind3nb7l4-restic-game-saves-offsite.drv
844.80 s
Building /nix/store/82i3m0bzqx08ibvbsp6k85309rfl0jzm-restic-immich-offsite.drv
844.85 s
Building /nix/store/cg7wa3ajhgs7dn7sdrblk20cyq4rhl76-restic-nfs-small-offsite.drv
844.90 s
Building /nix/store/2lb8fkjn2alqf03jchfnway1ib891dxf-restic-paperless-offsite.drv
844.96 s
Building /nix/store/hy9i7ad8gc0w8j5zns7hyx4c8ziywxrn-restic-postgres-offsite.drv
845.01 s
Building /nix/store/53djp35gbramaxrmvb069pylsw2ax5rc-restic-romm-offsite.drv
845.06 s
Building /nix/store/2k5gb6lihl3bwxnybh6pj7spzvsca3qb-unit-script-restic-backups-game-saves-offsite-pre-start.drv
845.11 s
Building /nix/store/ars1ax2n9sn07gkmvkzryffx19m6yjy5-unit-script-restic-backups-immich-offsite-pre-start.drv
845.17 s
Building /nix/store/yg3yqv1gpkqrh531y4ha5h2hik2vqs9z-unit-script-restic-backups-nfs-small-offsite-pre-start.drv
845.21 s
Building /nix/store/4iayggvizyv31cv8cnipga0n6h0l7y1l-unit-script-restic-backups-paperless-offsite-pre-start.drv
845.27 s
Building /nix/store/sv0ycdxg1l7qa8qsddmva61gbfx6wj7g-unit-script-restic-backups-postgres-offsite-pre-start.drv
845.27 s
Progress: 253 of 452 built (14 building), 1084 of 1199 downloaded from cache (15 downloading)
845.27 s
Progress: 253 of 452 built (14 building), 1085 of 1199 downloaded from cache (14 downloading)
845.28 s
Progress: 253 of 452 built (14 building), 1086 of 1199 downloaded from cache (13 downloading)
845.28 s
Progress: 253 of 452 built (14 building), 1087 of 1199 downloaded from cache (12 downloading)
845.28 s
Progress: 253 of 452 built (14 building), 1088 of 1199 downloaded from cache (11 downloading)
845.28 s
Progress: 253 of 452 built (14 building), 1089 of 1199 downloaded from cache (10 downloading)
845.28 s
Progress: 253 of 452 built (14 building), 1090 of 1199 downloaded from cache (9 downloading)
845.28 s
Progress: 253 of 452 built (14 building), 1091 of 1199 downloaded from cache (8 downloading)
845.28 s
Progress: 253 of 452 built (14 building), 1092 of 1199 downloaded from cache (7 downloading)
845.28 s
Progress: 253 of 452 built (14 building), 1093 of 1199 downloaded from cache (6 downloading)
845.28 s
Progress: 253 of 452 built (14 building), 1094 of 1199 downloaded from cache (5 downloading)
845.28 s
Progress: 253 of 452 built (14 building), 1095 of 1199 downloaded from cache (4 downloading)
845.28 s
Progress: 253 of 452 built (14 building), 1096 of 1199 downloaded from cache (3 downloading)
845.28 s
Progress: 253 of 452 built (14 building), 1097 of 1199 downloaded from cache (2 downloading)
845.28 s
Progress: 253 of 452 built (14 building), 1098 of 1199 downloaded from cache (1 downloading)
845.28 s
[restic-backup-game-saves] structuredAttrs is enabled
845.28 s
[restic-forget-game-saves] structuredAttrs is enabled
845.28 s
[restic-game-saves-offsite] structuredAttrs is enabled
845.28 s
[restic-immich-offsite] structuredAttrs is enabled
845.28 s
[restic-nfs-small-offsite] structuredAttrs is enabled
845.28 s
[restic-paperless-offsite] structuredAttrs is enabled
845.28 s
[restic-postgres-offsite] structuredAttrs is enabled
845.28 s
[restic-romm-offsite] structuredAttrs is enabled
845.31 s
[unit-redis-paperless.service:post-build] Uploading to the NixCI cache: /nix/store/3jgprmhzyzcng955ggaxsksrg9hkhr09-unit-redis-paperless.service
845.36 s
[unit-redis-paperless.service:post-build] warning: 'warn-short-path-literals' is deprecated, use 'lint-short-path-literals = ignore' instead
845.39 s
[unit-redis-paperless.service:post-build] copying 0 paths...
845.46 s
[unit-redis-paperless.service:post-build] warning: 'warn-short-path-literals' is deprecated, use 'lint-short-path-literals = ignore' instead
845.71 s
[unit-redis-paperless.service:post-build] copying 1 paths...
845.72 s
[unit-redis-paperless.service:post-build] copying path '/nix/store/cl4bpnrrbj0fi8g84bsll44qcg7qxg1s-unit-redis-paperless.service.drv' to 'https://cache.nix-ci.com'...
845.86 s
Uploaded unit-redis-paperless.service in 574ms
845.86 s
Progress: 254 of 453 built (13 building), 1098 of 1199 downloaded from cache (1 downloading)
845.86 s
Built unit-redis-paperless.service in 2.6s
845.86 s
[unit-script-restic-backups-game-saves-offsite-pre-start] structuredAttrs is enabled
845.86 s
[unit-script-restic-backups-immich-offsite-pre-start] structuredAttrs is enabled
845.86 s
[unit-script-restic-backups-nfs-small-offsite-pre-start] structuredAttrs is enabled
845.86 s
[unit-script-restic-backups-paperless-offsite-pre-start] structuredAttrs is enabled
845.86 s
Downloading cached immich-machine-learning from https://cache.nix-ci.com
845.86 s
Downloading cached k3s from https://cache.nix-ci.com
845.86 s
Downloading cached podman-helper-binary-wrapper from https://cache.nix-ci.com
845.86 s
Downloading cached python3.14-channels from https://cache.nix-ci.com
845.86 s
Downloading cached python3.14-django-allauth from https://cache.nix-ci.com
845.86 s
Downloading cached python3.14-django-auditlog from https://cache.nix-ci.com
845.86 s
Downloading cached python3.14-django-cachalot from https://cache.nix-ci.com
845.86 s
Downloading cached python3.14-django-compression-middleware from https://cache.nix-ci.com
845.86 s
Downloading cached python3.14-django-cors-headers from https://cache.nix-ci.com
845.86 s
Downloading cached python3.14-django-filter from https://cache.nix-ci.com
845.86 s
Downloading cached python3.14-django-guardian from https://cache.nix-ci.com
845.86 s
Downloading cached python3.14-django-extensions from https://cache.nix-ci.com
845.86 s
Downloading cached python3.14-django-multiselectfield from https://cache.nix-ci.com
845.86 s
Downloading cached python3.14-django-rich from https://cache.nix-ci.com
845.86 s
Downloading cached python3.14-django-soft-delete from https://cache.nix-ci.com
845.90 s
Downloaded cached python3.14-django-compression-middleware (35 KiB) in 35ms
845.90 s
Downloaded cached podman-helper-binary-wrapper (8936 B) in 39ms
845.91 s
Downloaded cached python3.14-django-multiselectfield (95 KiB) in 47ms
845.91 s
Downloaded cached python3.14-django-soft-delete (156 KiB) in 47ms
845.91 s
Downloaded cached python3.14-django-filter (493 KiB) in 51ms
845.91 s
Downloaded cached python3.14-channels (315 KiB) in 51ms
845.92 s
Downloaded cached immich-machine-learning (573 KiB) in 55ms
845.92 s
Downloaded cached python3.14-django-cors-headers (87 KiB) in 55ms
845.92 s
Downloaded cached python3.14-django-rich (74 KiB) in 55ms
845.92 s
Downloaded cached python3.14-django-auditlog (429 KiB) in 58ms
845.93 s
Building /nix/store/digswp2c5zj67irn6hlqyingdk1madra-grub-config.xml.drv
845.93 s
Progress: 254 of 439 built (14 building), 1099 of 1199 downloaded from cache (15 downloading)
845.93 s
Progress: 254 of 439 built (14 building), 1100 of 1199 downloaded from cache (14 downloading)
845.93 s
Progress: 254 of 439 built (14 building), 1101 of 1199 downloaded from cache (13 downloading)
845.93 s
Progress: 254 of 439 built (14 building), 1102 of 1199 downloaded from cache (12 downloading)
845.93 s
Progress: 254 of 439 built (14 building), 1103 of 1199 downloaded from cache (11 downloading)
845.93 s
Progress: 254 of 439 built (14 building), 1104 of 1199 downloaded from cache (10 downloading)
845.93 s
Progress: 254 of 439 built (14 building), 1105 of 1199 downloaded from cache (9 downloading)
845.93 s
Progress: 254 of 439 built (14 building), 1106 of 1199 downloaded from cache (8 downloading)
845.93 s
Progress: 254 of 439 built (14 building), 1107 of 1199 downloaded from cache (7 downloading)
845.93 s
Progress: 254 of 439 built (14 building), 1108 of 1199 downloaded from cache (6 downloading)
845.93 s
Downloaded cached python3.14-django-cachalot (1.1 MiB) in 70ms
845.96 s
Downloaded cached python3.14-django-guardian (2.2 MiB) in 98ms
845.97 s
[restic-backup-game-saves:post-build] Uploading to the NixCI cache: /nix/store/pviclpmxj84n1vhikbj7519cdqrarvr6-restic-backup-game-saves
846.00 s
Downloaded cached python3.14-django-extensions (2.1 MiB) in 133ms
846.03 s
[restic-backup-game-saves:post-build] warning: 'warn-short-path-literals' is deprecated, use 'lint-short-path-literals = ignore' instead
846.12 s
Downloaded cached python3.14-django-allauth (11.8 MiB) in 262ms
846.17 s
[restic-backup-game-saves:post-build] copying 1 paths...
846.17 s
[restic-backup-game-saves:post-build] copying path '/nix/store/pviclpmxj84n1vhikbj7519cdqrarvr6-restic-backup-game-saves' to 'https://cache.nix-ci.com'...
846.36 s
[restic-backup-game-saves:post-build] warning: 'warn-short-path-literals' is deprecated, use 'lint-short-path-literals = ignore' instead
846.57 s
[restic-backup-game-saves:post-build] copying 1 paths...
846.57 s
[restic-backup-game-saves:post-build] copying path '/nix/store/js6hr3jgz8xldqjmzpzfjldwnjhsg1qz-restic-backup-game-saves.drv' to 'https://cache.nix-ci.com'...
846.71 s
Uploaded restic-backup-game-saves in 770ms
846.71 s
Progress: 255 of 440 built (13 building), 1108 of 1199 downloaded from cache (6 downloading)
846.71 s
Built restic-backup-game-saves in 2.0s
846.75 s
[restic-forget-game-saves:post-build] Uploading to the NixCI cache: /nix/store/kq6w4viipjgj548fnw2c1mipl1wls83z-restic-forget-game-saves
846.78 s
Downloaded cached k3s (88.3 MiB) in 915ms
846.79 s
[restic-forget-game-saves:post-build] warning: 'warn-short-path-literals' is deprecated, use 'lint-short-path-literals = ignore' instead
846.96 s
[restic-forget-game-saves:post-build] copying 1 paths...
846.96 s
[restic-forget-game-saves:post-build] copying path '/nix/store/kq6w4viipjgj548fnw2c1mipl1wls83z-restic-forget-game-saves' to 'https://cache.nix-ci.com'...
847.16 s
[restic-forget-game-saves:post-build] warning: 'warn-short-path-literals' is deprecated, use 'lint-short-path-literals = ignore' instead
847.35 s
[restic-forget-game-saves:post-build] copying 1 paths...
847.35 s
[restic-forget-game-saves:post-build] copying path '/nix/store/7l0q8840mbvk2hd7xlkv58hh6c6cnxyw-restic-forget-game-saves.drv' to 'https://cache.nix-ci.com'...
847.49 s
Uploaded restic-forget-game-saves in 769ms
847.49 s
Progress: 256 of 441 built (12 building), 1108 of 1199 downloaded from cache (6 downloading)
847.49 s
Built restic-forget-game-saves in 2.8s
847.52 s
[restic-game-saves-offsite:post-build] Uploading to the NixCI cache: /nix/store/imp5nl7xfj319d65mhgvfx9dkk5pxf0f-restic-game-saves-offsite
847.56 s
[restic-game-saves-offsite:post-build] warning: 'warn-short-path-literals' is deprecated, use 'lint-short-path-literals = ignore' instead
847.70 s
[restic-game-saves-offsite:post-build] copying 1 paths...
847.70 s
[restic-game-saves-offsite:post-build] copying path '/nix/store/imp5nl7xfj319d65mhgvfx9dkk5pxf0f-restic-game-saves-offsite' to 'https://cache.nix-ci.com'...
847.89 s
[restic-game-saves-offsite:post-build] warning: 'warn-short-path-literals' is deprecated, use 'lint-short-path-literals = ignore' instead
848.15 s
[restic-game-saves-offsite:post-build] copying 1 paths...
848.15 s
[restic-game-saves-offsite:post-build] copying path '/nix/store/miwkfk7iqbb4f7l5538rq98ind3nb7l4-restic-game-saves-offsite.drv' to 'https://cache.nix-ci.com'...
848.29 s
Uploaded restic-game-saves-offsite in 795ms
848.29 s
Progress: 257 of 442 built (11 building), 1108 of 1199 downloaded from cache (6 downloading)
848.29 s
Built restic-game-saves-offsite in 3.5s
848.33 s
[restic-immich-offsite:post-build] Uploading to the NixCI cache: /nix/store/rkvyikkwnim2vwakalq8d8ah2173rn2k-restic-immich-offsite
848.37 s
[restic-immich-offsite:post-build] warning: 'warn-short-path-literals' is deprecated, use 'lint-short-path-literals = ignore' instead
848.51 s
[restic-immich-offsite:post-build] copying 1 paths...
848.51 s
[restic-immich-offsite:post-build] copying path '/nix/store/rkvyikkwnim2vwakalq8d8ah2173rn2k-restic-immich-offsite' to 'https://cache.nix-ci.com'...
848.68 s
[restic-immich-offsite:post-build] warning: 'warn-short-path-literals' is deprecated, use 'lint-short-path-literals = ignore' instead
848.91 s
[restic-immich-offsite:post-build] copying 1 paths...
848.92 s
[restic-immich-offsite:post-build] copying path '/nix/store/82i3m0bzqx08ibvbsp6k85309rfl0jzm-restic-immich-offsite.drv' to 'https://cache.nix-ci.com'...
849.06 s
Uploaded restic-immich-offsite in 762ms
849.06 s
Progress: 258 of 443 built (10 building), 1108 of 1199 downloaded from cache (6 downloading)
849.06 s
Built restic-immich-offsite in 4.2s
849.10 s
[restic-nfs-small-offsite:post-build] Uploading to the NixCI cache: /nix/store/6hl07pylpmwwxq6300xgwrx51xmd37ps-restic-nfs-small-offsite
849.14 s
[restic-nfs-small-offsite:post-build] warning: 'warn-short-path-literals' is deprecated, use 'lint-short-path-literals = ignore' instead
849.28 s
[restic-nfs-small-offsite:post-build] copying 1 paths...
849.28 s
[restic-nfs-small-offsite:post-build] copying path '/nix/store/6hl07pylpmwwxq6300xgwrx51xmd37ps-restic-nfs-small-offsite' to 'https://cache.nix-ci.com'...
849.47 s
[restic-nfs-small-offsite:post-build] warning: 'warn-short-path-literals' is deprecated, use 'lint-short-path-literals = ignore' instead
849.71 s
[restic-nfs-small-offsite:post-build] copying 1 paths...
849.71 s
[restic-nfs-small-offsite:post-build] copying path '/nix/store/cg7wa3ajhgs7dn7sdrblk20cyq4rhl76-restic-nfs-small-offsite.drv' to 'https://cache.nix-ci.com'...
849.85 s
Uploaded restic-nfs-small-offsite in 777ms
849.85 s
Progress: 259 of 444 built (9 building), 1108 of 1199 downloaded from cache (6 downloading)
849.85 s
Built restic-nfs-small-offsite in 5.0s
849.89 s
[restic-paperless-offsite:post-build] Uploading to the NixCI cache: /nix/store/hs4ly10ladnk0krzhcr3q87xx91hs8rc-restic-paperless-offsite
849.93 s
[restic-paperless-offsite:post-build] warning: 'warn-short-path-literals' is deprecated, use 'lint-short-path-literals = ignore' instead
850.07 s
[restic-paperless-offsite:post-build] copying 1 paths...
850.07 s
[restic-paperless-offsite:post-build] copying path '/nix/store/hs4ly10ladnk0krzhcr3q87xx91hs8rc-restic-paperless-offsite' to 'https://cache.nix-ci.com'...
850.27 s
[restic-paperless-offsite:post-build] warning: 'warn-short-path-literals' is deprecated, use 'lint-short-path-literals = ignore' instead
850.45 s
Downloaded cached rustc (1 GiB) in 6.4s
850.49 s
[restic-paperless-offsite:post-build] copying 1 paths...
850.49 s
[restic-paperless-offsite:post-build] copying path '/nix/store/2lb8fkjn2alqf03jchfnway1ib891dxf-restic-paperless-offsite.drv' to 'https://cache.nix-ci.com'...
850.65 s
Uploaded restic-paperless-offsite in 785ms
850.65 s
Progress: 260 of 445 built (8 building), 1108 of 1199 downloaded from cache (6 downloading)
850.65 s
Built restic-paperless-offsite in 5.7s
850.68 s
[restic-postgres-offsite:post-build] Uploading to the NixCI cache: /nix/store/7csc8ynzn910ambxdmdm25lwg33h5b7h-restic-postgres-offsite
850.72 s
[restic-postgres-offsite:post-build] warning: 'warn-short-path-literals' is deprecated, use 'lint-short-path-literals = ignore' instead
850.87 s
[restic-postgres-offsite:post-build] copying 1 paths...
850.87 s
[restic-postgres-offsite:post-build] copying path '/nix/store/7csc8ynzn910ambxdmdm25lwg33h5b7h-restic-postgres-offsite' to 'https://cache.nix-ci.com'...
851.04 s
[restic-postgres-offsite:post-build] warning: 'warn-short-path-literals' is deprecated, use 'lint-short-path-literals = ignore' instead
851.28 s
[restic-postgres-offsite:post-build] copying 1 paths...
851.28 s
[restic-postgres-offsite:post-build] copying path '/nix/store/hy9i7ad8gc0w8j5zns7hyx4c8ziywxrn-restic-postgres-offsite.drv' to 'https://cache.nix-ci.com'...
851.42 s
Uploaded restic-postgres-offsite in 768ms
851.42 s
Progress: 261 of 446 built (7 building), 1108 of 1199 downloaded from cache (6 downloading)
851.42 s
Built restic-postgres-offsite in 6.4s
851.45 s
[restic-romm-offsite:post-build] Uploading to the NixCI cache: /nix/store/468rs3zjd7am3nxyr9njz3bgbkh69vzg-restic-romm-offsite
851.49 s
[restic-romm-offsite:post-build] warning: 'warn-short-path-literals' is deprecated, use 'lint-short-path-literals = ignore' instead
851.63 s
[restic-romm-offsite:post-build] copying 1 paths...
851.63 s
[restic-romm-offsite:post-build] copying path '/nix/store/468rs3zjd7am3nxyr9njz3bgbkh69vzg-restic-romm-offsite' to 'https://cache.nix-ci.com'...
851.81 s
[restic-romm-offsite:post-build] warning: 'warn-short-path-literals' is deprecated, use 'lint-short-path-literals = ignore' instead
852.03 s
[restic-romm-offsite:post-build] copying 1 paths...
852.03 s
[restic-romm-offsite:post-build] copying path '/nix/store/53djp35gbramaxrmvb069pylsw2ax5rc-restic-romm-offsite.drv' to 'https://cache.nix-ci.com'...
852.18 s
Uploaded restic-romm-offsite in 747ms
852.18 s
Progress: 262 of 447 built (6 building), 1108 of 1199 downloaded from cache (6 downloading)
852.18 s
Built restic-romm-offsite in 7.1s
852.21 s
[unit-script-restic-backups-game-saves-offsite-pre-start:post-build] Uploading to the NixCI cache: /nix/store/inr365fjlyc1y7ccamlcl7ma22zmsr37-unit-script-restic-backups-game-saves-offsite-pre-start
852.25 s
[unit-script-restic-backups-game-saves-offsite-pre-start:post-build] warning: 'warn-short-path-literals' is deprecated, use 'lint-short-path-literals = ignore' instead
852.38 s
[unit-script-restic-backups-game-saves-offsite-pre-start:post-build] copying 1 paths...
852.38 s
[unit-script-restic-backups-game-saves-offsite-pre-start:post-build] copying path '/nix/store/inr365fjlyc1y7ccamlcl7ma22zmsr37-unit-script-restic-backups-game-saves-offsite-pre-start' to 'https://cache.nix-ci.com'...
852.55 s
[unit-script-restic-backups-game-saves-offsite-pre-start:post-build] warning: 'warn-short-path-literals' is deprecated, use 'lint-short-path-literals = ignore' instead
852.72 s
[unit-script-restic-backups-game-saves-offsite-pre-start:post-build] copying 1 paths...
852.72 s
[unit-script-restic-backups-game-saves-offsite-pre-start:post-build] copying path '/nix/store/2k5gb6lihl3bwxnybh6pj7spzvsca3qb-unit-script-restic-backups-game-saves-offsite-pre-start.drv' to 'https://cache.nix-ci.com'...
852.85 s
Uploaded unit-script-restic-backups-game-saves-offsite-pre-start in 665ms
852.85 s
Progress: 263 of 448 built (5 building), 1108 of 1199 downloaded from cache (6 downloading)
852.85 s
Built unit-script-restic-backups-game-saves-offsite-pre-start in 7.7s
852.88 s
[unit-script-restic-backups-immich-offsite-pre-start:post-build] Uploading to the NixCI cache: /nix/store/x7ckw1qx3gm6bfly821wwh0s16x8skah-unit-script-restic-backups-immich-offsite-pre-start
852.92 s
[unit-script-restic-backups-immich-offsite-pre-start:post-build] warning: 'warn-short-path-literals' is deprecated, use 'lint-short-path-literals = ignore' instead
853.05 s
[unit-script-restic-backups-immich-offsite-pre-start:post-build] copying 1 paths...
853.05 s
[unit-script-restic-backups-immich-offsite-pre-start:post-build] copying path '/nix/store/x7ckw1qx3gm6bfly821wwh0s16x8skah-unit-script-restic-backups-immich-offsite-pre-start' to 'https://cache.nix-ci.com'...
853.23 s
[unit-script-restic-backups-immich-offsite-pre-start:post-build] warning: 'warn-short-path-literals' is deprecated, use 'lint-short-path-literals = ignore' instead
853.42 s
[unit-script-restic-backups-immich-offsite-pre-start:post-build] copying 1 paths...
853.42 s
[unit-script-restic-backups-immich-offsite-pre-start:post-build] copying path '/nix/store/ars1ax2n9sn07gkmvkzryffx19m6yjy5-unit-script-restic-backups-immich-offsite-pre-start.drv' to 'https://cache.nix-ci.com'...
853.56 s
Uploaded unit-script-restic-backups-immich-offsite-pre-start in 701ms
853.56 s
Progress: 264 of 449 built (4 building), 1108 of 1199 downloaded from cache (6 downloading)
853.56 s
Built unit-script-restic-backups-immich-offsite-pre-start in 8.4s
853.59 s
[unit-script-restic-backups-nfs-small-offsite-pre-start:post-build] Uploading to the NixCI cache: /nix/store/bnggx88n7a6vq1jpkapfp3i41zs8q6gp-unit-script-restic-backups-nfs-small-offsite-pre-start
853.63 s
[unit-script-restic-backups-nfs-small-offsite-pre-start:post-build] warning: 'warn-short-path-literals' is deprecated, use 'lint-short-path-literals = ignore' instead
853.77 s
[unit-script-restic-backups-nfs-small-offsite-pre-start:post-build] copying 1 paths...
853.77 s
[unit-script-restic-backups-nfs-small-offsite-pre-start:post-build] copying path '/nix/store/bnggx88n7a6vq1jpkapfp3i41zs8q6gp-unit-script-restic-backups-nfs-small-offsite-pre-start' to 'https://cache.nix-ci.com'...
853.96 s
[unit-script-restic-backups-nfs-small-offsite-pre-start:post-build] warning: 'warn-short-path-literals' is deprecated, use 'lint-short-path-literals = ignore' instead
854.16 s
[unit-script-restic-backups-nfs-small-offsite-pre-start:post-build] copying 1 paths...
854.16 s
[unit-script-restic-backups-nfs-small-offsite-pre-start:post-build] copying path '/nix/store/yg3yqv1gpkqrh531y4ha5h2hik2vqs9z-unit-script-restic-backups-nfs-small-offsite-pre-start.drv' to 'https://cache.nix-ci.com'...
854.30 s
Uploaded unit-script-restic-backups-nfs-small-offsite-pre-start in 738ms
854.30 s
Progress: 265 of 450 built (3 building), 1108 of 1199 downloaded from cache (6 downloading)
854.30 s
Built unit-script-restic-backups-nfs-small-offsite-pre-start in 9.1s
854.33 s
[unit-script-restic-backups-paperless-offsite-pre-start:post-build] Uploading to the NixCI cache: /nix/store/nsckw568g1d97sibx0jpbk8lh72kxdaq-unit-script-restic-backups-paperless-offsite-pre-start
854.37 s
[unit-script-restic-backups-paperless-offsite-pre-start:post-build] warning: 'warn-short-path-literals' is deprecated, use 'lint-short-path-literals = ignore' instead
854.50 s
[unit-script-restic-backups-paperless-offsite-pre-start:post-build] copying 1 paths...
854.50 s
[unit-script-restic-backups-paperless-offsite-pre-start:post-build] copying path '/nix/store/nsckw568g1d97sibx0jpbk8lh72kxdaq-unit-script-restic-backups-paperless-offsite-pre-start' to 'https://cache.nix-ci.com'...
854.68 s
[unit-script-restic-backups-paperless-offsite-pre-start:post-build] warning: 'warn-short-path-literals' is deprecated, use 'lint-short-path-literals = ignore' instead
854.84 s
[unit-script-restic-backups-paperless-offsite-pre-start:post-build] copying 1 paths...
854.84 s
[unit-script-restic-backups-paperless-offsite-pre-start:post-build] copying path '/nix/store/4iayggvizyv31cv8cnipga0n6h0l7y1l-unit-script-restic-backups-paperless-offsite-pre-start.drv' to 'https://cache.nix-ci.com'...
854.97 s
Uploaded unit-script-restic-backups-paperless-offsite-pre-start in 661ms
854.97 s
Progress: 266 of 451 built (2 building), 1108 of 1199 downloaded from cache (6 downloading)
854.97 s
Built unit-script-restic-backups-paperless-offsite-pre-start in 9.7s
854.97 s
[unit-script-restic-backups-postgres-offsite-pre-start] structuredAttrs is enabled
854.97 s
Downloading cached python3.14-django-treenode from https://cache.nix-ci.com
854.97 s
Downloading cached python3.14-djangorestframework from https://cache.nix-ci.com
854.97 s
Downloading cached python3.14-drf-spectacular-sidecar from https://cache.nix-ci.com
854.97 s
Downloading cached python3.14-googleapis-common-protos from https://cache.nix-ci.com
854.97 s
Downloading cached python3.14-img2pdf from https://cache.nix-ci.com
854.97 s
Downloading cached python3.14-scikit-learn from https://cache.nix-ci.com
854.97 s
Downloading cached source from https://cache.nix-ci.com
854.97 s
Downloading cached source from https://cache.nix-ci.com
854.97 s
Downloading cached source from https://cache.nix-ci.com
854.97 s
Downloading cached source from https://cache.nix-ci.com
854.98 s
Downloaded cached source (114 KiB) in 9ms
854.99 s
Downloaded cached python3.14-img2pdf (562 KiB) in 18ms
855.01 s
Downloaded cached python3.14-django-treenode (204 KiB) in 34ms
855.03 s
Downloaded cached source (270 KiB) in 51ms
855.06 s
Downloaded cached python3.14-googleapis-common-protos (1.1 MiB) in 82ms
855.08 s
Building /nix/store/xxlr8zhfyy3k8fapp6b37pbxarklzw8s-restic-game-saves-offsite_fish-completions.drv
855.08 s
Downloaded cached python3.14-djangorestframework (4 MiB) in 110ms
855.10 s
Downloaded cached python3.14-drf-spectacular-sidecar (9.1 MiB) in 129ms
855.13 s
Building /nix/store/3q50wn14xw3nzrl6g7z3bfk0mkphqsh3-restic-immich-offsite_fish-completions.drv
855.19 s
Building /nix/store/fgqs1w4ivvrpd66ypm5q52x6dzf0b9ky-restic-nfs-small-offsite_fish-completions.drv
855.24 s
Building /nix/store/ifwzsivqa2i5rr7abm34x8hyaxhrhhsv-restic-paperless-offsite_fish-completions.drv
855.30 s
Downloaded cached source (14.7 MiB) in 328ms
855.30 s
Building /nix/store/vcrx9s4x6f973my7kav6v117hy7kvdgh-restic-postgres-offsite_fish-completions.drv
855.37 s
Building /nix/store/wvhssb7q9wmh8mkpwqd2ahc20ksxsd2i-restic-romm-offsite_fish-completions.drv
855.41 s
Downloaded cached source (16.4 MiB) in 431ms
855.41 s
Downloaded cached python3.14-scikit-learn (59.1 MiB) in 435ms
855.44 s
Building /nix/store/j4razv53dyxfvvk0ir0904zkvqyaspw1-unit-immich-machine-learning.service.drv
855.49 s
Building /nix/store/h5h6ggk40w8g73qq4ky7h76s8k7fsmig-unit-restic-backup-game-saves.service.drv
855.54 s
Building /nix/store/wmd15jswzbynfk1iqwk9rjmq5in640x1-unit-restic-backups-game-saves-offsite.service.drv
855.59 s
Building /nix/store/j8fggp63m92932sfbkhrs8ad8vsjs9r6-unit-restic-backups-immich-offsite.service.drv
855.65 s
Building /nix/store/8w6sja68qr92aiy4p017f0vwylsnmxlz-unit-restic-backups-nfs-small-offsite.service.drv
855.71 s
Building /nix/store/7h42kp633gb2w8zpg4ycd2lghk3n93sh-unit-restic-backups-paperless-offsite.service.drv
855.77 s
Building /nix/store/62ypv11imxxgix3wmgmx149smg2dqigi-unit-restic-forget-game-saves.service.drv
855.77 s
Progress: 266 of 430 built (15 building), 1109 of 1199 downloaded from cache (15 downloading)
855.77 s
Progress: 266 of 430 built (15 building), 1110 of 1199 downloaded from cache (14 downloading)
855.77 s
Progress: 266 of 430 built (15 building), 1111 of 1199 downloaded from cache (13 downloading)
855.77 s
Progress: 266 of 430 built (15 building), 1112 of 1199 downloaded from cache (12 downloading)
855.77 s
Progress: 266 of 430 built (15 building), 1113 of 1199 downloaded from cache (11 downloading)
855.77 s
Progress: 266 of 430 built (15 building), 1114 of 1199 downloaded from cache (10 downloading)
855.77 s
Progress: 266 of 430 built (15 building), 1115 of 1199 downloaded from cache (9 downloading)
855.77 s
Progress: 266 of 430 built (15 building), 1116 of 1199 downloaded from cache (8 downloading)
855.77 s
Progress: 266 of 430 built (15 building), 1117 of 1199 downloaded from cache (7 downloading)
855.77 s
Progress: 266 of 430 built (15 building), 1118 of 1199 downloaded from cache (6 downloading)
855.77 s
Progress: 266 of 430 built (15 building), 1119 of 1199 downloaded from cache (5 downloading)
855.77 s
Progress: 266 of 430 built (15 building), 1120 of 1199 downloaded from cache (4 downloading)
855.77 s
Progress: 266 of 430 built (15 building), 1121 of 1199 downloaded from cache (3 downloading)
855.77 s
Progress: 266 of 430 built (15 building), 1122 of 1199 downloaded from cache (2 downloading)
855.77 s
Progress: 266 of 430 built (15 building), 1123 of 1199 downloaded from cache (1 downloading)
855.77 s
Progress: 266 of 430 built (15 building), 1124 of 1199 downloaded from cache
855.77 s
[grub-config.xml] structuredAttrs is enabled
855.81 s
[restic-game-saves-offsite_fish-completions:post-build] Uploading to the NixCI cache: /nix/store/iyhcv6v67mvdixj3kvlvqrynnnjzyr8p-restic-game-saves-offsite_fish-completions
855.85 s
[restic-game-saves-offsite_fish-completions:post-build] warning: 'warn-short-path-literals' is deprecated, use 'lint-short-path-literals = ignore' instead
855.99 s
[restic-game-saves-offsite_fish-completions:post-build] copying 1 paths...
855.99 s
[restic-game-saves-offsite_fish-completions:post-build] copying path '/nix/store/iyhcv6v67mvdixj3kvlvqrynnnjzyr8p-restic-game-saves-offsite_fish-completions' to 'https://cache.nix-ci.com'...
856.05 s
[restic-game-saves-offsite_fish-completions:post-build] warning: 'warn-short-path-literals' is deprecated, use 'lint-short-path-literals = ignore' instead
856.30 s
[restic-game-saves-offsite_fish-completions:post-build] copying 1 paths...
856.30 s
[restic-game-saves-offsite_fish-completions:post-build] copying path '/nix/store/xxlr8zhfyy3k8fapp6b37pbxarklzw8s-restic-game-saves-offsite_fish-completions.drv' to 'https://cache.nix-ci.com'...
856.45 s
Uploaded restic-game-saves-offsite_fish-completions in 671ms
856.45 s
Progress: 267 of 431 built (14 building), 1124 of 1199 downloaded from cache
856.45 s
Built restic-game-saves-offsite_fish-completions in 1.3s
856.49 s
[restic-immich-offsite_fish-completions:post-build] Uploading to the NixCI cache: /nix/store/4dpizr4cnx34qif2fpyccrdln4iraqmn-restic-immich-offsite_fish-completions
856.53 s
[restic-immich-offsite_fish-completions:post-build] warning: 'warn-short-path-literals' is deprecated, use 'lint-short-path-literals = ignore' instead
856.67 s
[restic-immich-offsite_fish-completions:post-build] copying 1 paths...
856.67 s
[restic-immich-offsite_fish-completions:post-build] copying path '/nix/store/4dpizr4cnx34qif2fpyccrdln4iraqmn-restic-immich-offsite_fish-completions' to 'https://cache.nix-ci.com'...
856.74 s
[restic-immich-offsite_fish-completions:post-build] warning: 'warn-short-path-literals' is deprecated, use 'lint-short-path-literals = ignore' instead
856.97 s
[restic-immich-offsite_fish-completions:post-build] copying 1 paths...
856.97 s
[restic-immich-offsite_fish-completions:post-build] copying path '/nix/store/3q50wn14xw3nzrl6g7z3bfk0mkphqsh3-restic-immich-offsite_fish-completions.drv' to 'https://cache.nix-ci.com'...
857.13 s
Uploaded restic-immich-offsite_fish-completions in 672ms
857.13 s
Progress: 268 of 432 built (13 building), 1124 of 1199 downloaded from cache
857.13 s
Built restic-immich-offsite_fish-completions in 2.0s
857.17 s
[restic-nfs-small-offsite_fish-completions:post-build] Uploading to the NixCI cache: /nix/store/0lmjwzpga51aa9p1w54vc4r64whl6pi4-restic-nfs-small-offsite_fish-completions
857.22 s
[restic-nfs-small-offsite_fish-completions:post-build] warning: 'warn-short-path-literals' is deprecated, use 'lint-short-path-literals = ignore' instead
857.35 s
[restic-nfs-small-offsite_fish-completions:post-build] copying 1 paths...
857.36 s
[restic-nfs-small-offsite_fish-completions:post-build] copying path '/nix/store/0lmjwzpga51aa9p1w54vc4r64whl6pi4-restic-nfs-small-offsite_fish-completions' to 'https://cache.nix-ci.com'...
857.42 s
[restic-nfs-small-offsite_fish-completions:post-build] warning: 'warn-short-path-literals' is deprecated, use 'lint-short-path-literals = ignore' instead
857.66 s
[restic-nfs-small-offsite_fish-completions:post-build] copying 1 paths...
857.66 s
[restic-nfs-small-offsite_fish-completions:post-build] copying path '/nix/store/fgqs1w4ivvrpd66ypm5q52x6dzf0b9ky-restic-nfs-small-offsite_fish-completions.drv' to 'https://cache.nix-ci.com'...
857.82 s
Uploaded restic-nfs-small-offsite_fish-completions in 672ms
857.82 s
Progress: 269 of 433 built (12 building), 1124 of 1199 downloaded from cache
857.82 s
Built restic-nfs-small-offsite_fish-completions in 2.6s
857.85 s
[restic-paperless-offsite_fish-completions:post-build] Uploading to the NixCI cache: /nix/store/gns5qlbrmm80xdxm6494cbv8qjgsiqb2-restic-paperless-offsite_fish-completions
857.89 s
[restic-paperless-offsite_fish-completions:post-build] warning: 'warn-short-path-literals' is deprecated, use 'lint-short-path-literals = ignore' instead
858.02 s
[restic-paperless-offsite_fish-completions:post-build] copying 1 paths...
858.02 s
[restic-paperless-offsite_fish-completions:post-build] copying path '/nix/store/gns5qlbrmm80xdxm6494cbv8qjgsiqb2-restic-paperless-offsite_fish-completions' to 'https://cache.nix-ci.com'...
858.08 s
[restic-paperless-offsite_fish-completions:post-build] warning: 'warn-short-path-literals' is deprecated, use 'lint-short-path-literals = ignore' instead
858.30 s
[restic-paperless-offsite_fish-completions:post-build] copying 1 paths...
858.31 s
[restic-paperless-offsite_fish-completions:post-build] copying path '/nix/store/ifwzsivqa2i5rr7abm34x8hyaxhrhhsv-restic-paperless-offsite_fish-completions.drv' to 'https://cache.nix-ci.com'...
858.45 s
Uploaded restic-paperless-offsite_fish-completions in 623ms
858.45 s
Progress: 270 of 434 built (11 building), 1124 of 1199 downloaded from cache
858.45 s
Built restic-paperless-offsite_fish-completions in 3.2s
858.48 s
[restic-postgres-offsite_fish-completions:post-build] Uploading to the NixCI cache: /nix/store/d5q10wnx31jcz8cnpi6p730y7af9vz8v-restic-postgres-offsite_fish-completions
858.52 s
[restic-postgres-offsite_fish-completions:post-build] warning: 'warn-short-path-literals' is deprecated, use 'lint-short-path-literals = ignore' instead
858.66 s
[restic-postgres-offsite_fish-completions:post-build] copying 1 paths...
858.66 s
[restic-postgres-offsite_fish-completions:post-build] copying path '/nix/store/d5q10wnx31jcz8cnpi6p730y7af9vz8v-restic-postgres-offsite_fish-completions' to 'https://cache.nix-ci.com'...
858.71 s
[restic-postgres-offsite_fish-completions:post-build] warning: 'warn-short-path-literals' is deprecated, use 'lint-short-path-literals = ignore' instead
858.97 s
[restic-postgres-offsite_fish-completions:post-build] copying 1 paths...
858.97 s
[restic-postgres-offsite_fish-completions:post-build] copying path '/nix/store/vcrx9s4x6f973my7kav6v117hy7kvdgh-restic-postgres-offsite_fish-completions.drv' to 'https://cache.nix-ci.com'...
859.12 s
Uploaded restic-postgres-offsite_fish-completions in 657ms
859.12 s
Progress: 271 of 435 built (10 building), 1124 of 1199 downloaded from cache
859.12 s
Built restic-postgres-offsite_fish-completions in 3.8s
859.15 s
[restic-romm-offsite_fish-completions:post-build] Uploading to the NixCI cache: /nix/store/4pgn33hqklay3xznqrx38pg8wgbhkx1g-restic-romm-offsite_fish-completions
859.19 s
[restic-romm-offsite_fish-completions:post-build] warning: 'warn-short-path-literals' is deprecated, use 'lint-short-path-literals = ignore' instead
859.33 s
[restic-romm-offsite_fish-completions:post-build] copying 1 paths...
859.33 s
[restic-romm-offsite_fish-completions:post-build] copying path '/nix/store/4pgn33hqklay3xznqrx38pg8wgbhkx1g-restic-romm-offsite_fish-completions' to 'https://cache.nix-ci.com'...
859.39 s
[restic-romm-offsite_fish-completions:post-build] warning: 'warn-short-path-literals' is deprecated, use 'lint-short-path-literals = ignore' instead
859.63 s
[restic-romm-offsite_fish-completions:post-build] copying 1 paths...
859.63 s
[restic-romm-offsite_fish-completions:post-build] copying path '/nix/store/wvhssb7q9wmh8mkpwqd2ahc20ksxsd2i-restic-romm-offsite_fish-completions.drv' to 'https://cache.nix-ci.com'...
859.77 s
Uploaded restic-romm-offsite_fish-completions in 649ms
859.77 s
Progress: 272 of 436 built (9 building), 1124 of 1199 downloaded from cache
859.77 s
Built restic-romm-offsite_fish-completions in 4.4s
859.77 s
[unit-immich-machine-learning.service] structuredAttrs is enabled
859.77 s
[unit-restic-backup-game-saves.service] structuredAttrs is enabled
859.77 s
[unit-restic-backups-game-saves-offsite.service] structuredAttrs is enabled
859.77 s
[unit-restic-backups-immich-offsite.service] structuredAttrs is enabled
859.77 s
[unit-restic-backups-nfs-small-offsite.service] structuredAttrs is enabled
859.77 s
[unit-restic-backups-paperless-offsite.service] structuredAttrs is enabled
859.81 s
[unit-script-restic-backups-postgres-offsite-pre-start:post-build] Uploading to the NixCI cache: /nix/store/wm3k3jv71l3qmj6fxzain28s6mf1spk6-unit-script-restic-backups-postgres-offsite-pre-start
859.84 s
[unit-script-restic-backups-postgres-offsite-pre-start:post-build] warning: 'warn-short-path-literals' is deprecated, use 'lint-short-path-literals = ignore' instead
859.98 s
[unit-script-restic-backups-postgres-offsite-pre-start:post-build] copying 1 paths...
859.98 s
[unit-script-restic-backups-postgres-offsite-pre-start:post-build] copying path '/nix/store/wm3k3jv71l3qmj6fxzain28s6mf1spk6-unit-script-restic-backups-postgres-offsite-pre-start' to 'https://cache.nix-ci.com'...
860.16 s
[unit-script-restic-backups-postgres-offsite-pre-start:post-build] warning: 'warn-short-path-literals' is deprecated, use 'lint-short-path-literals = ignore' instead
860.37 s
[unit-script-restic-backups-postgres-offsite-pre-start:post-build] copying 1 paths...
860.37 s
[unit-script-restic-backups-postgres-offsite-pre-start:post-build] copying path '/nix/store/sv0ycdxg1l7qa8qsddmva61gbfx6wj7g-unit-script-restic-backups-postgres-offsite-pre-start.drv' to 'https://cache.nix-ci.com'...
860.56 s
Uploaded unit-script-restic-backups-postgres-offsite-pre-start in 773ms
860.56 s
Progress: 273 of 437 built (8 building), 1124 of 1199 downloaded from cache
860.56 s
Built unit-script-restic-backups-postgres-offsite-pre-start in 15.2s
860.56 s
Downloading cached podman from https://cache.nix-ci.com
860.56 s
Downloading cached podman from https://cache.nix-ci.com
860.56 s
Downloading cached python3.14-channels-redis from https://cache.nix-ci.com
860.56 s
Downloading cached source from https://cache.nix-ci.com
860.56 s
Downloading cached sqlite-vec from https://cache.nix-ci.com
860.56 s
Downloading cached sshd.conf-final from https://cache.nix-ci.com
860.56 s
Downloading cached starship-config from https://cache.nix-ci.com
860.56 s
Downloading cached syn from https://cache.nix-ci.com
860.56 s
Downloading cached systemd-generator-environment.json from https://cache.nix-ci.com
860.56 s
Downloading cached tesseract from https://cache.nix-ci.com
860.56 s
Downloading cached toml-1.1.2+spec from https://cache.nix-ci.com
860.56 s
Downloading cached toml_datetime-1.1.1+spec from https://cache.nix-ci.com
860.56 s
Downloading cached toml_edit-0.25.12+spec from https://cache.nix-ci.com
860.56 s
Downloading cached toml_parser-1.1.2+spec from https://cache.nix-ci.com
860.56 s
Downloading cached toml_writer-1.1.1+spec from https://cache.nix-ci.com
860.56 s
Downloading cached treq from https://cache.nix-ci.com
860.56 s
Downloaded cached systemd-generator-environment.json (472 B) in 6ms
860.57 s
Downloaded cached starship-config (2216 B) in 7ms
860.57 s
Downloaded cached sshd.conf-final (1160 B) in 7ms
860.57 s
Downloaded cached python3.14-channels-redis (179 KiB) in 17ms
860.58 s
Downloaded cached toml_edit-0.25.12+spec (359 KiB) in 19ms
860.61 s
Downloaded cached toml_datetime-1.1.1+spec (71 KiB) in 48ms
860.61 s
Downloaded cached treq (81 KiB) in 49ms
860.61 s
Downloaded cached toml_writer-1.1.1+spec (74 KiB) in 50ms
860.61 s
Downloaded cached toml_parser-1.1.2+spec (239 KiB) in 50ms
860.61 s
Downloaded cached sqlite-vec (378 KiB) in 52ms
860.61 s
Downloaded cached toml-1.1.2+spec (325 KiB) in 52ms
860.63 s
Building /nix/store/xfimpri67im5zr33xc7y9zajrw0ph4vx-k3s-1.36.4+k3s1_fish-completions.drv
860.63 s
Downloaded cached syn (2.2 MiB) in 76ms
860.66 s
Downloaded cached tesseract (4.8 MiB) in 97ms
860.69 s
Building /nix/store/ynx1rlsbh78f6qnlx1hzbs8522g60cjx-nix-eval-jobs-2.35.4.drv
860.74 s
Building /nix/store/x9hl4q980l527gwaq76df1w0xj8cd9nf-unit-k3s.service.drv
860.79 s
Downloaded cached source (7.6 MiB) in 231ms
860.80 s
Building /nix/store/ib4067dhm932amx8frdbax8azrn9wpmg-unit-restic-backups-postgres-offsite.service.drv
860.80 s
Progress: 273 of 415 built (12 building), 1125 of 1199 downloaded from cache (15 downloading)
860.80 s
Progress: 273 of 415 built (12 building), 1126 of 1199 downloaded from cache (14 downloading)
860.80 s
Progress: 273 of 415 built (12 building), 1127 of 1199 downloaded from cache (13 downloading)
860.80 s
Progress: 273 of 415 built (12 building), 1128 of 1199 downloaded from cache (12 downloading)
860.80 s
Progress: 273 of 415 built (12 building), 1129 of 1199 downloaded from cache (11 downloading)
860.80 s
Progress: 273 of 415 built (12 building), 1130 of 1199 downloaded from cache (10 downloading)
860.80 s
Progress: 273 of 415 built (12 building), 1131 of 1199 downloaded from cache (9 downloading)
860.80 s
Progress: 273 of 415 built (12 building), 1132 of 1199 downloaded from cache (8 downloading)
860.80 s
Progress: 273 of 415 built (12 building), 1133 of 1199 downloaded from cache (7 downloading)
860.80 s
Progress: 273 of 415 built (12 building), 1134 of 1199 downloaded from cache (6 downloading)
860.80 s
Progress: 273 of 415 built (12 building), 1135 of 1199 downloaded from cache (5 downloading)
860.80 s
Progress: 273 of 415 built (12 building), 1136 of 1199 downloaded from cache (4 downloading)
860.80 s
Progress: 273 of 415 built (12 building), 1137 of 1199 downloaded from cache (3 downloading)
860.80 s
Progress: 273 of 415 built (12 building), 1138 of 1199 downloaded from cache (2 downloading)
860.83 s
[grub-config.xml:post-build] Uploading to the NixCI cache: /nix/store/ydhvk34wqwifbhcbqjaa5j7gq89bqf06-grub-config.xml
860.88 s
[grub-config.xml:post-build] warning: 'warn-short-path-literals' is deprecated, use 'lint-short-path-literals = ignore' instead
860.91 s
[grub-config.xml:post-build] copying 0 paths...
860.97 s
[grub-config.xml:post-build] warning: 'warn-short-path-literals' is deprecated, use 'lint-short-path-literals = ignore' instead
860.99 s
Downloaded cached podman (54.7 MiB) in 432ms
860.99 s
Downloaded cached podman (54.7 MiB) in 433ms
861.07 s
[grub-config.xml:post-build] copying 0 paths...
861.09 s
Uploaded grub-config.xml in 283ms
861.09 s
Progress: 274 of 416 built (11 building), 1138 of 1199 downloaded from cache (2 downloading)
861.09 s
Built grub-config.xml in 15.1s
861.12 s
[k3s-1.36.4+k3s1_fish-completions:post-build] Uploading to the NixCI cache: /nix/store/5agwi2rz8apqgn4mzjjgvl3d6wfpaqn4-k3s-1.36.4+k3s1_fish-completions
861.16 s
[k3s-1.36.4+k3s1_fish-completions:post-build] warning: 'warn-short-path-literals' is deprecated, use 'lint-short-path-literals = ignore' instead
861.19 s
[k3s-1.36.4+k3s1_fish-completions:post-build] copying 0 paths...
861.23 s
[k3s-1.36.4+k3s1_fish-completions:post-build] warning: 'warn-short-path-literals' is deprecated, use 'lint-short-path-literals = ignore' instead
861.36 s
[k3s-1.36.4+k3s1_fish-completions:post-build] copying 0 paths...
861.38 s
Uploaded k3s-1.36.4+k3s1_fish-completions in 281ms
861.38 s
Progress: 275 of 417 built (10 building), 1138 of 1199 downloaded from cache (2 downloading)
861.38 s
Built k3s-1.36.4+k3s1_fish-completions in 747ms
861.38 s
[nix-eval-jobs] structuredAttrs is enabled
861.42 s
[unit-immich-machine-learning.service:post-build] Uploading to the NixCI cache: /nix/store/h8sl0ra7h6lxl83z7idbc6ch6927ci8j-unit-immich-machine-learning.service
861.46 s
[unit-immich-machine-learning.service:post-build] warning: 'warn-short-path-literals' is deprecated, use 'lint-short-path-literals = ignore' instead
861.50 s
[unit-immich-machine-learning.service:post-build] copying 0 paths...
861.55 s
[unit-immich-machine-learning.service:post-build] warning: 'warn-short-path-literals' is deprecated, use 'lint-short-path-literals = ignore' instead
861.81 s
[unit-immich-machine-learning.service:post-build] copying 0 paths...
861.84 s
Uploaded unit-immich-machine-learning.service in 440ms
861.84 s
Progress: 276 of 418 built (9 building), 1138 of 1199 downloaded from cache (2 downloading)
861.84 s
Built unit-immich-machine-learning.service in 6.4s
861.84 s
[unit-k3s.service] structuredAttrs is enabled
861.87 s
[unit-restic-backup-game-saves.service:post-build] Uploading to the NixCI cache: /nix/store/ggyilzmgpfmx54wdrdqv58l0p34xsbx6-unit-restic-backup-game-saves.service
861.91 s
[unit-restic-backup-game-saves.service:post-build] warning: 'warn-short-path-literals' is deprecated, use 'lint-short-path-literals = ignore' instead
862.05 s
[unit-restic-backup-game-saves.service:post-build] copying 1 paths...
862.05 s
[unit-restic-backup-game-saves.service:post-build] copying path '/nix/store/ggyilzmgpfmx54wdrdqv58l0p34xsbx6-unit-restic-backup-game-saves.service' to 'https://cache.nix-ci.com'...
862.23 s
[unit-restic-backup-game-saves.service:post-build] warning: 'warn-short-path-literals' is deprecated, use 'lint-short-path-literals = ignore' instead
862.45 s
[unit-restic-backup-game-saves.service:post-build] copying 1 paths...
862.45 s
[unit-restic-backup-game-saves.service:post-build] copying path '/nix/store/h5h6ggk40w8g73qq4ky7h76s8k7fsmig-unit-restic-backup-game-saves.service.drv' to 'https://cache.nix-ci.com'...
862.60 s
Uploaded unit-restic-backup-game-saves.service in 750ms
862.60 s
Progress: 277 of 419 built (8 building), 1138 of 1199 downloaded from cache (2 downloading)
862.60 s
Built unit-restic-backup-game-saves.service in 7.1s
862.63 s
[unit-restic-backups-game-saves-offsite.service:post-build] Uploading to the NixCI cache: /nix/store/zzj8v7mnj63c9lhm0a69dm6gz11kyz3d-unit-restic-backups-game-saves-offsite.service
862.67 s
[unit-restic-backups-game-saves-offsite.service:post-build] warning: 'warn-short-path-literals' is deprecated, use 'lint-short-path-literals = ignore' instead
862.81 s
[unit-restic-backups-game-saves-offsite.service:post-build] copying 1 paths...
862.81 s
[unit-restic-backups-game-saves-offsite.service:post-build] copying path '/nix/store/zzj8v7mnj63c9lhm0a69dm6gz11kyz3d-unit-restic-backups-game-saves-offsite.service' to 'https://cache.nix-ci.com'...
862.98 s
[unit-restic-backups-game-saves-offsite.service:post-build] warning: 'warn-short-path-literals' is deprecated, use 'lint-short-path-literals = ignore' instead
863.22 s
[unit-restic-backups-game-saves-offsite.service:post-build] copying 1 paths...
863.22 s
[unit-restic-backups-game-saves-offsite.service:post-build] copying path '/nix/store/wmd15jswzbynfk1iqwk9rjmq5in640x1-unit-restic-backups-game-saves-offsite.service.drv' to 'https://cache.nix-ci.com'...
863.36 s
Uploaded unit-restic-backups-game-saves-offsite.service in 758ms
863.36 s
Progress: 278 of 420 built (7 building), 1138 of 1199 downloaded from cache (2 downloading)
863.36 s
Built unit-restic-backups-game-saves-offsite.service in 7.8s
863.40 s
[unit-restic-backups-immich-offsite.service:post-build] Uploading to the NixCI cache: /nix/store/4j046yvpyxv88a8hb9pgi4a2qipxcvlr-unit-restic-backups-immich-offsite.service
863.43 s
[unit-restic-backups-immich-offsite.service:post-build] warning: 'warn-short-path-literals' is deprecated, use 'lint-short-path-literals = ignore' instead
863.57 s
[unit-restic-backups-immich-offsite.service:post-build] copying 1 paths...
863.57 s
[unit-restic-backups-immich-offsite.service:post-build] copying path '/nix/store/4j046yvpyxv88a8hb9pgi4a2qipxcvlr-unit-restic-backups-immich-offsite.service' to 'https://cache.nix-ci.com'...
863.74 s
[unit-restic-backups-immich-offsite.service:post-build] warning: 'warn-short-path-literals' is deprecated, use 'lint-short-path-literals = ignore' instead
863.97 s
[unit-restic-backups-immich-offsite.service:post-build] copying 1 paths...
863.97 s
[unit-restic-backups-immich-offsite.service:post-build] copying path '/nix/store/j8fggp63m92932sfbkhrs8ad8vsjs9r6-unit-restic-backups-immich-offsite.service.drv' to 'https://cache.nix-ci.com'...
864.13 s
Uploaded unit-restic-backups-immich-offsite.service in 757ms
864.13 s
Progress: 279 of 421 built (6 building), 1138 of 1199 downloaded from cache (2 downloading)
864.13 s
Built unit-restic-backups-immich-offsite.service in 8.5s
864.16 s
[unit-restic-backups-nfs-small-offsite.service:post-build] Uploading to the NixCI cache: /nix/store/k4zgcgv3q1j0hkabk879nlcpa3cy2zij-unit-restic-backups-nfs-small-offsite.service
864.20 s
[unit-restic-backups-nfs-small-offsite.service:post-build] warning: 'warn-short-path-literals' is deprecated, use 'lint-short-path-literals = ignore' instead
864.34 s
[unit-restic-backups-nfs-small-offsite.service:post-build] copying 1 paths...
864.34 s
[unit-restic-backups-nfs-small-offsite.service:post-build] copying path '/nix/store/k4zgcgv3q1j0hkabk879nlcpa3cy2zij-unit-restic-backups-nfs-small-offsite.service' to 'https://cache.nix-ci.com'...
864.51 s
[unit-restic-backups-nfs-small-offsite.service:post-build] warning: 'warn-short-path-literals' is deprecated, use 'lint-short-path-literals = ignore' instead
864.72 s
[unit-restic-backups-nfs-small-offsite.service:post-build] copying 1 paths...
864.72 s
[unit-restic-backups-nfs-small-offsite.service:post-build] copying path '/nix/store/8w6sja68qr92aiy4p017f0vwylsnmxlz-unit-restic-backups-nfs-small-offsite.service.drv' to 'https://cache.nix-ci.com'...
864.87 s
Uploaded unit-restic-backups-nfs-small-offsite.service in 733ms
864.87 s
Progress: 280 of 422 built (5 building), 1138 of 1199 downloaded from cache (2 downloading)
864.87 s
Built unit-restic-backups-nfs-small-offsite.service in 9.2s
864.91 s
[unit-restic-backups-paperless-offsite.service:post-build] Uploading to the NixCI cache: /nix/store/nsh3d2dnnanxjq5n6msfmgm2xkip44rp-unit-restic-backups-paperless-offsite.service
864.95 s
[unit-restic-backups-paperless-offsite.service:post-build] warning: 'warn-short-path-literals' is deprecated, use 'lint-short-path-literals = ignore' instead
865.09 s
[unit-restic-backups-paperless-offsite.service:post-build] copying 1 paths...
865.09 s
[unit-restic-backups-paperless-offsite.service:post-build] copying path '/nix/store/nsh3d2dnnanxjq5n6msfmgm2xkip44rp-unit-restic-backups-paperless-offsite.service' to 'https://cache.nix-ci.com'...
865.27 s
[unit-restic-backups-paperless-offsite.service:post-build] warning: 'warn-short-path-literals' is deprecated, use 'lint-short-path-literals = ignore' instead
865.50 s
[unit-restic-backups-paperless-offsite.service:post-build] copying 1 paths...
865.50 s
[unit-restic-backups-paperless-offsite.service:post-build] copying path '/nix/store/7h42kp633gb2w8zpg4ycd2lghk3n93sh-unit-restic-backups-paperless-offsite.service.drv' to 'https://cache.nix-ci.com'...
865.65 s
Uploaded unit-restic-backups-paperless-offsite.service in 768ms
865.65 s
Progress: 281 of 423 built (4 building), 1138 of 1199 downloaded from cache (2 downloading)
865.65 s
Built unit-restic-backups-paperless-offsite.service in 9.9s
865.65 s
[unit-restic-forget-game-saves.service] structuredAttrs is enabled
865.65 s
Downloading cached python3.14-djangorestframework-guardian from https://cache.nix-ci.com
865.65 s
Downloading cached python3.14-drf-spectacular from https://cache.nix-ci.com
865.65 s
Downloading cached python3.14-drf-writable-nested from https://cache.nix-ci.com
865.65 s
Downloading cached python3.14-opentelemetry-exporter-otlp-proto-http from https://cache.nix-ci.com
865.65 s
Downloading cached python3.14-sentence-transformers from https://cache.nix-ci.com
865.65 s
Downloading cached rustc-wrapper from https://cache.nix-ci.com
865.65 s
Downloading cached twisted-replace-pyopenssl-x509req-with-cryptography-csr.patch from https://cache.nix-ci.com
865.65 s
Downloading cached txrequests from https://cache.nix-ci.com
865.65 s
Downloading cached uavs3d from https://cache.nix-ci.com
865.65 s
Downloading cached unicode-ident from https://cache.nix-ci.com
865.65 s
Downloading cached unit-script-tailscaled-autoconnect-start from https://cache.nix-ci.com
865.65 s
Downloading cached unpaper from https://cache.nix-ci.com
865.65 s
Downloading cached vectorchord from https://cache.nix-ci.com
865.65 s
Downloading cached vo-amrwbenc from https://cache.nix-ci.com
865.66 s
Downloaded cached unit-script-tailscaled-autoconnect-start (1488 B) in 7ms
865.69 s
Downloaded cached vo-amrwbenc (140 KiB) in 31ms
865.69 s
Downloaded cached python3.14-djangorestframework-guardian (25 KiB) in 33ms
865.69 s
Downloaded cached python3.14-opentelemetry-exporter-otlp-proto-http (206 KiB) in 35ms
865.69 s
Downloaded cached txrequests (5424 B) in 37ms
865.70 s
Downloaded cached rustc-wrapper (3368 B) in 42ms
865.70 s
Downloaded cached twisted-replace-pyopenssl-x509req-with-cryptography-csr.patch (8608 B) in 44ms
865.70 s
Downloaded cached unpaper (93 KiB) in 44ms
865.70 s
Downloaded cached python3.14-drf-spectacular (1.2 MiB) in 46ms
865.70 s
Downloaded cached python3.14-drf-writable-nested (75 KiB) in 47ms
865.70 s
Downloaded cached unicode-ident (335 KiB) in 50ms
865.71 s
Downloaded cached uavs3d (1 MiB) in 55ms
865.72 s
Building /nix/store/n0psimlr8jymq460hbvk942hpkb3xyd1-X-Restart-Triggers-sshd.drv
865.73 s
Downloaded cached vectorchord (8 MiB) in 70ms
865.76 s
Downloaded cached python3.14-sentence-transformers (7.9 MiB) in 109ms
865.78 s
Building /nix/store/kp10ik569m5px2h4400vkmgciyi5x3n1-install-grub.sh.drv
865.78 s
Progress: 281 of 404 built (6 building), 1139 of 1199 downloaded from cache (15 downloading)
865.78 s
Progress: 281 of 404 built (6 building), 1140 of 1199 downloaded from cache (14 downloading)
865.78 s
Progress: 281 of 404 built (6 building), 1141 of 1199 downloaded from cache (13 downloading)
865.78 s
Progress: 281 of 404 built (6 building), 1142 of 1199 downloaded from cache (12 downloading)
865.78 s
Progress: 281 of 404 built (6 building), 1143 of 1199 downloaded from cache (11 downloading)
865.78 s
Progress: 281 of 404 built (6 building), 1144 of 1199 downloaded from cache (10 downloading)
865.78 s
Progress: 281 of 404 built (6 building), 1145 of 1199 downloaded from cache (9 downloading)
865.78 s
Progress: 281 of 404 built (6 building), 1146 of 1199 downloaded from cache (8 downloading)
865.78 s
Progress: 281 of 404 built (6 building), 1147 of 1199 downloaded from cache (7 downloading)
865.78 s
Progress: 281 of 404 built (6 building), 1148 of 1199 downloaded from cache (6 downloading)
865.78 s
Progress: 281 of 404 built (6 building), 1149 of 1199 downloaded from cache (5 downloading)
865.78 s
Progress: 281 of 404 built (6 building), 1150 of 1199 downloaded from cache (4 downloading)
865.78 s
Progress: 281 of 404 built (6 building), 1151 of 1199 downloaded from cache (3 downloading)
865.78 s
Progress: 281 of 404 built (6 building), 1152 of 1199 downloaded from cache (2 downloading)
865.78 s
Progress: 281 of 404 built (6 building), 1153 of 1199 downloaded from cache (1 downloading)
865.78 s
Progress: 281 of 404 built (6 building), 1154 of 1199 downloaded from cache
865.78 s
[X-Restart-Triggers-sshd] structuredAttrs is enabled
865.78 s
[nix-eval-jobs] Phase: unpackPhase
865.78 s
[nix-eval-jobs] unpacking source archive /nix/store/ahvzi9cgy6h0j7hw4lfpn97vfa3h0gyv-source
865.78 s
[nix-eval-jobs] source root is source
865.78 s
[nix-eval-jobs] Phase: patchPhase
865.78 s
[nix-eval-jobs] applying patch /nix/store/1hxmvq9i8bdmszwdjzsw5sazg292h5m1-nix-eval-jobs-remote-store.patch
865.78 s
[nix-eval-jobs] patching file src/drv.cc
865.78 s
[nix-eval-jobs] Hunk #1 FAILED at 1.
865.78 s
[nix-eval-jobs] Hunk #2 succeeded at 40 (offset 2 lines).
865.78 s
[nix-eval-jobs] Hunk #3 succeeded at 52 (offset 2 lines).
865.78 s
[nix-eval-jobs] Hunk #4 FAILED at 188.
865.78 s
[nix-eval-jobs] Hunk #5 succeeded at 157 with fuzz 2 (offset -76 lines).
865.78 s
[nix-eval-jobs] 2 out of 5 hunks FAILED -- saving rejects to file src/drv.cc.rej
865.82 s
[unit-k3s.service:post-build] Uploading to the NixCI cache: /nix/store/322nk7akdhdsz0l59w0fyzf9vjmisfm1-unit-k3s.service
865.87 s
[unit-k3s.service:post-build] warning: 'warn-short-path-literals' is deprecated, use 'lint-short-path-literals = ignore' instead
866.01 s
[unit-k3s.service:post-build] copying 1 paths...
866.01 s
[unit-k3s.service:post-build] copying path '/nix/store/322nk7akdhdsz0l59w0fyzf9vjmisfm1-unit-k3s.service' to 'https://cache.nix-ci.com'...
866.19 s
[unit-k3s.service:post-build] warning: 'warn-short-path-literals' is deprecated, use 'lint-short-path-literals = ignore' instead
866.44 s
[unit-k3s.service:post-build] copying 1 paths...
866.44 s
[unit-k3s.service:post-build] copying path '/nix/store/x9hl4q980l527gwaq76df1w0xj8cd9nf-unit-k3s.service.drv' to 'https://cache.nix-ci.com'...
866.59 s
Uploaded unit-k3s.service in 795ms
866.59 s
Progress: 282 of 405 built (5 building), 1154 of 1199 downloaded from cache
866.59 s
Built unit-k3s.service in 5.8s
866.59 s
[unit-restic-backups-postgres-offsite.service] structuredAttrs is enabled
866.62 s
[unit-restic-forget-game-saves.service:post-build] Uploading to the NixCI cache: /nix/store/26a9g4ssin1cmb7p688iyh27q2hypgvb-unit-restic-forget-game-saves.service
866.66 s
[unit-restic-forget-game-saves.service:post-build] warning: 'warn-short-path-literals' is deprecated, use 'lint-short-path-literals = ignore' instead
866.79 s
[unit-restic-forget-game-saves.service:post-build] copying 1 paths...
866.79 s
[unit-restic-forget-game-saves.service:post-build] copying path '/nix/store/26a9g4ssin1cmb7p688iyh27q2hypgvb-unit-restic-forget-game-saves.service' to 'https://cache.nix-ci.com'...
866.97 s
[unit-restic-forget-game-saves.service:post-build] warning: 'warn-short-path-literals' is deprecated, use 'lint-short-path-literals = ignore' instead
867.19 s
[unit-restic-forget-game-saves.service:post-build] copying 1 paths...
867.19 s
[unit-restic-forget-game-saves.service:post-build] copying path '/nix/store/62ypv11imxxgix3wmgmx149smg2dqigi-unit-restic-forget-game-saves.service.drv' to 'https://cache.nix-ci.com'...
867.35 s
Uploaded unit-restic-forget-game-saves.service in 750ms
867.35 s
Progress: 283 of 406 built (4 building), 1154 of 1199 downloaded from cache
867.35 s
Built unit-restic-forget-game-saves.service in 11.5s
867.35 s
Downloading cached home-manager-files from https://cache.nix-ci.com
867.35 s
Downloading cached python3.14-sqlite-vec from https://cache.nix-ci.com
867.35 s
Downloading cached tesseract from https://cache.nix-ci.com
867.35 s
Downloading cached vvenc-1.14.0-lib from https://cache.nix-ci.com
867.35 s
Downloading cached wandb-xpu from https://cache.nix-ci.com
867.35 s
Downloading cached wheel-unpack-hook.sh from https://cache.nix-ci.com
867.35 s
Downloading cached winnow from https://cache.nix-ci.com
867.35 s
Downloading cached wrap-python-hook from https://cache.nix-ci.com
867.35 s
Downloading cached writable-tmpdir-as-home-hook from https://cache.nix-ci.com
867.35 s
Downloading cached xavs from https://cache.nix-ci.com
867.35 s
Downloading cached xavs2-1.4-lib from https://cache.nix-ci.com
867.35 s
Downloading cached xevd-0.7.0-lib from https://cache.nix-ci.com
867.35 s
Downloading cached xeve-0.7.0-lib from https://cache.nix-ci.com
867.35 s
Downloading cached yajl-2.1.0-unstable-2024-02 from https://cache.nix-ci.com
867.35 s
Downloading cached yansi from https://cache.nix-ci.com
867.35 s
Downloading cached zeromq from https://cache.nix-ci.com
867.36 s
Downloaded cached home-manager-files (7152 B) in 10ms
867.37 s
Downloaded cached python3.14-sqlite-vec (30 KiB) in 24ms
867.41 s
Downloaded cached wheel-unpack-hook.sh (1192 B) in 58ms
867.41 s
Downloaded cached writable-tmpdir-as-home-hook (760 B) in 59ms
867.41 s
Downloaded cached wrap-python-hook (7328 B) in 62ms
867.41 s
Downloaded cached yajl-2.1.0-unstable-2024-02 (51 KiB) in 62ms
867.41 s
Downloaded cached xavs (1.7 MiB) in 62ms
867.41 s
Downloaded cached yansi (168 KiB) in 65ms
867.43 s
Downloaded cached xevd-0.7.0-lib (1.6 MiB) in 79ms
867.43 s
Downloaded cached winnow (1.3 MiB) in 86ms
867.44 s
Downloaded cached xavs2-1.4-lib (2.3 MiB) in 95ms
867.45 s
Downloaded cached vvenc-1.14.0-lib (4.6 MiB) in 98ms
867.45 s
Downloaded cached wandb-xpu (6.1 MiB) in 100ms
867.45 s
Building /nix/store/p9zamdawl18wdhqpy86j8dnhmvqs4bar-backupPrepareCommand.drv
867.45 s
Downloaded cached xeve-0.7.0-lib (3.7 MiB) in 103ms
867.46 s
Downloaded cached zeromq (5.5 MiB) in 108ms
867.46 s
Downloaded cached tesseract (4.6 MiB) in 110ms
867.51 s
Building /nix/store/pl09ackhf6ra06xmm0zc8ncwpckgcadk-etc-containers-systemd-romm.container.drv
867.57 s
Building /nix/store/7c3m2l11n28mkrm4pk03drwv12cclbxv-etc-containers-systemd-romm.network.drv
867.62 s
Building /nix/store/mvdlg4xjc2yrlccljcy3kibpgcb59wca-podman-5.8.7_fish-completions.drv
867.68 s
Building /nix/store/f0pwqqdl9xym4xdzqbl2hnhbl49a1wpk-postgresql-and-plugins-16.15.drv
867.72 s
Building /nix/store/nrzindh3xywyl2hdjgxxv3whw7cb9fgh-unit-podman-prune.service.drv
867.77 s
Building /nix/store/8zcha1j54p6a4xssqhx90nbdz9kq4nzk-unit-tailscaled-autoconnect.service.drv
867.77 s
Progress: 283 of 391 built (11 building), 1155 of 1199 downloaded from cache (15 downloading)
867.77 s
Progress: 283 of 391 built (11 building), 1156 of 1199 downloaded from cache (14 downloading)
867.77 s
Progress: 283 of 391 built (11 building), 1157 of 1199 downloaded from cache (13 downloading)
867.77 s
Progress: 283 of 391 built (11 building), 1158 of 1199 downloaded from cache (12 downloading)
867.77 s
Progress: 283 of 391 built (11 building), 1159 of 1199 downloaded from cache (11 downloading)
867.77 s
Progress: 283 of 391 built (11 building), 1160 of 1199 downloaded from cache (10 downloading)
867.77 s
Progress: 283 of 391 built (11 building), 1161 of 1199 downloaded from cache (9 downloading)
867.77 s
Progress: 283 of 391 built (11 building), 1162 of 1199 downloaded from cache (8 downloading)
867.77 s
Progress: 283 of 391 built (11 building), 1163 of 1199 downloaded from cache (7 downloading)
867.77 s
Progress: 283 of 391 built (11 building), 1164 of 1199 downloaded from cache (6 downloading)
867.77 s
Progress: 283 of 391 built (11 building), 1165 of 1199 downloaded from cache (5 downloading)
867.77 s
Progress: 283 of 391 built (11 building), 1166 of 1199 downloaded from cache (4 downloading)
867.77 s
Progress: 283 of 391 built (11 building), 1167 of 1199 downloaded from cache (3 downloading)
867.77 s
Progress: 283 of 391 built (11 building), 1168 of 1199 downloaded from cache (2 downloading)
867.77 s
Progress: 283 of 391 built (11 building), 1169 of 1199 downloaded from cache (1 downloading)
867.77 s
Progress: 283 of 391 built (11 building), 1170 of 1199 downloaded from cache
867.80 s
[X-Restart-Triggers-sshd:post-build] Uploading to the NixCI cache: /nix/store/br5naf7p3wq1xn1i0px8s4p187ig5fax-X-Restart-Triggers-sshd
867.84 s
[X-Restart-Triggers-sshd:post-build] warning: 'warn-short-path-literals' is deprecated, use 'lint-short-path-literals = ignore' instead
867.87 s
[X-Restart-Triggers-sshd:post-build] copying 0 paths...
867.91 s
[X-Restart-Triggers-sshd:post-build] warning: 'warn-short-path-literals' is deprecated, use 'lint-short-path-literals = ignore' instead
867.99 s
[X-Restart-Triggers-sshd:post-build] copying 0 paths...
868.00 s
Uploaded X-Restart-Triggers-sshd in 226ms
868.00 s
Progress: 284 of 392 built (10 building), 1170 of 1199 downloaded from cache
868.00 s
Built X-Restart-Triggers-sshd in 2.2s
868.00 s
[backupPrepareCommand] structuredAttrs is enabled
868.00 s
[etc-containers-systemd-romm.container] structuredAttrs is enabled
868.00 s
[etc-containers-systemd-romm.network] structuredAttrs is enabled
868.00 s
[install-grub.sh] structuredAttrs is enabled
868.01 s
Progress: 284 of 392 built (9 building, 1 failed), 1170 of 1199 downloaded from cache
868.01 s
Failed to build nix-eval-jobs after 7.3s
868.04 s
[podman-5.8.7_fish-completions:post-build] Uploading to the NixCI cache: /nix/store/309s0jc7pm48x7j6zyzr7l3f42xsknpa-podman-5.8.7_fish-completions
868.09 s
[podman-5.8.7_fish-completions:post-build] warning: 'warn-short-path-literals' is deprecated, use 'lint-short-path-literals = ignore' instead
868.11 s
[podman-5.8.7_fish-completions:post-build] copying 0 paths...
868.16 s
[podman-5.8.7_fish-completions:post-build] warning: 'warn-short-path-literals' is deprecated, use 'lint-short-path-literals = ignore' instead
868.29 s
[podman-5.8.7_fish-completions:post-build] copying 0 paths...
868.31 s
Uploaded podman-5.8.7_fish-completions in 291ms
868.31 s
Progress: 285 of 393 built (8 building, 1 failed), 1170 of 1199 downloaded from cache
868.31 s
Built podman-5.8.7_fish-completions in 693ms
868.31 s
[postgresql-and-plugins] structuredAttrs is enabled
868.31 s
[postgresql-and-plugins] created 433 symlinks in user environment
868.31 s
[unit-podman-prune.service] structuredAttrs is enabled
868.35 s
[unit-restic-backups-postgres-offsite.service:post-build] Uploading to the NixCI cache: /nix/store/zspccsqaj2mmy9kgisdm3zy0d7vyswq0-unit-restic-backups-postgres-offsite.service
868.39 s
[unit-restic-backups-postgres-offsite.service:post-build] warning: 'warn-short-path-literals' is deprecated, use 'lint-short-path-literals = ignore' instead
868.53 s
[unit-restic-backups-postgres-offsite.service:post-build] copying 1 paths...
868.53 s
[unit-restic-backups-postgres-offsite.service:post-build] copying path '/nix/store/zspccsqaj2mmy9kgisdm3zy0d7vyswq0-unit-restic-backups-postgres-offsite.service' to 'https://cache.nix-ci.com'...
868.70 s
[unit-restic-backups-postgres-offsite.service:post-build] warning: 'warn-short-path-literals' is deprecated, use 'lint-short-path-literals = ignore' instead
868.94 s
[unit-restic-backups-postgres-offsite.service:post-build] copying 1 paths...
868.94 s
[unit-restic-backups-postgres-offsite.service:post-build] copying path '/nix/store/ib4067dhm932amx8frdbax8azrn9wpmg-unit-restic-backups-postgres-offsite.service.drv' to 'https://cache.nix-ci.com'...
869.10 s
Uploaded unit-restic-backups-postgres-offsite.service in 776ms
869.10 s
Progress: 286 of 394 built (7 building, 1 failed), 1170 of 1199 downloaded from cache
869.10 s
Built unit-restic-backups-postgres-offsite.service in 8.3s
869.10 s
Downloading cached cargo from https://cache.nix-ci.com
869.10 s
Downloading cached user-generators from https://cache.nix-ci.com
869.10 s
Downloading cached zlib-ng from https://cache.nix-ci.com
869.10 s
Downloading cached zmij from https://cache.nix-ci.com
869.10 s
Downloading cached zram-generator from https://cache.nix-ci.com
869.10 s
Downloading cached hm-putter.json from https://cache.nix-ci.com
869.10 s
Downloading cached jellyfin-ffmpeg-8.1.2-5-lib from https://cache.nix-ci.com
869.10 s
Downloading cached python3.14-ijson from https://cache.nix-ci.com
869.10 s
Downloading cached python3.14-ocrmypdf from https://cache.nix-ci.com
869.10 s
Downloading cached wandb-core from https://cache.nix-ci.com
869.11 s
error: Cannot build '/nix/store/ynx1rlsbh78f6qnlx1hzbs8522g60cjx-nix-eval-jobs-2.35.4.drv '.
869.11 s
Reason: builder failed with exit code 1 .
869.11 s
Output paths:
869.11 s
/nix/store/59kmk18gchqmm7pbbc2w4vx55rl66qfb-nix-eval-jobs-2.35.4
869.11 s
/nix/store/i7a0hxj9hkahsazmgc5b14zmm60a15gm-nix-eval-jobs-2.35.4-dev
869.11 s
Last 13 log lines:
869.11 s
> structuredAttrs is enabled
869.11 s
> Running phase: unpackPhase
869.11 s
> unpacking source archive /nix/store/ahvzi9cgy6h0j7hw4lfpn97vfa3h0gyv-source
869.11 s
> source root is source
869.11 s
> Running phase: patchPhase
869.11 s
> applying patch /nix/store/1hxmvq9i8bdmszwdjzsw5sazg292h5m1-nix-eval-jobs-remote-store.patch
869.11 s
> patching file src/drv.cc
869.11 s
> Hunk #1 FAILED at 1.
869.11 s
> Hunk #2 succeeded at 40 (offset 2 lines).
869.11 s
> Hunk #3 succeeded at 52 (offset 2 lines).
869.11 s
> Hunk #4 FAILED at 188.
869.11 s
> Hunk #5 succeeded at 157 with fuzz 2 (offset -76 lines).
869.11 s
> 2 out of 5 hunks FAILED -- saving rejects to file src/drv.cc.rej
869.11 s
For full logs, run:
869.11 s
nix log /nix/store/ynx1rlsbh78f6qnlx1hzbs8522g60cjx-nix-eval-jobs-2.35.4.drv
869.11 s
error: Cannot build '/nix/store/5rdr9jygkqhav1gyhy48wiwmhrhq5qam-unit-buildbot-worker.service.drv '.
869.11 s
Reason: 1 dependency failed .
869.11 s
Output paths:
869.11 s
/nix/store/29h98byy6cvqwd0kyaj6vgcz6mf95ysy-unit-buildbot-worker.service
869.11 s
Downloaded cached user-generators (408 B) in 5ms
869.11 s
Downloaded cached hm-putter.json (2800 B) in 5ms
869.12 s
Downloaded cached zlib-ng (196 KiB) in 15ms
869.12 s
Downloaded cached zmij (95 KiB) in 18ms
869.13 s
Downloaded cached python3.14-ijson (361 KiB) in 22ms
869.13 s
Downloaded cached zram-generator (1011 KiB) in 29ms
869.14 s
Built unit-podman-prune.service in 1.4s
869.15 s
Downloaded cached python3.14-ocrmypdf (3.3 MiB) in 46ms
869.47 s
Downloaded cached cargo (38.1 MiB) in 364ms
869.53 s
Downloaded cached jellyfin-ffmpeg-8.1.2-5-lib (36.6 MiB) in 421ms
869.54 s
Built unit-tailscaled-autoconnect.service in 1.7s
869.56 s
Built backupPrepareCommand in 2.1s
869.57 s
error: Cannot build '/nix/store/v2acwdsmgf6nifbrhwd49isynwrmas10-system-units.drv '.
869.57 s
Reason: 1 dependency failed .
869.57 s
Output paths:
869.57 s
/nix/store/q9jlzgacwil7h2a9xhjlq83m0xqwqyms-system-units
869.58 s
Built etc-containers-systemd-romm.container in 2.0s
869.60 s
Built etc-containers-systemd-romm.network in 2.0s
869.60 s
error: Cannot build '/nix/store/mryps4zk2ln1aq2flc94lga7p4h2jav4-etc.drv '.
869.60 s
Reason: 1 dependency failed .
869.60 s
Output paths:
869.60 s
/nix/store/xhk596xqw1nrd20pc6fbng6x1qlfs105-etc
869.60 s
Downloaded cached wandb-core (74.8 MiB) in 495ms
869.61 s
Built install-grub.sh in 3.8s
869.62 s
Built postgresql-and-plugins in 1.9s
869.65 s
Cannot build ' /nix/store/ddcnfsp2wrxvli74jkdp17cil6qpp2jd-nixos-system-theoden-26.11.20261003.73e728d.drv '.
869.65 s
Reason: 1 dependency failed .
869.65 s
Output paths:
869.65 s
/nix/store/hbw5zwap6qwfc0vfzyzhd9hr81dx9a2p-nixos-system-theoden-26.11.20261003.73e728d
869.77 s
Build failed.