1. 0.00 s $ /nix/store/9ypz3flqsrl5xl495mm8h645gadjsxi1-coreutils-9.11/bin/timeout --kill-after=15s 7200s /nix/store/23zk8sgzamrbmj1fday15szf7f2279s8-nix-2.34.7/bin/nix --extra-experimental-features nix-command --extra-experimental-features flakes --log-format internal-json build --no-link --print-out-paths git+https://github.com/alphal00p/gammaloop?ref=advanced_sampling&rev=06d470409cd34d8d57afa11b04a3fb208ca20890&shallow=1#checks.x86_64-linux.gammaloop-check --print-build-logs
  2. 0.84 s error (ignored): SQLite database '/var/cache/nix-ci-worker/eval-cache-v6/94fa1d4e764635858a8a977ddbe09d438888f0e645346bf600576055740a2a7d.sqlite' is busy
  3. 3.69 s
  4. 4.99 s Building /nix/store/i729pk8pca0mvg4wgc9cqnnlslm5qsi9-gammaloop-workspace-check-0.1.0.drv
  5. 5.15 s [gammaloop-workspace-check] Phase: unpackPhase
  6. 5.16 s [gammaloop-workspace-check] unpacking source archive /nix/store/qqslq36f7201lf1f2zyjcqsf7w9pg5dy-source
  7. 5.32 s [gammaloop-workspace-check] source root is source
  8. 5.36 s [gammaloop-workspace-check] Phase: patchPhase
  9. 5.38 s [gammaloop-workspace-check] Executing configureCargoCommonVars
  10. 5.39 s [gammaloop-workspace-check] decompressing cargo artifacts from /nix/store/50vpxlcgfxf2d57i27v3d10zjwxxbm2r-gammaloop-workspace-deps-deps-0.1.0/target.tar.zst to target
  11. 8.90 s [gammaloop-workspace-check] Phase: updateAutotoolsGnuConfigScriptsPhase
  12. 9.01 s [gammaloop-workspace-check] Phase: configurePhase
  13. 9.01 s [gammaloop-workspace-check] will append /build/source/.cargo-home/config.toml with contents of /nix/store/5drf77x6km4ky7gwlrzdx9bbd6fz09g3-vendor-cargo-deps/config.toml
  14. 9.02 s [gammaloop-workspace-check] default configurePhase, nothing to do
  15. 9.02 s [gammaloop-workspace-check] Phase: buildPhase
  16. 9.02 s [gammaloop-workspace-check] +++ command cargo --version
  17. 9.03 s [gammaloop-workspace-check] cargo 1.97.0 (c980f4866 2026-06-30)
  18. 9.06 s [gammaloop-workspace-check] +++ command cargo check --profile ci-optim --locked --workspace --features gammaloop-tracing-filter/clap,gammaloop-tracing-filter/symbolica,idenso/bincode,idenso/reference-cases,linnet/bincode,linnet/drawing,linnet/rkyv,linnet/serde,linnet/symbolica,spenso-macros/shadowing,spenso/shadowing,symbolica/tracing_max_level_info,three-dimensional-reps/display,three-dimensional-reps/eval,three-dimensional-reps/serde --all-targets
  19. 9.88 s [gammaloop-workspace-check] Checking cfg-if v1.0.4
  20. 9.88 s [gammaloop-workspace-check] Checking memchr v2.8.0
  21. 9.88 s [gammaloop-workspace-check] Checking once_cell v1.21.4
  22. 9.89 s [gammaloop-workspace-check] Checking either v1.15.0
  23. 9.90 s [gammaloop-workspace-check] Checking serde_core v1.0.228
  24. 9.90 s [gammaloop-workspace-check] Checking libc v0.2.186
  25. 9.91 s [gammaloop-workspace-check] Checking libm v0.2.16
  26. 9.91 s [gammaloop-workspace-check] Checking itoa v1.0.18
  27. 9.93 s [gammaloop-workspace-check] Checking log v0.4.29
  28. 9.94 s [gammaloop-workspace-check] Checking regex-syntax v0.8.10
  29. 9.94 s [gammaloop-workspace-check] Checking zerocopy v0.8.48
  30. 9.94 s [gammaloop-workspace-check] Checking crossbeam-utils v0.8.21
  31. 9.94 s [gammaloop-workspace-check] Checking equivalent v1.0.2
  32. 10.01 s [gammaloop-workspace-check] Checking zmij v1.0.21
  33. 10.02 s [gammaloop-workspace-check] Checking bytemuck v1.25.0
  34. 10.02 s [gammaloop-workspace-check] Checking lazy_static v1.5.0
  35. 10.04 s [gammaloop-workspace-check] Compiling target-lexicon v0.13.5
  36. 10.04 s [gammaloop-workspace-check] Checking arrayvec v0.7.6
  37. 10.09 s [gammaloop-workspace-check] Checking powerfmt v0.2.0
  38. 10.13 s [gammaloop-workspace-check] Checking num-conv v0.2.1
  39. 10.18 s [gammaloop-workspace-check] Checking num_threads v0.1.7
  40. 10.23 s [gammaloop-workspace-check] Checking time-core v0.1.8
  41. 10.25 s [gammaloop-workspace-check] Checking safe_arch v0.7.4
  42. 10.31 s [gammaloop-workspace-check] Checking pin-project-lite v0.2.17
  43. 10.44 s [gammaloop-workspace-check] Checking foldhash v0.2.0
  44. 10.45 s [gammaloop-workspace-check] Checking allocator-api2 v0.2.21
  45. 10.53 s [gammaloop-workspace-check] Checking const-random v0.1.18
  46. 10.56 s [gammaloop-workspace-check] Checking deranged v0.5.8
  47. 10.68 s [gammaloop-workspace-check] Checking tracing-core v0.1.36
  48. 10.72 s [gammaloop-workspace-check] Checking aho-corasick v1.1.4
  49. 10.90 s [gammaloop-workspace-check] Checking nu-ansi-term v0.50.3
  50. 10.91 s [gammaloop-workspace-check] Checking wide v0.7.33
  51. 10.92 s [gammaloop-workspace-check] Checking crossbeam-epoch v0.9.18
  52. 10.93 s [gammaloop-workspace-check] Checking static_assertions v1.1.0
  53. 10.93 s [gammaloop-workspace-check] Checking itertools v0.14.0
  54. 10.93 s [gammaloop-workspace-check] Checking winnow v1.0.2
  55. 10.94 s [gammaloop-workspace-check] Checking hashbrown v0.16.1
  56. 11.03 s [gammaloop-workspace-check] Checking unty v0.0.4
  57. 11.12 s [gammaloop-workspace-check] Checking safe_arch v1.0.0
  58. 11.18 s [gammaloop-workspace-check] Checking tracing-log v0.2.0
  59. 11.46 s [gammaloop-workspace-check] Checking tracing v0.1.44
  60. 11.48 s [gammaloop-workspace-check] Checking sharded-slab v0.1.7
  61. 11.83 s [gammaloop-workspace-check] Checking crossbeam-deque v0.8.6
  62. 11.96 s [gammaloop-workspace-check] Checking thread_local v1.1.9
  63. 12.21 s [gammaloop-workspace-check] Checking num-traits v0.2.19
  64. 12.42 s [gammaloop-workspace-check] Checking indenter v0.3.4
  65. 12.45 s [gammaloop-workspace-check] Checking az v1.3.0
  66. 12.53 s [gammaloop-workspace-check] Checking rayon-core v1.13.0
  67. 12.56 s [gammaloop-workspace-check] Checking toml_writer v1.1.1+spec-1.1.0
  68. 12.73 s [gammaloop-workspace-check] Checking wide v1.3.0
  69. 12.77 s [gammaloop-workspace-check] Compiling phf_shared v0.11.3
  70. 12.87 s [gammaloop-workspace-check] Checking rayon v1.12.0
  71. 13.21 s [gammaloop-workspace-check] Checking anyhow v1.0.102
  72. 13.36 s [gammaloop-workspace-check] Checking utf8parse v0.2.2
  73. 13.45 s [gammaloop-workspace-check] Checking rawpointer v0.2.1
  74. 13.50 s [gammaloop-workspace-check] Checking dyn-clone v1.0.20
  75. 13.78 s [gammaloop-workspace-check] Checking alloc-no-stdlib v2.0.4
  76. 13.84 s [gammaloop-workspace-check] Checking anstyle-parse v1.0.0
  77. 13.84 s [gammaloop-workspace-check] Checking matrixmultiply v0.3.10
  78. 13.95 s [gammaloop-workspace-check] Checking alloc-stdlib v0.2.2
  79. 13.98 s [gammaloop-workspace-check] Checking colored v3.1.1
  80. 14.11 s [gammaloop-workspace-check] Checking anstyle v1.0.14
  81. 14.11 s [gammaloop-workspace-check] Checking serde v1.0.228
  82. 14.11 s [gammaloop-workspace-check] Checking serde_json v1.0.149
  83. 14.32 s [gammaloop-workspace-check] Checking approx v0.5.1
  84. 14.32 s [gammaloop-workspace-check] Checking bitflags v2.11.1
  85. 14.60 s [gammaloop-workspace-check] Checking num-integer v0.1.46
  86. 14.68 s [gammaloop-workspace-check] Checking toml_parser v1.1.2+spec-1.1.0
  87. 14.77 s [gammaloop-workspace-check] Checking serde_spanned v1.1.1
  88. 14.89 s [gammaloop-workspace-check] Checking toml_datetime v1.1.1+spec-1.1.0
  89. 15.10 s [gammaloop-workspace-check] Checking is_terminal_polyfill v1.70.2
  90. 15.16 s [gammaloop-workspace-check] Checking anstyle-query v1.1.5
  91. 15.22 s [gammaloop-workspace-check] Checking getrandom v0.3.4
  92. 15.22 s [gammaloop-workspace-check] Checking time v0.3.47
  93. 15.26 s [gammaloop-workspace-check] Checking gmp-mpfr-sys v1.7.1
  94. 15.36 s [gammaloop-workspace-check] Checking colorchoice v1.0.5
  95. 15.43 s [gammaloop-workspace-check] Checking rand_core v0.9.5
  96. 15.45 s [gammaloop-workspace-check] Compiling phf_generator v0.11.3
  97. 15.46 s [gammaloop-workspace-check] Checking eyre v0.6.12
  98. 15.48 s [gammaloop-workspace-check] Checking unicode-width v0.2.2
  99. 15.54 s [gammaloop-workspace-check] Checking anstream v1.0.0
  100. 15.63 s [gammaloop-workspace-check] Checking bitflags v1.3.2
  101. 15.66 s [gammaloop-workspace-check] Checking smallvec v1.15.1
  102. 15.75 s [gammaloop-workspace-check] Checking num-complex v0.4.6
  103. 15.87 s [gammaloop-workspace-check] Checking tracing-serde v0.2.0
  104. 15.97 s [gammaloop-workspace-check] Checking bincode v2.0.1
  105. 16.00 s [gammaloop-workspace-check] Compiling phf_codegen v0.11.3
  106. 16.02 s [gammaloop-workspace-check] Checking toml v1.1.2+spec-1.1.0
  107. 16.06 s [gammaloop-workspace-check] Checking region v3.0.2
  108. 16.22 s [gammaloop-workspace-check] Checking wasmtime-jit-icache-coherence v34.0.2
  109. 16.27 s [gammaloop-workspace-check] Checking hugepage-rs v0.1.1
  110. 16.33 s [gammaloop-workspace-check] Checking brotli-decompressor v5.0.0
  111. 16.35 s [gammaloop-workspace-check] Checking spec_math v0.1.6
  112. 16.53 s [gammaloop-workspace-check] Checking inventory v0.3.24
  113. 16.54 s [gammaloop-workspace-check] Checking thiserror v2.0.18
  114. 16.60 s [gammaloop-workspace-check] Checking simba v0.9.1
  115. 16.69 s [gammaloop-workspace-check] Checking smartstring v1.0.1
  116. 16.71 s [gammaloop-workspace-check] Compiling getopts v0.2.24
  117. 16.73 s [gammaloop-workspace-check] Checking libloading v0.9.0
  118. 16.74 s [gammaloop-workspace-check] Checking byteorder v1.5.0
  119. 16.83 s [gammaloop-workspace-check] Compiling pyo3-build-config v0.28.3
  120. 17.14 s [gammaloop-workspace-check] Checking bytes v1.11.1
  121. 17.16 s [gammaloop-workspace-check] Checking tinyjson v2.5.1
  122. 17.22 s [gammaloop-workspace-check] Checking regex-automata v0.4.14
  123. 17.26 s [gammaloop-workspace-check] Checking self_cell v1.2.2
  124. 17.53 s [gammaloop-workspace-check] Checking append-only-vec v0.1.8
  125. 17.85 s [gammaloop-workspace-check] Compiling unicode_names2_generator v1.3.0
  126. 18.00 s [gammaloop-workspace-check] Compiling unic-char-range v0.9.0
  127. 18.05 s [gammaloop-workspace-check] Checking linux-raw-sys v0.12.1
  128. 18.07 s [gammaloop-workspace-check] Compiling unic-common v0.9.0
  129. 18.14 s [gammaloop-workspace-check] Compiling is-macro v0.3.7
  130. 18.24 s [gammaloop-workspace-check] Compiling unic-char-property v0.9.0
  131. 18.45 s [gammaloop-workspace-check] Compiling unic-ucd-version v0.9.0
  132. 18.51 s [gammaloop-workspace-check] Compiling rustpython-parser-vendored v0.4.0
  133. 18.60 s [gammaloop-workspace-check] Checking iana-time-zone v0.1.65
  134. 18.61 s [gammaloop-workspace-check] Checking brotli v8.0.2
  135. 18.69 s [gammaloop-workspace-check] Checking rustix v1.1.4
  136. 18.74 s [gammaloop-workspace-check] Checking chrono v0.4.44
  137. 18.90 s [gammaloop-workspace-check] Compiling rustpython-parser v0.4.0
  138. 19.07 s [gammaloop-workspace-check] Compiling phf v0.11.3
  139. 19.19 s [gammaloop-workspace-check] Checking rustc-hash v2.1.2
  140. 19.49 s [gammaloop-workspace-check] Compiling unic-emoji-char v0.9.0
  141. 19.60 s [gammaloop-workspace-check] Compiling unic-ucd-ident v0.9.0
  142. 19.75 s [gammaloop-workspace-check] Checking ndarray v0.17.2
  143. 19.76 s [gammaloop-workspace-check] Compiling lalrpop-util v0.20.2
  144. 19.80 s [gammaloop-workspace-check] Compiling rustc-hash v1.1.0
  145. 19.97 s [gammaloop-workspace-check] Checking rug v1.30.0
  146. 19.98 s [gammaloop-workspace-check] Checking unicode-segmentation v1.13.2
  147. 20.02 s [gammaloop-workspace-check] Compiling symbolica v2.2.0 (https://github.com/alphal00p/symbolica?rev=a277a8dadbaae5a8d6605f2f381991a601e1f345#a277a8da)
  148. 20.26 s [gammaloop-workspace-check] Checking typenum v1.20.0
  149. 20.75 s [gammaloop-workspace-check] Checking getrandom v0.2.17
  150. 20.87 s [gammaloop-workspace-check] Checking scopeguard v1.2.0
  151. 21.12 s [gammaloop-workspace-check] Checking lock_api v0.4.14
  152. 21.24 s [gammaloop-workspace-check] Checking parking_lot_core v0.9.12
  153. 21.49 s [gammaloop-workspace-check] Checking hashbrown v0.17.0
  154. 21.64 s [gammaloop-workspace-check] Checking unicode-ident v1.0.24
  155. 21.78 s [gammaloop-workspace-check] Checking errno v0.3.14
  156. 21.80 s [gammaloop-workspace-check] Checking parking_lot v0.12.5
  157. 22.18 s [gammaloop-workspace-check] Checking unicase v2.9.0
  158. 22.48 s [gammaloop-workspace-check] Checking clap_lex v1.1.0
  159. 22.50 s [gammaloop-workspace-check] Checking terminal_size v0.4.4
  160. 22.53 s [gammaloop-workspace-check] Checking ppv-lite86 v0.2.21
  161. 22.55 s [gammaloop-workspace-check] Checking ahash v0.8.12
  162. 22.57 s [gammaloop-workspace-check] Checking generic-array v0.14.7
  163. 22.75 s [gammaloop-workspace-check] Checking strsim v0.11.1
  164. 22.89 s [gammaloop-workspace-check] Checking signal-hook-registry v1.4.8
  165. 23.06 s [gammaloop-workspace-check] Checking vte v0.14.1
  166. 23.08 s [gammaloop-workspace-check] Checking same-file v1.0.6
  167. 23.24 s [gammaloop-workspace-check] Checking indexmap v2.14.0
  168. 23.27 s [gammaloop-workspace-check] Checking clap_builder v4.6.0
  169. 23.34 s [gammaloop-workspace-check] Checking walkdir v2.5.0
  170. 23.51 s [gammaloop-workspace-check] Checking signal-hook v0.3.18
  171. 23.52 s [gammaloop-workspace-check] Checking rand_chacha v0.9.0
  172. 23.80 s [gammaloop-workspace-check] Checking half v2.7.1
  173. 23.87 s [gammaloop-workspace-check] Checking mio v1.2.0
  174. 24.19 s [gammaloop-workspace-check] Checking minimal-lexical v0.2.1
  175. 24.41 s [gammaloop-workspace-check] Checking block-buffer v0.10.4
  176. 24.42 s [gammaloop-workspace-check] Checking rand v0.9.4
  177. 24.45 s [gammaloop-workspace-check] Checking crypto-common v0.1.7
  178. 24.62 s [gammaloop-workspace-check] Checking ciborium-io v0.2.2
  179. 24.62 s [gammaloop-workspace-check] Checking digest v0.10.7
  180. 24.81 s [gammaloop-workspace-check] Checking ciborium-ll v0.2.2
  181. 24.83 s [gammaloop-workspace-check] Checking nom v7.1.3
  182. 25.08 s [gammaloop-workspace-check] Checking derive_more v2.1.1
  183. 25.08 s [gammaloop-workspace-check] Checking signal-hook-mio v0.2.5
  184. 25.13 s [gammaloop-workspace-check] Checking console v0.16.3
  185. 25.21 s [gammaloop-workspace-check] Checking num-bigint v0.4.6
  186. 25.28 s [gammaloop-workspace-check] Checking bstr v1.12.1
  187. 25.86 s [gammaloop-workspace-check] Checking linux-raw-sys v0.4.15
  188. 26.01 s [gammaloop-workspace-check] Checking symjit v2.21.0
  189. 26.62 s [gammaloop-workspace-check] Checking cpufeatures v0.2.17
  190. 26.67 s [gammaloop-workspace-check] Checking winnow v0.7.15
  191. 27.04 s [gammaloop-workspace-check] Checking sha2 v0.10.9
  192. 27.47 s [gammaloop-workspace-check] Checking rustix v0.38.44
  193. 27.75 s [gammaloop-workspace-check] Checking ciborium v0.2.2
  194. 28.55 s [gammaloop-workspace-check] Checking matchers v0.2.0
  195. 28.66 s [gammaloop-workspace-check] Checking tracing-subscriber v0.3.23
  196. 28.79 s [gammaloop-workspace-check] Checking regex v1.12.3
  197. 28.99 s [gammaloop-workspace-check] Checking ansitok v0.3.0
  198. 29.36 s [gammaloop-workspace-check] Checking globset v0.4.18
  199. 29.37 s [gammaloop-workspace-check] Checking rand_core v0.6.4
  200. 29.86 s [gammaloop-workspace-check] Checking getrandom v0.4.2
  201. 30.12 s [gammaloop-workspace-check] Checking plotters-backend v0.3.7
  202. 30.19 s [gammaloop-workspace-check] Checking fastrand v2.4.1
  203. 30.19 s [gammaloop-workspace-check] Checking fnv v1.0.7
  204. 30.30 s [gammaloop-workspace-check] Checking crossterm v0.28.1
  205. 30.38 s [gammaloop-workspace-check] Checking clap v4.6.1
  206. 30.41 s [gammaloop-workspace-check] Checking rust-embed-utils v8.11.0
  207. 30.46 s [gammaloop-workspace-check] Checking xprec v0.2.2
  208. 30.49 s [gammaloop-workspace-check] Checking serde_spanned v0.6.9
  209. 30.51 s [gammaloop-workspace-check] Checking toml_datetime v0.6.11
  210. 30.56 s [gammaloop-workspace-check] Checking itertools v0.10.5
  211. 30.66 s [gammaloop-workspace-check] Checking cast v0.3.0
  212. 30.69 s [gammaloop-workspace-check] Checking plotters-svg v0.3.7
  213. 30.78 s [gammaloop-workspace-check] Checking toml_write v0.1.2
  214. 30.80 s [gammaloop-workspace-check] Checking tempfile v3.27.0
  215. 31.01 s [gammaloop-workspace-check] Checking tap v1.0.1
  216. 31.04 s [gammaloop-workspace-check] Checking plotters v0.3.7
  217. 31.07 s [gammaloop-workspace-check] Checking ansi-str v0.9.0
  218. 31.12 s [gammaloop-workspace-check] Checking wyz v0.5.1
  219. 31.34 s [gammaloop-workspace-check] Checking rand_chacha v0.3.1
  220. 31.51 s [gammaloop-workspace-check] Checking radium v0.7.0
  221. 31.52 s [gammaloop-workspace-check] Compiling unicode_names2 v1.3.0
  222. 31.65 s [gammaloop-workspace-check] Checking typeid v1.0.3
  223. 31.77 s [gammaloop-workspace-check] Checking similar v2.7.0
  224. 31.78 s [gammaloop-workspace-check] Checking tinytemplate v1.2.1
  225. 31.81 s [gammaloop-workspace-check] Checking is-terminal v0.4.17
  226. 31.94 s [gammaloop-workspace-check] Checking oorandom v11.1.5
  227. 31.99 s [gammaloop-workspace-check] Checking toml_edit v0.22.27
  228. 32.05 s [gammaloop-workspace-check] Checking anes v0.1.6
  229. 32.07 s [gammaloop-workspace-check] Checking bytecount v0.6.9
  230. 32.18 s [gammaloop-workspace-check] Checking funty v2.0.0
  231. 32.19 s [gammaloop-workspace-check] Checking papergrid v0.17.0
  232. 32.42 s [gammaloop-workspace-check] Checking rand v0.8.6
  233. 32.47 s [gammaloop-workspace-check] Checking ron v0.12.1
  234. 32.50 s [gammaloop-workspace-check] Checking testing_table v0.3.0
  235. 32.67 s [gammaloop-workspace-check] Checking env_filter v1.0.1
  236. 33.08 s [gammaloop-workspace-check] Checking toml_edit v0.25.11+spec-1.1.0
  237. 33.08 s [gammaloop-workspace-check] Checking uncased v0.9.10
  238. 33.12 s [gammaloop-workspace-check] Checking bitvec v1.0.1
  239. 33.31 s [gammaloop-workspace-check] Checking jiff v0.2.24
  240. 33.37 s [gammaloop-workspace-check] Checking ptr_meta v0.1.4
  241. 33.48 s [gammaloop-workspace-check] Checking ucd-trie v0.1.7
  242. 33.49 s [gammaloop-workspace-check] Checking simdutf8 v0.1.5
  243. 33.70 s [gammaloop-workspace-check] Checking pest v2.8.6
  244. 33.84 s [gammaloop-workspace-check] Checking bytecheck v0.6.12
  245. 34.18 s [gammaloop-workspace-check] Checking ahash v0.7.8
  246. 34.31 s [gammaloop-workspace-check] Checking insta v1.47.2
  247. 34.35 s [gammaloop-workspace-check] Checking approx v0.4.0
  248. 34.50 s [gammaloop-workspace-check] Checking hashbrown v0.12.3
  249. 34.60 s [gammaloop-workspace-check] Checking seahash v4.1.0
  250. 34.64 s [gammaloop-workspace-check] Checking criterion-plot v0.5.0
  251. 34.86 s [gammaloop-workspace-check] Checking cgmath v0.18.0
  252. 34.86 s [gammaloop-workspace-check] Checking rend v0.4.2
  253. 35.24 s [gammaloop-workspace-check] Checking tabled v0.20.0
  254. 35.83 s [gammaloop-workspace-check] Checking criterion v0.5.1
  255. 36.23 s [gammaloop-workspace-check] Checking num-rational v0.4.2
  256. 36.78 s [gammaloop-workspace-check] Checking num-iter v0.1.45
  257. 37.00 s [gammaloop-workspace-check] Checking ref-ops v0.2.5
  258. 37.19 s [gammaloop-workspace-check] Checking rand_xoshiro v0.6.0
  259. 37.30 s [gammaloop-workspace-check] Checking num v0.4.3
  260. 37.36 s [gammaloop-workspace-check] Checking features v0.10.0
  261. 37.42 s [gammaloop-workspace-check] Checking dot-parser v0.5.1
  262. 37.48 s [gammaloop-workspace-check] Checking constcat v0.5.1
  263. 37.58 s [gammaloop-workspace-check] Checking gat-lending-iterator v0.1.8
  264. 37.65 s [gammaloop-workspace-check] Checking colored v2.2.0
  265. 37.77 s [gammaloop-workspace-check] Checking constant_time_eq v0.4.2
  266. 37.84 s [gammaloop-workspace-check] Checking arrayref v0.3.9
  267. 37.93 s [gammaloop-workspace-check] Checking cpufeatures v0.3.0
  268. 38.02 s [gammaloop-workspace-check] Checking base64 v0.22.1
  269. 38.06 s [gammaloop-workspace-check] Checking blake3 v1.8.5
  270. 38.32 s [gammaloop-workspace-check] Checking siphasher v1.0.2
  271. 38.47 s [gammaloop-workspace-check] Checking joinery v2.1.0
  272. 38.67 s [gammaloop-workspace-check] Checking phf_shared v0.13.1
  273. 38.68 s [gammaloop-workspace-check] Checking titlecase v2.2.1
  274. 38.74 s [gammaloop-workspace-check] Checking toml v0.8.23
  275. 38.88 s [gammaloop-workspace-check] Checking subprocess v0.2.15
  276. 38.96 s [gammaloop-workspace-check] Checking rust_lisp v0.18.0
  277. 39.06 s [gammaloop-workspace-check] Compiling vakint v0.1.2 (/build/source/crates/vakint)
  278. 39.28 s [gammaloop-workspace-check] Checking version-compare v0.2.1
  279. 39.29 s [gammaloop-workspace-check] Checking xpct v0.5.1
  280. 39.40 s [gammaloop-workspace-check] Checking phf v0.13.1
  281. 39.41 s [gammaloop-workspace-check] Checking ryu v1.0.23
  282. 39.55 s [gammaloop-workspace-check] Compiling pyo3-macros-backend v0.28.3
  283. 39.59 s [gammaloop-workspace-check] Compiling pyo3-ffi v0.28.3
  284. 39.66 s [gammaloop-workspace-check] Compiling pyo3 v0.28.3
  285. 39.68 s [gammaloop-workspace-check] Compiling numpy v0.28.0
  286. 39.86 s [gammaloop-workspace-check] Checking figment v0.10.19
  287. 39.89 s [gammaloop-workspace-check] Checking castaway v0.2.4
  288. 39.93 s [gammaloop-workspace-check] Checking toml_datetime v0.7.5+spec-1.1.0
  289. 40.02 s [gammaloop-workspace-check] Checking compact_str v0.9.0
  290. 40.02 s [gammaloop-workspace-check] Checking strum v0.27.2
  291. 40.15 s [gammaloop-workspace-check] Checking string-template-plus v0.4.3
  292. 40.18 s [gammaloop-workspace-check] Checking unicode-truncate v2.0.1
  293. 40.27 s [gammaloop-workspace-check] Checking kasuari v0.4.12
  294. 40.35 s [gammaloop-workspace-check] Checking lru v0.16.4
  295. 40.38 s [gammaloop-workspace-check] Checking vte v0.15.0
  296. 40.48 s [gammaloop-workspace-check] Checking portable-atomic v1.13.1
  297. 40.55 s [gammaloop-workspace-check] Checking toml v0.9.12+spec-1.1.0
  298. 40.61 s [gammaloop-workspace-check] Checking vt100 v0.16.2
  299. 40.69 s [gammaloop-workspace-check] Checking unit-prefix v0.5.2
  300. 40.87 s [gammaloop-workspace-check] Checking rand_distr v0.4.3
  301. 40.88 s [gammaloop-workspace-check] Checking simba v0.6.0
  302. 41.07 s [gammaloop-workspace-check] Checking line-clipping v0.3.7
  303. 41.09 s [gammaloop-workspace-check] Checking gimli v0.32.3
  304. 41.28 s [gammaloop-workspace-check] Checking adler2 v2.0.1
  305. 41.30 s [gammaloop-workspace-check] Compiling three-dimensional-reps v0.1.0 (/build/source/crates/three-dimensional-reps)
  306. 41.37 s [gammaloop-workspace-check] Checking miniz_oxide v0.8.9
  307. 41.40 s [gammaloop-workspace-check] Checking thiserror v1.0.69
  308. 41.49 s [gammaloop-workspace-check] Checking derive_builder v0.11.2
  309. 41.62 s [gammaloop-workspace-check] Checking owo-colors v4.3.0
  310. 41.66 s [gammaloop-workspace-check] Checking object v0.37.3
  311. 41.69 s [gammaloop-workspace-check] Checking crossterm v0.29.0
  312. 41.71 s [gammaloop-workspace-check] Checking tracing-error v0.2.1
  313. 41.80 s [gammaloop-workspace-check] Checking typed-index-collections v3.5.0
  314. 42.16 s [gammaloop-workspace-check] Checking ratatui-core v0.1.0
  315. 42.18 s [gammaloop-workspace-check] Checking serde-big-array v0.5.1
  316. 42.19 s [gammaloop-workspace-check] Checking amd v0.2.2
  317. 42.47 s [gammaloop-workspace-check] Checking indicatif v0.18.4
  318. 42.54 s [gammaloop-workspace-check] Checking itertools v0.11.0
  319. 42.68 s [gammaloop-workspace-check] Compiling rustpython-parser-core v0.4.0
  320. 42.78 s [gammaloop-workspace-check] Compiling gammaloop-tracing-filter-macros v0.1.0 (/build/source/crates/gammaloop-tracing-filter-macros)
  321. 42.92 s [gammaloop-workspace-check] Checking rustc-demangle v0.1.27
  322. 43.49 s [gammaloop-workspace-check] Compiling rustpython-ast v0.4.0
  323. 43.54 s [gammaloop-workspace-check] Checking option-ext v0.2.0
  324. 43.66 s [gammaloop-workspace-check] Checking dirs-sys v0.5.0
  325. 43.80 s [gammaloop-workspace-check] Checking color-spantrace v0.3.0
  326. 43.83 s [gammaloop-workspace-check] Checking ref-cast v1.0.25
  327. 43.85 s [gammaloop-workspace-check] Checking nix v0.31.2
  328. 43.92 s [gammaloop-workspace-check] Checking integer-sqrt v0.1.5
  329. 43.99 s [gammaloop-workspace-check] Checking brotli-decompressor v4.0.3
  330. 44.03 s [gammaloop-workspace-check] Checking itertools v0.12.1
  331. 44.05 s [gammaloop-workspace-check] Checking crossbeam-channel v0.5.15
  332. 44.06 s [gammaloop-workspace-check] Compiling gammalooprs v0.3.4 (/build/source/crates/gammalooprs)
  333. 44.10 s [gammaloop-workspace-check] Checking unsafe-libyaml v0.2.11
  334. 44.12 s [gammaloop-workspace-check] Checking env_logger v0.11.10
  335. 44.83 s [gammaloop-workspace-check] Checking symlink v0.1.0
  336. 44.95 s [gammaloop-workspace-check] Checking include_dir v0.7.4
  337. 45.05 s [gammaloop-workspace-check] Checking tracing-appender v0.2.5
  338. 45.06 s [gammaloop-workspace-check] Checking dirs v6.0.0
  339. 45.19 s [gammaloop-workspace-check] Checking pathfinding v4.15.0
  340. 45.21 s [gammaloop-workspace-check] Checking schemars v1.2.1
  341. 45.54 s [gammaloop-workspace-check] Checking tracing-indicatif v0.3.14
  342. 45.55 s [gammaloop-workspace-check] Checking ratatui-widgets v0.3.0
  343. 45.71 s [gammaloop-workspace-check] Checking rkyv v0.7.46
  344. 45.73 s [gammaloop-workspace-check] Checking ratatui-crossterm v0.1.0
  345. 46.01 s [gammaloop-workspace-check] Checking brotli v7.0.0
  346. 46.04 s [gammaloop-workspace-check] Checking ctrlc v3.5.2
  347. 46.14 s [gammaloop-workspace-check] Checking slotmap v1.1.1
  348. 46.45 s [gammaloop-workspace-check] Checking json5 v0.4.1
  349. 46.57 s [gammaloop-workspace-check] Checking vectorize v0.2.0
  350. 46.59 s [gammaloop-workspace-check] Checking addr2line v0.25.1
  351. 46.67 s [gammaloop-workspace-check] Checking ringbuffer v0.16.0
  352. 46.70 s [gammaloop-workspace-check] Checking base62 v2.2.4
  353. 46.83 s [gammaloop-workspace-check] Checking clarabel v0.11.1
  354. 46.92 s [gammaloop-workspace-check] Checking rust-embed v8.11.0
  355. 47.03 s [gammaloop-workspace-check] Checking clap_complete v4.6.3
  356. 47.08 s [gammaloop-workspace-check] Checking serde_yaml v0.9.34+deprecated
  357. 47.26 s [gammaloop-workspace-check] Checking strip-ansi-escapes v0.2.1
  358. 47.43 s [gammaloop-workspace-check] Checking fd-lock v4.0.4
  359. 47.53 s [gammaloop-workspace-check] Compiling gammaloop-api v0.1.0 (/build/source/crates/gammaloop-api)
  360. 47.55 s [gammaloop-workspace-check] Checking itertools v0.13.0
  361. 47.78 s [gammaloop-workspace-check] Checking strum v0.26.3
  362. 47.80 s [gammaloop-workspace-check] Checking clap_complete_nushell v4.6.0
  363. 47.93 s [gammaloop-workspace-check] Checking ratatui-macros v0.7.0
  364. 48.03 s [gammaloop-workspace-check] Checking ratatui v0.30.0
  365. 48.06 s [gammaloop-workspace-check] Checking sysinfo v0.33.1
  366. 48.08 s [gammaloop-workspace-check] Checking shlex v1.3.0
  367. 48.12 s [gammaloop-workspace-check] Checking slab v0.4.12
  368. 48.17 s [gammaloop-workspace-check] Checking futures-task v0.3.32
  369. 48.22 s [gammaloop-workspace-check] Checking futures-core v0.3.32
  370. 48.27 s [gammaloop-workspace-check] Checking sdd v3.0.10
  371. 48.34 s [gammaloop-workspace-check] Compiling gammaloop-integration-tests v0.1.0 (/build/source/tests)
  372. 48.37 s [gammaloop-workspace-check] Compiling test-log-core v0.2.20
  373. 48.44 s [gammaloop-workspace-check] Compiling rustc_version v0.4.1
  374. 48.50 s [gammaloop-workspace-check] Checking futures-util v0.3.32
  375. 49.34 s [gammaloop-workspace-check] Checking scc v2.4.0
  376. 50.37 s [gammaloop-workspace-check] Checking reedline v0.42.0
  377. 50.43 s [gammaloop-workspace-check] Checking which v8.0.2
  378. 50.81 s [gammaloop-workspace-check] Compiling gungraun-macros v0.8.0
  379. 50.83 s [gammaloop-workspace-check] Checking bincode v1.3.3
  380. 50.90 s [gammaloop-workspace-check] Checking backtrace v0.3.76
  381. 51.40 s [gammaloop-workspace-check] Compiling gungraun-runner v0.18.2
  382. 51.96 s [gammaloop-workspace-check] Checking nalgebra v0.29.0
  383. 52.21 s [gammaloop-workspace-check] Checking color-eyre v0.6.5
  384. 52.48 s [gammaloop-workspace-check] Checking proc-macro2 v1.0.106
  385. 52.55 s [gammaloop-workspace-check] Checking maplit v1.0.2
  386. 52.63 s [gammaloop-workspace-check] Checking base64 v0.21.7
  387. 52.85 s [gammaloop-workspace-check] Compiling iai-callgrind-runner v0.14.2
  388. 52.90 s [gammaloop-workspace-check] Checking ron v0.8.1
  389. 53.18 s [gammaloop-workspace-check] Compiling numerica v2.2.0 (https://github.com/alphal00p/symbolica?rev=a277a8dadbaae5a8d6605f2f381991a601e1f345#a277a8da)
  390. 53.57 s [gammaloop-workspace-check] Checking quote v1.0.45
  391. 53.60 s [gammaloop-workspace-check] Checking futures-executor v0.3.32
  392. 53.69 s [gammaloop-workspace-check] Checking kurbo v0.13.0
  393. 54.00 s [gammaloop-workspace-check] Checking serial_test v3.4.0
  394. 54.02 s [gammaloop-workspace-check] Checking wait-timeout v0.2.1
  395. 54.02 s [gammaloop-workspace-check] Compiling iai-callgrind v0.14.2
  396. 54.16 s [gammaloop-workspace-check] Checking quick-error v1.2.3
  397. 54.24 s [gammaloop-workspace-check] Checking bit-vec v0.8.0
  398. 54.38 s [gammaloop-workspace-check] Checking rusty-fork v0.3.1
  399. 54.68 s [gammaloop-workspace-check] Checking syn v2.0.117
  400. 54.86 s [gammaloop-workspace-check] Checking bit-set v0.8.0
  401. 54.90 s [gammaloop-workspace-check] Compiling iai-callgrind-macros v0.5.1
  402. 55.03 s [gammaloop-workspace-check] Checking rand_xorshift v0.4.0
  403. 55.09 s [gammaloop-workspace-check] Checking console v0.15.11
  404. 55.19 s [gammaloop-workspace-check] Compiling test-log-macros v0.2.20
  405. 55.29 s [gammaloop-workspace-check] Checking unarray v0.1.4
  406. 55.42 s [gammaloop-workspace-check] Checking pathdiff v0.2.3
  407. 55.56 s [gammaloop-workspace-check] Checking proptest v1.11.0
  408. 56.02 s [gammaloop-workspace-check] Checking similar-asserts v1.7.0
  409. 56.33 s [gammaloop-workspace-check] Checking kurvst v0.1.0 (/build/source/crates/kurvst)
  410. 56.59 s [gammaloop-workspace-check] Checking clinnet v0.1.8 (/build/source/crates/clinnet)
  411. 59.84 s [gammaloop-workspace-check] Checking test-log v0.2.20
  412. 60.98 s [gammaloop-workspace-check] Compiling graphica v2.1.0 (https://github.com/alphal00p/symbolica?rev=a277a8dadbaae5a8d6605f2f381991a601e1f345#a277a8da)
  413. 62.78 s [gammaloop-workspace-check] Checking statrs v0.16.1
  414. 63.59 s [gammaloop-workspace-check] Checking momtrop v0.3.0
  415. 64.80 s [gammaloop-workspace-check] Checking gungraun v0.18.2
  416. 66.58 s [gammaloop-workspace-check] Compiling pyo3-stub-gen-derive v0.17.2
  417. 67.21 s [gammaloop-workspace-check] Compiling pyo3-macros v0.28.3
  418. 72.91 s [gammaloop-workspace-check] Checking pyo3-stub-gen v0.17.2
  419. 79.06 s [gammaloop-workspace-check] Checking symbolica-utils v0.1.0 (/build/source/crates/symbolica-utils)
  420. 79.07 s [gammaloop-workspace-check] Checking spenso-macros v0.3.2 (/build/source/crates/spenso-macros)
  421. 249.96 s [gammaloop-workspace-check] Compiling gammaloop-workspace-hack v0.1.0 (/build/source/crates/gammaloop-workspace-hack)
  422. 250.31 s [gammaloop-workspace-check] Checking linnet v0.17.0 (/build/source/crates/linnet)
  423. 253.63 s [gammaloop-workspace-check] Checking spenso v0.6.0 (/build/source/crates/spenso)
  424. 253.78 s [gammaloop-workspace-check] Checking linnet-py v0.1.0 (/build/source/crates/linnet-py)
  425. 253.78 s [gammaloop-workspace-check] Checking linnest v0.1.0 (/build/source/crates/linnest)
  426. 259.20 s [gammaloop-workspace-check] Checking idenso v0.3.0 (/build/source/crates/idenso)
  427. 259.20 s [gammaloop-workspace-check] Checking gammaloop-tracing-filter v0.1.0 (/build/source/crates/gammaloop-tracing-filter)
  428. 260.84 s [gammaloop-workspace-check] Checking spenso-hep-lib v0.1.7 (/build/source/crates/spenso-hep-lib)
  429. 261.08 s [gammaloop-workspace-check] Checking spynso3 v0.1.2 (/build/source/crates/spynso3)
  430. 288.25 s [gammaloop-workspace-check] error[E0560]: struct `CutInfo` has no field named `lmb_channel_id`
  431. 288.25 s [gammaloop-workspace-check] --> tests/tests/test_differential.rs:86:13
  432. 288.25 s [gammaloop-workspace-check] |
  433. 288.25 s [gammaloop-workspace-check] 86 | lmb_channel_id: None,
  434. 288.25 s [gammaloop-workspace-check] | ^^^^^^^^^^^^^^ `CutInfo` does not have this field
  435. 288.25 s [gammaloop-workspace-check] |
  436. 288.25 s [gammaloop-workspace-check] = note: available fields are: `sampling_channel_id`, `sampling_channel_edge_ids`
  437. 288.25 s [gammaloop-workspace-check]
  438. 288.25 s [gammaloop-workspace-check] error[E0560]: struct `CutInfo` has no field named `lmb_channel_edge_ids`
  439. 288.25 s [gammaloop-workspace-check] --> tests/tests/test_differential.rs:87:13
  440. 288.25 s [gammaloop-workspace-check] |
  441. 288.25 s [gammaloop-workspace-check] 87 | lmb_channel_edge_ids: None,
  442. 288.25 s [gammaloop-workspace-check] | ^^^^^^^^^^^^^^^^^^^^ `CutInfo` does not have this field
  443. 288.25 s [gammaloop-workspace-check] |
  444. 288.25 s [gammaloop-workspace-check] = note: available fields are: `sampling_channel_id`, `sampling_channel_edge_ids`
  445. 288.25 s [gammaloop-workspace-check]
  446. 288.27 s [gammaloop-workspace-check] error[E0063]: missing field `reference_moments` in initializer of `GraphEvaluationResult<_>`
  447. 288.27 s [gammaloop-workspace-check] --> tests/tests/test_differential.rs:532:19
  448. 288.27 s [gammaloop-workspace-check] |
  449. 288.27 s [gammaloop-workspace-check] 532 | let mut lhs = GraphEvaluationResult {
  450. 288.27 s [gammaloop-workspace-check] | ^^^^^^^^^^^^^^^^^^^^^ missing `reference_moments`
  451. 288.27 s [gammaloop-workspace-check]
  452. 288.27 s [gammaloop-workspace-check] error[E0063]: missing field `reference_moments` in initializer of `GraphEvaluationResult<_>`
  453. 288.27 s [gammaloop-workspace-check] --> tests/tests/test_differential.rs:539:15
  454. 288.27 s [gammaloop-workspace-check] |
  455. 288.27 s [gammaloop-workspace-check] 539 | let rhs = GraphEvaluationResult {
  456. 288.27 s [gammaloop-workspace-check] | ^^^^^^^^^^^^^^^^^^^^^ missing `reference_moments`
  457. 288.27 s [gammaloop-workspace-check]
  458. 288.30 s [gammaloop-workspace-check] error[E0609]: no field `lmb_channel_edge_ids` on type `CutInfo`
  459. 288.30 s [gammaloop-workspace-check] --> tests/tests/test_evaluation_api.rs:311:10
  460. 288.30 s [gammaloop-workspace-check] |
  461. 288.30 s [gammaloop-workspace-check] 311 | .lmb_channel_edge_ids
  462. 288.30 s [gammaloop-workspace-check] | ^^^^^^^^^^^^^^^^^^^^ unknown field
  463. 288.30 s [gammaloop-workspace-check] |
  464. 288.30 s [gammaloop-workspace-check] = note: available fields are: `particle_pdgs`, `cut_id`, `graph_id`, `graph_group_id`, `orientation_id` ... and 2 others
  465. 288.30 s [gammaloop-workspace-check]
  466. 288.31 s [gammaloop-workspace-check] Some errors have detailed explanations: E0063, E0560.
  467. 288.31 s [gammaloop-workspace-check] For more information about an error, try `rustc --explain E0063`.
  468. 288.32 s [gammaloop-workspace-check] error[E0609]: no field `lmb_channel_edge_ids` on type `CutInfo`
  469. 288.32 s [gammaloop-workspace-check] --> tests/tests/test_evaluation_api.rs:591:26
  470. 288.32 s [gammaloop-workspace-check] |
  471. 288.32 s [gammaloop-workspace-check] 591 | .lmb_channel_edge_ids
  472. 288.32 s [gammaloop-workspace-check] | ^^^^^^^^^^^^^^^^^^^^ unknown field
  473. 288.32 s [gammaloop-workspace-check] |
  474. 288.32 s [gammaloop-workspace-check] = note: available fields are: `particle_pdgs`, `cut_id`, `graph_id`, `graph_group_id`, `orientation_id` ... and 2 others
  475. 288.32 s [gammaloop-workspace-check]
  476. 288.32 s [gammaloop-workspace-check] error: could not compile `gammaloop-integration-tests` (test "test_differential") due to 4 previous errors
  477. 288.32 s [gammaloop-workspace-check] warning: build failed, waiting for other jobs to finish...
  478. 288.36 s [gammaloop-workspace-check] error[E0609]: no field `lmb_channel_edge_ids` on type `CutInfo`
  479. 288.36 s [gammaloop-workspace-check] --> tests/tests/test_evaluation_api.rs:1177:18
  480. 288.36 s [gammaloop-workspace-check] |
  481. 288.36 s [gammaloop-workspace-check] 1177 | .lmb_channel_edge_ids
  482. 288.36 s [gammaloop-workspace-check] | ^^^^^^^^^^^^^^^^^^^^ unknown field
  483. 288.36 s [gammaloop-workspace-check] |
  484. 288.36 s [gammaloop-workspace-check] = note: available fields are: `particle_pdgs`, `cut_id`, `graph_id`, `graph_group_id`, `orientation_id` ... and 2 others
  485. 288.36 s [gammaloop-workspace-check]
  486. 288.43 s [gammaloop-workspace-check] error[E0609]: no field `lmb_channel_edge_ids` on type `CutInfo`
  487. 288.43 s [gammaloop-workspace-check] --> tests/tests/test_evaluation_api.rs:1222:22
  488. 288.43 s [gammaloop-workspace-check] |
  489. 288.43 s [gammaloop-workspace-check] 1222 | .lmb_channel_edge_ids
  490. 288.43 s [gammaloop-workspace-check] | ^^^^^^^^^^^^^^^^^^^^ unknown field
  491. 288.43 s [gammaloop-workspace-check] |
  492. 288.43 s [gammaloop-workspace-check] = note: available fields are: `particle_pdgs`, `cut_id`, `graph_id`, `graph_group_id`, `orientation_id` ... and 2 others
  493. 288.43 s [gammaloop-workspace-check]
  494. 288.43 s [gammaloop-workspace-check] error[E0609]: no field `lmb_channel_edge_ids` on type `CutInfo`
  495. 288.43 s [gammaloop-workspace-check] --> tests/tests/test_evaluation_api.rs:1281:14
  496. 288.43 s [gammaloop-workspace-check] |
  497. 288.43 s [gammaloop-workspace-check] 1281 | .lmb_channel_edge_ids
  498. 288.43 s [gammaloop-workspace-check] | ^^^^^^^^^^^^^^^^^^^^ unknown field
  499. 288.43 s [gammaloop-workspace-check] |
  500. 288.43 s [gammaloop-workspace-check] = note: available fields are: `particle_pdgs`, `cut_id`, `graph_id`, `graph_group_id`, `orientation_id` ... and 2 others
  501. 288.43 s [gammaloop-workspace-check]
  502. 288.47 s [gammaloop-workspace-check] error[E0609]: no field `lmb_channel_edge_ids` on type `CutInfo`
  503. 288.47 s [gammaloop-workspace-check] --> tests/tests/test_evaluation_api.rs:1428:18
  504. 288.47 s [gammaloop-workspace-check] |
  505. 288.47 s [gammaloop-workspace-check] 1428 | .lmb_channel_edge_ids
  506. 288.47 s [gammaloop-workspace-check] | ^^^^^^^^^^^^^^^^^^^^ unknown field
  507. 288.47 s [gammaloop-workspace-check] |
  508. 288.47 s [gammaloop-workspace-check] = note: available fields are: `particle_pdgs`, `cut_id`, `graph_id`, `graph_group_id`, `orientation_id` ... and 2 others
  509. 288.47 s [gammaloop-workspace-check]
  510. 288.54 s [gammaloop-workspace-check] For more information about this error, try `rustc --explain E0609`.
  511. 288.55 s [gammaloop-workspace-check] error: could not compile `gammaloop-integration-tests` (test "test_evaluation_api") due to 6 previous errors
  512. 288.96 s [gammaloop-workspace-check] error[E0609]: no field `lmb_channel_id` on type `CutInfo`
  513. 288.96 s [gammaloop-workspace-check] --> tests/tests/test_runs/utils.rs:568:36
  514. 288.96 s [gammaloop-workspace-check] |
  515. 288.96 s [gammaloop-workspace-check] 568 | event.cut_info.lmb_channel_id,
  516. 288.96 s [gammaloop-workspace-check] | ^^^^^^^^^^^^^^ unknown field
  517. 288.96 s [gammaloop-workspace-check] |
  518. 288.96 s [gammaloop-workspace-check] = note: available fields are: `particle_pdgs`, `cut_id`, `graph_id`, `graph_group_id`, `orientation_id` ... and 2 others
  519. 288.96 s [gammaloop-workspace-check]
  520. 288.96 s [gammaloop-workspace-check] error[E0609]: no field `lmb_channel_id` on type `CutInfo`
  521. 288.96 s [gammaloop-workspace-check] --> tests/tests/test_runs/utils.rs:580:36
  522. 288.96 s [gammaloop-workspace-check] |
  523. 288.96 s [gammaloop-workspace-check] 580 | event.cut_info.lmb_channel_id,
  524. 288.96 s [gammaloop-workspace-check] | ^^^^^^^^^^^^^^ unknown field
  525. 288.96 s [gammaloop-workspace-check] |
  526. 288.96 s [gammaloop-workspace-check] = note: available fields are: `particle_pdgs`, `cut_id`, `graph_id`, `graph_group_id`, `orientation_id` ... and 2 others
  527. 288.96 s [gammaloop-workspace-check]
  528. 289.39 s [gammaloop-workspace-check] error: could not compile `gammaloop-integration-tests` (test "test_runs") due to 2 previous errors
  529. 289.83 s Progress: 0 of 1 built (1 failed)
  530. 289.83 s Failed to build gammaloop-workspace-check after 4m44s
  531. 289.84 s Cannot build '/nix/store/i729pk8pca0mvg4wgc9cqnnlslm5qsi9-gammaloop-workspace-check-0.1.0.drv'.
  532. 289.84 s Reason: builder failed with exit code 101.
  533. 289.84 s Output paths:
  534. 289.84 s /nix/store/hvg6j34250fq6p1xcmg7sqwh8dbfvya8-gammaloop-workspace-check-0.1.0
  535. 289.84 s Last 524 log lines:
  536. 289.84 s > Running phase: unpackPhase
  537. 289.84 s > unpacking source archive /nix/store/qqslq36f7201lf1f2zyjcqsf7w9pg5dy-source
  538. 289.84 s > source root is source
  539. 289.84 s > Running phase: patchPhase
  540. 289.84 s > Executing configureCargoCommonVars
  541. 289.84 s > decompressing cargo artifacts from /nix/store/50vpxlcgfxf2d57i27v3d10zjwxxbm2r-gammaloop-workspace-deps-deps-0.1.0/target.tar.zst to target
  542. 289.84 s > Running phase: updateAutotoolsGnuConfigScriptsPhase
  543. 289.84 s > Running phase: configurePhase
  544. 289.84 s > will append /build/source/.cargo-home/config.toml with contents of /nix/store/5drf77x6km4ky7gwlrzdx9bbd6fz09g3-vendor-cargo-deps/config.toml
  545. 289.84 s > default configurePhase, nothing to do
  546. 289.84 s > Running phase: buildPhase
  547. 289.84 s > +++ command cargo --version
  548. 289.84 s > cargo 1.97.0 (c980f4866 2026-06-30)
  549. 289.84 s > +++ command cargo check --profile ci-optim --locked --workspace --features gammaloop-tracing-filter/clap,gammaloop-tracing-filter/symbolica,idenso/bincode,idenso/reference-cases,linnet/bincode,linnet/drawing,linnet/rkyv,linnet/serde,linnet/symbolica,spenso-macros/shadowing,spenso/shadowing,symbolica/tracing_max_level_info,three-dimensional-reps/display,three-dimensional-reps/eval,three-dimensional-reps/serde --all-targets
  550. 289.84 s > Checking cfg-if v1.0.4
  551. 289.84 s > Checking memchr v2.8.0
  552. 289.84 s > Checking once_cell v1.21.4
  553. 289.84 s > Checking either v1.15.0
  554. 289.84 s > Checking serde_core v1.0.228
  555. 289.84 s > Checking libc v0.2.186
  556. 289.84 s > Checking libm v0.2.16
  557. 289.84 s > Checking itoa v1.0.18
  558. 289.84 s > Checking log v0.4.29
  559. 289.84 s > Checking regex-syntax v0.8.10
  560. 289.84 s > Checking zerocopy v0.8.48
  561. 289.84 s > Checking crossbeam-utils v0.8.21
  562. 289.84 s > Checking equivalent v1.0.2
  563. 289.84 s > Checking zmij v1.0.21
  564. 289.84 s > Checking bytemuck v1.25.0
  565. 289.84 s > Checking lazy_static v1.5.0
  566. 289.84 s > Compiling target-lexicon v0.13.5
  567. 289.84 s > Checking arrayvec v0.7.6
  568. 289.84 s > Checking powerfmt v0.2.0
  569. 289.84 s > Checking num-conv v0.2.1
  570. 289.84 s > Checking num_threads v0.1.7
  571. 289.84 s > Checking time-core v0.1.8
  572. 289.84 s > Checking safe_arch v0.7.4
  573. 289.84 s > Checking pin-project-lite v0.2.17
  574. 289.84 s > Checking foldhash v0.2.0
  575. 289.84 s > Checking allocator-api2 v0.2.21
  576. 289.84 s > Checking const-random v0.1.18
  577. 289.84 s > Checking deranged v0.5.8
  578. 289.84 s > Checking tracing-core v0.1.36
  579. 289.84 s > Checking aho-corasick v1.1.4
  580. 289.84 s > Checking nu-ansi-term v0.50.3
  581. 289.84 s > Checking wide v0.7.33
  582. 289.84 s > Checking crossbeam-epoch v0.9.18
  583. 289.84 s > Checking static_assertions v1.1.0
  584. 289.84 s > Checking itertools v0.14.0
  585. 289.84 s > Checking winnow v1.0.2
  586. 289.84 s > Checking hashbrown v0.16.1
  587. 289.84 s > Checking unty v0.0.4
  588. 289.84 s > Checking safe_arch v1.0.0
  589. 289.84 s > Checking tracing-log v0.2.0
  590. 289.84 s > Checking tracing v0.1.44
  591. 289.84 s > Checking sharded-slab v0.1.7
  592. 289.84 s > Checking crossbeam-deque v0.8.6
  593. 289.84 s > Checking thread_local v1.1.9
  594. 289.84 s > Checking num-traits v0.2.19
  595. 289.84 s > Checking indenter v0.3.4
  596. 289.84 s > Checking az v1.3.0
  597. 289.84 s > Checking rayon-core v1.13.0
  598. 289.84 s > Checking toml_writer v1.1.1+spec-1.1.0
  599. 289.84 s > Checking wide v1.3.0
  600. 289.84 s > Compiling phf_shared v0.11.3
  601. 289.84 s > Checking rayon v1.12.0
  602. 289.84 s > Checking anyhow v1.0.102
  603. 289.84 s > Checking utf8parse v0.2.2
  604. 289.84 s > Checking rawpointer v0.2.1
  605. 289.84 s > Checking dyn-clone v1.0.20
  606. 289.84 s > Checking alloc-no-stdlib v2.0.4
  607. 289.84 s > Checking anstyle-parse v1.0.0
  608. 289.84 s > Checking matrixmultiply v0.3.10
  609. 289.84 s > Checking alloc-stdlib v0.2.2
  610. 289.84 s > Checking colored v3.1.1
  611. 289.84 s > Checking anstyle v1.0.14
  612. 289.84 s > Checking serde v1.0.228
  613. 289.84 s > Checking serde_json v1.0.149
  614. 289.84 s > Checking approx v0.5.1
  615. 289.84 s > Checking bitflags v2.11.1
  616. 289.84 s > Checking num-integer v0.1.46
  617. 289.84 s > Checking toml_parser v1.1.2+spec-1.1.0
  618. 289.84 s > Checking serde_spanned v1.1.1
  619. 289.84 s > Checking toml_datetime v1.1.1+spec-1.1.0
  620. 289.84 s > Checking is_terminal_polyfill v1.70.2
  621. 289.84 s > Checking anstyle-query v1.1.5
  622. 289.84 s > Checking getrandom v0.3.4
  623. 289.84 s > Checking time v0.3.47
  624. 289.84 s > Checking gmp-mpfr-sys v1.7.1
  625. 289.84 s > Checking colorchoice v1.0.5
  626. 289.84 s > Checking rand_core v0.9.5
  627. 289.84 s > Compiling phf_generator v0.11.3
  628. 289.84 s > Checking eyre v0.6.12
  629. 289.84 s > Checking unicode-width v0.2.2
  630. 289.84 s > Checking anstream v1.0.0
  631. 289.84 s > Checking bitflags v1.3.2
  632. 289.84 s > Checking smallvec v1.15.1
  633. 289.84 s > Checking num-complex v0.4.6
  634. 289.84 s > Checking tracing-serde v0.2.0
  635. 289.84 s > Checking bincode v2.0.1
  636. 289.84 s > Compiling phf_codegen v0.11.3
  637. 289.84 s > Checking toml v1.1.2+spec-1.1.0
  638. 289.84 s > Checking region v3.0.2
  639. 289.84 s > Checking wasmtime-jit-icache-coherence v34.0.2
  640. 289.84 s > Checking hugepage-rs v0.1.1
  641. 289.84 s > Checking brotli-decompressor v5.0.0
  642. 289.84 s > Checking spec_math v0.1.6
  643. 289.84 s > Checking inventory v0.3.24
  644. 289.84 s > Checking thiserror v2.0.18
  645. 289.84 s > Checking simba v0.9.1
  646. 289.84 s > Checking smartstring v1.0.1
  647. 289.84 s > Compiling getopts v0.2.24
  648. 289.84 s > Checking libloading v0.9.0
  649. 289.84 s > Checking byteorder v1.5.0
  650. 289.84 s > Compiling pyo3-build-config v0.28.3
  651. 289.84 s > Checking bytes v1.11.1
  652. 289.84 s > Checking tinyjson v2.5.1
  653. 289.84 s > Checking regex-automata v0.4.14
  654. 289.84 s > Checking self_cell v1.2.2
  655. 289.84 s > Checking append-only-vec v0.1.8
  656. 289.84 s > Compiling unicode_names2_generator v1.3.0
  657. 289.84 s > Compiling unic-char-range v0.9.0
  658. 289.84 s > Checking linux-raw-sys v0.12.1
  659. 289.84 s > Compiling unic-common v0.9.0
  660. 289.84 s > Compiling is-macro v0.3.7
  661. 289.84 s > Compiling unic-char-property v0.9.0
  662. 289.84 s > Compiling unic-ucd-version v0.9.0
  663. 289.84 s > Compiling rustpython-parser-vendored v0.4.0
  664. 289.84 s > Checking iana-time-zone v0.1.65
  665. 289.84 s > Checking brotli v8.0.2
  666. 289.84 s > Checking rustix v1.1.4
  667. 289.84 s > Checking chrono v0.4.44
  668. 289.84 s > Compiling rustpython-parser v0.4.0
  669. 289.84 s > Compiling phf v0.11.3
  670. 289.84 s > Checking rustc-hash v2.1.2
  671. 289.84 s > Compiling unic-emoji-char v0.9.0
  672. 289.84 s > Compiling unic-ucd-ident v0.9.0
  673. 289.84 s > Checking ndarray v0.17.2
  674. 289.84 s > Compiling lalrpop-util v0.20.2
  675. 289.84 s > Compiling rustc-hash v1.1.0
  676. 289.84 s > Checking rug v1.30.0
  677. 289.84 s > Checking unicode-segmentation v1.13.2
  678. 289.84 s > Compiling symbolica v2.2.0 (https://github.com/alphal00p/symbolica?rev=a277a8dadbaae5a8d6605f2f381991a601e1f345#a277a8da)
  679. 289.84 s > Checking typenum v1.20.0
  680. 289.84 s > Checking getrandom v0.2.17
  681. 289.84 s > Checking scopeguard v1.2.0
  682. 289.84 s > Checking lock_api v0.4.14
  683. 289.84 s > Checking parking_lot_core v0.9.12
  684. 289.84 s > Checking hashbrown v0.17.0
  685. 289.84 s > Checking unicode-ident v1.0.24
  686. 289.84 s > Checking errno v0.3.14
  687. 289.84 s > Checking parking_lot v0.12.5
  688. 289.84 s > Checking unicase v2.9.0
  689. 289.84 s > Checking clap_lex v1.1.0
  690. 289.84 s > Checking terminal_size v0.4.4
  691. 289.84 s > Checking ppv-lite86 v0.2.21
  692. 289.84 s > Checking ahash v0.8.12
  693. 289.84 s > Checking generic-array v0.14.7
  694. 289.84 s > Checking strsim v0.11.1
  695. 289.84 s > Checking signal-hook-registry v1.4.8
  696. 289.84 s > Checking vte v0.14.1
  697. 289.84 s > Checking same-file v1.0.6
  698. 289.84 s > Checking indexmap v2.14.0
  699. 289.84 s > Checking clap_builder v4.6.0
  700. 289.84 s > Checking walkdir v2.5.0
  701. 289.84 s > Checking signal-hook v0.3.18
  702. 289.84 s > Checking rand_chacha v0.9.0
  703. 289.84 s > Checking half v2.7.1
  704. 289.84 s > Checking mio v1.2.0
  705. 289.84 s > Checking minimal-lexical v0.2.1
  706. 289.84 s > Checking block-buffer v0.10.4
  707. 289.84 s > Checking rand v0.9.4
  708. 289.84 s > Checking crypto-common v0.1.7
  709. 289.84 s > Checking ciborium-io v0.2.2
  710. 289.84 s > Checking digest v0.10.7
  711. 289.84 s > Checking ciborium-ll v0.2.2
  712. 289.84 s > Checking nom v7.1.3
  713. 289.84 s > Checking derive_more v2.1.1
  714. 289.84 s > Checking signal-hook-mio v0.2.5
  715. 289.84 s > Checking console v0.16.3
  716. 289.84 s > Checking num-bigint v0.4.6
  717. 289.84 s > Checking bstr v1.12.1
  718. 289.84 s > Checking linux-raw-sys v0.4.15
  719. 289.84 s > Checking symjit v2.21.0
  720. 289.84 s > Checking cpufeatures v0.2.17
  721. 289.84 s > Checking winnow v0.7.15
  722. 289.84 s > Checking sha2 v0.10.9
  723. 289.84 s > Checking rustix v0.38.44
  724. 289.84 s > Checking ciborium v0.2.2
  725. 289.84 s > Checking matchers v0.2.0
  726. 289.84 s > Checking tracing-subscriber v0.3.23
  727. 289.84 s > Checking regex v1.12.3
  728. 289.84 s > Checking ansitok v0.3.0
  729. 289.84 s > Checking globset v0.4.18
  730. 289.84 s > Checking rand_core v0.6.4
  731. 289.84 s > Checking getrandom v0.4.2
  732. 289.84 s > Checking plotters-backend v0.3.7
  733. 289.84 s > Checking fastrand v2.4.1
  734. 289.84 s > Checking fnv v1.0.7
  735. 289.84 s > Checking crossterm v0.28.1
  736. 289.84 s > Checking clap v4.6.1
  737. 289.84 s > Checking rust-embed-utils v8.11.0
  738. 289.84 s > Checking xprec v0.2.2
  739. 289.84 s > Checking serde_spanned v0.6.9
  740. 289.84 s > Checking toml_datetime v0.6.11
  741. 289.84 s > Checking itertools v0.10.5
  742. 289.84 s > Checking cast v0.3.0
  743. 289.84 s > Checking plotters-svg v0.3.7
  744. 289.84 s > Checking toml_write v0.1.2
  745. 289.84 s > Checking tempfile v3.27.0
  746. 289.84 s > Checking tap v1.0.1
  747. 289.84 s > Checking plotters v0.3.7
  748. 289.84 s > Checking ansi-str v0.9.0
  749. 289.84 s > Checking wyz v0.5.1
  750. 289.84 s > Checking rand_chacha v0.3.1
  751. 289.84 s > Checking radium v0.7.0
  752. 289.84 s > Compiling unicode_names2 v1.3.0
  753. 289.84 s > Checking typeid v1.0.3
  754. 289.84 s > Checking similar v2.7.0
  755. 289.84 s > Checking tinytemplate v1.2.1
  756. 289.84 s > Checking is-terminal v0.4.17
  757. 289.84 s > Checking oorandom v11.1.5
  758. 289.84 s > Checking toml_edit v0.22.27
  759. 289.84 s > Checking anes v0.1.6
  760. 289.84 s > Checking bytecount v0.6.9
  761. 289.84 s > Checking funty v2.0.0
  762. 289.84 s > Checking papergrid v0.17.0
  763. 289.84 s > Checking rand v0.8.6
  764. 289.84 s > Checking ron v0.12.1
  765. 289.84 s > Checking testing_table v0.3.0
  766. 289.84 s > Checking env_filter v1.0.1
  767. 289.84 s > Checking toml_edit v0.25.11+spec-1.1.0
  768. 289.84 s > Checking uncased v0.9.10
  769. 289.84 s > Checking bitvec v1.0.1
  770. 289.84 s > Checking jiff v0.2.24
  771. 289.84 s > Checking ptr_meta v0.1.4
  772. 289.84 s > Checking ucd-trie v0.1.7
  773. 289.84 s > Checking simdutf8 v0.1.5
  774. 289.84 s > Checking pest v2.8.6
  775. 289.84 s > Checking bytecheck v0.6.12
  776. 289.84 s > Checking ahash v0.7.8
  777. 289.84 s > Checking insta v1.47.2
  778. 289.84 s > Checking approx v0.4.0
  779. 289.84 s > Checking hashbrown v0.12.3
  780. 289.84 s > Checking seahash v4.1.0
  781. 289.84 s > Checking criterion-plot v0.5.0
  782. 289.84 s > Checking cgmath v0.18.0
  783. 289.84 s > Checking rend v0.4.2
  784. 289.84 s > Checking tabled v0.20.0
  785. 289.84 s > Checking criterion v0.5.1
  786. 289.84 s > Checking num-rational v0.4.2
  787. 289.84 s > Checking num-iter v0.1.45
  788. 289.84 s > Checking ref-ops v0.2.5
  789. 289.84 s > Checking rand_xoshiro v0.6.0
  790. 289.84 s > Checking num v0.4.3
  791. 289.84 s > Checking features v0.10.0
  792. 289.84 s > Checking dot-parser v0.5.1
  793. 289.84 s > Checking constcat v0.5.1
  794. 289.84 s > Checking gat-lending-iterator v0.1.8
  795. 289.84 s > Checking colored v2.2.0
  796. 289.84 s > Checking constant_time_eq v0.4.2
  797. 289.84 s > Checking arrayref v0.3.9
  798. 289.84 s > Checking cpufeatures v0.3.0
  799. 289.84 s > Checking base64 v0.22.1
  800. 289.84 s > Checking blake3 v1.8.5
  801. 289.84 s > Checking siphasher v1.0.2
  802. 289.84 s > Checking joinery v2.1.0
  803. 289.84 s > Checking phf_shared v0.13.1
  804. 289.84 s > Checking titlecase v2.2.1
  805. 289.84 s > Checking toml v0.8.23
  806. 289.84 s > Checking subprocess v0.2.15
  807. 289.84 s > Checking rust_lisp v0.18.0
  808. 289.84 s > Compiling vakint v0.1.2 (/build/source/crates/vakint)
  809. 289.84 s > Checking version-compare v0.2.1
  810. 289.84 s > Checking xpct v0.5.1
  811. 289.84 s > Checking phf v0.13.1
  812. 289.84 s > Checking ryu v1.0.23
  813. 289.84 s > Compiling pyo3-macros-backend v0.28.3
  814. 289.84 s > Compiling pyo3-ffi v0.28.3
  815. 289.84 s > Compiling pyo3 v0.28.3
  816. 289.84 s > Compiling numpy v0.28.0
  817. 289.84 s > Checking figment v0.10.19
  818. 289.84 s > Checking castaway v0.2.4
  819. 289.84 s > Checking toml_datetime v0.7.5+spec-1.1.0
  820. 289.84 s > Checking compact_str v0.9.0
  821. 289.84 s > Checking strum v0.27.2
  822. 289.84 s > Checking string-template-plus v0.4.3
  823. 289.84 s > Checking unicode-truncate v2.0.1
  824. 289.84 s > Checking kasuari v0.4.12
  825. 289.84 s > Checking lru v0.16.4
  826. 289.84 s > Checking vte v0.15.0
  827. 289.84 s > Checking portable-atomic v1.13.1
  828. 289.84 s > Checking toml v0.9.12+spec-1.1.0
  829. 289.84 s > Checking vt100 v0.16.2
  830. 289.84 s > Checking unit-prefix v0.5.2
  831. 289.84 s > Checking rand_distr v0.4.3
  832. 289.84 s > Checking simba v0.6.0
  833. 289.84 s > Checking line-clipping v0.3.7
  834. 289.84 s > Checking gimli v0.32.3
  835. 289.84 s > Checking adler2 v2.0.1
  836. 289.84 s > Compiling three-dimensional-reps v0.1.0 (/build/source/crates/three-dimensional-reps)
  837. 289.84 s > Checking miniz_oxide v0.8.9
  838. 289.84 s > Checking thiserror v1.0.69
  839. 289.84 s > Checking derive_builder v0.11.2
  840. 289.84 s > Checking owo-colors v4.3.0
  841. 289.84 s > Checking object v0.37.3
  842. 289.84 s > Checking crossterm v0.29.0
  843. 289.84 s > Checking tracing-error v0.2.1
  844. 289.84 s > Checking typed-index-collections v3.5.0
  845. 289.84 s > Checking ratatui-core v0.1.0
  846. 289.84 s > Checking serde-big-array v0.5.1
  847. 289.84 s > Checking amd v0.2.2
  848. 289.84 s > Checking indicatif v0.18.4
  849. 289.84 s > Checking itertools v0.11.0
  850. 289.84 s > Compiling rustpython-parser-core v0.4.0
  851. 289.84 s > Compiling gammaloop-tracing-filter-macros v0.1.0 (/build/source/crates/gammaloop-tracing-filter-macros)
  852. 289.84 s > Checking rustc-demangle v0.1.27
  853. 289.84 s > Compiling rustpython-ast v0.4.0
  854. 289.84 s > Checking option-ext v0.2.0
  855. 289.84 s > Checking dirs-sys v0.5.0
  856. 289.84 s > Checking color-spantrace v0.3.0
  857. 289.84 s > Checking ref-cast v1.0.25
  858. 289.84 s > Checking nix v0.31.2
  859. 289.84 s > Checking integer-sqrt v0.1.5
  860. 289.84 s > Checking brotli-decompressor v4.0.3
  861. 289.84 s > Checking itertools v0.12.1
  862. 289.84 s > Checking crossbeam-channel v0.5.15
  863. 289.84 s > Compiling gammalooprs v0.3.4 (/build/source/crates/gammalooprs)
  864. 289.84 s > Checking unsafe-libyaml v0.2.11
  865. 289.84 s > Checking env_logger v0.11.10
  866. 289.84 s > Checking symlink v0.1.0
  867. 289.84 s > Checking include_dir v0.7.4
  868. 289.84 s > Checking tracing-appender v0.2.5
  869. 289.84 s > Checking dirs v6.0.0
  870. 289.84 s > Checking pathfinding v4.15.0
  871. 289.84 s > Checking schemars v1.2.1
  872. 289.84 s > Checking tracing-indicatif v0.3.14
  873. 289.84 s > Checking ratatui-widgets v0.3.0
  874. 289.84 s > Checking rkyv v0.7.46
  875. 289.84 s > Checking ratatui-crossterm v0.1.0
  876. 289.84 s > Checking brotli v7.0.0
  877. 289.84 s > Checking ctrlc v3.5.2
  878. 289.84 s > Checking slotmap v1.1.1
  879. 289.84 s > Checking json5 v0.4.1
  880. 289.84 s > Checking vectorize v0.2.0
  881. 289.84 s > Checking addr2line v0.25.1
  882. 289.84 s > Checking ringbuffer v0.16.0
  883. 289.84 s > Checking base62 v2.2.4
  884. 289.84 s > Checking clarabel v0.11.1
  885. 289.84 s > Checking rust-embed v8.11.0
  886. 289.84 s > Checking clap_complete v4.6.3
  887. 289.84 s > Checking serde_yaml v0.9.34+deprecated
  888. 289.84 s > Checking strip-ansi-escapes v0.2.1
  889. 289.84 s > Checking fd-lock v4.0.4
  890. 289.84 s > Compiling gammaloop-api v0.1.0 (/build/source/crates/gammaloop-api)
  891. 289.84 s > Checking itertools v0.13.0
  892. 289.84 s > Checking strum v0.26.3
  893. 289.84 s > Checking clap_complete_nushell v4.6.0
  894. 289.84 s > Checking ratatui-macros v0.7.0
  895. 289.84 s > Checking ratatui v0.30.0
  896. 289.84 s > Checking sysinfo v0.33.1
  897. 289.84 s > Checking shlex v1.3.0
  898. 289.84 s > Checking slab v0.4.12
  899. 289.84 s > Checking futures-task v0.3.32
  900. 289.84 s > Checking futures-core v0.3.32
  901. 289.84 s > Checking sdd v3.0.10
  902. 289.84 s > Compiling gammaloop-integration-tests v0.1.0 (/build/source/tests)
  903. 289.84 s > Compiling test-log-core v0.2.20
  904. 289.84 s > Compiling rustc_version v0.4.1
  905. 289.84 s > Checking futures-util v0.3.32
  906. 289.84 s > Checking scc v2.4.0
  907. 289.84 s > Checking reedline v0.42.0
  908. 289.84 s > Checking which v8.0.2
  909. 289.84 s > Compiling gungraun-macros v0.8.0
  910. 289.84 s > Checking bincode v1.3.3
  911. 289.84 s > Checking backtrace v0.3.76
  912. 289.84 s > Compiling gungraun-runner v0.18.2
  913. 289.84 s > Checking nalgebra v0.29.0
  914. 289.84 s > Checking color-eyre v0.6.5
  915. 289.84 s > Checking proc-macro2 v1.0.106
  916. 289.84 s > Checking maplit v1.0.2
  917. 289.84 s > Checking base64 v0.21.7
  918. 289.84 s > Compiling iai-callgrind-runner v0.14.2
  919. 289.84 s > Checking ron v0.8.1
  920. 289.84 s > Compiling numerica v2.2.0 (https://github.com/alphal00p/symbolica?rev=a277a8dadbaae5a8d6605f2f381991a601e1f345#a277a8da)
  921. 289.84 s > Checking quote v1.0.45
  922. 289.84 s > Checking futures-executor v0.3.32
  923. 289.84 s > Checking kurbo v0.13.0
  924. 289.84 s > Checking serial_test v3.4.0
  925. 289.84 s > Checking wait-timeout v0.2.1
  926. 289.84 s > Compiling iai-callgrind v0.14.2
  927. 289.84 s > Checking quick-error v1.2.3
  928. 289.84 s > Checking bit-vec v0.8.0
  929. 289.84 s > Checking rusty-fork v0.3.1
  930. 289.84 s > Checking syn v2.0.117
  931. 289.84 s > Checking bit-set v0.8.0
  932. 289.84 s > Compiling iai-callgrind-macros v0.5.1
  933. 289.84 s > Checking rand_xorshift v0.4.0
  934. 289.84 s > Checking console v0.15.11
  935. 289.84 s > Compiling test-log-macros v0.2.20
  936. 289.84 s > Checking unarray v0.1.4
  937. 289.84 s > Checking pathdiff v0.2.3
  938. 289.84 s > Checking proptest v1.11.0
  939. 289.84 s > Checking similar-asserts v1.7.0
  940. 289.84 s > Checking kurvst v0.1.0 (/build/source/crates/kurvst)
  941. 289.84 s > Checking clinnet v0.1.8 (/build/source/crates/clinnet)
  942. 289.84 s > Checking test-log v0.2.20
  943. 289.84 s > Compiling graphica v2.1.0 (https://github.com/alphal00p/symbolica?rev=a277a8dadbaae5a8d6605f2f381991a601e1f345#a277a8da)
  944. 289.84 s > Checking statrs v0.16.1
  945. 289.84 s > Checking momtrop v0.3.0
  946. 289.84 s > Checking gungraun v0.18.2
  947. 289.84 s > Compiling pyo3-stub-gen-derive v0.17.2
  948. 289.84 s > Compiling pyo3-macros v0.28.3
  949. 289.84 s > Checking pyo3-stub-gen v0.17.2
  950. 289.84 s > Checking symbolica-utils v0.1.0 (/build/source/crates/symbolica-utils)
  951. 289.84 s > Checking spenso-macros v0.3.2 (/build/source/crates/spenso-macros)
  952. 289.84 s > Compiling gammaloop-workspace-hack v0.1.0 (/build/source/crates/gammaloop-workspace-hack)
  953. 289.84 s > Checking linnet v0.17.0 (/build/source/crates/linnet)
  954. 289.84 s > Checking spenso v0.6.0 (/build/source/crates/spenso)
  955. 289.84 s > Checking linnet-py v0.1.0 (/build/source/crates/linnet-py)
  956. 289.84 s > Checking linnest v0.1.0 (/build/source/crates/linnest)
  957. 289.84 s > Checking idenso v0.3.0 (/build/source/crates/idenso)
  958. 289.84 s > Checking gammaloop-tracing-filter v0.1.0 (/build/source/crates/gammaloop-tracing-filter)
  959. 289.84 s > Checking spenso-hep-lib v0.1.7 (/build/source/crates/spenso-hep-lib)
  960. 289.84 s > Checking spynso3 v0.1.2 (/build/source/crates/spynso3)
  961. 289.84 s > error[E0560]: struct `CutInfo` has no field named `lmb_channel_id`
  962. 289.84 s > --> tests/tests/test_differential.rs:86:13
  963. 289.84 s > |
  964. 289.84 s > 86 | lmb_channel_id: None,
  965. 289.84 s > | ^^^^^^^^^^^^^^ `CutInfo` does not have this field
  966. 289.84 s > |
  967. 289.84 s > = note: available fields are: `sampling_channel_id`, `sampling_channel_edge_ids`
  968. 289.84 s >
  969. 289.84 s > error[E0560]: struct `CutInfo` has no field named `lmb_channel_edge_ids`
  970. 289.84 s > --> tests/tests/test_differential.rs:87:13
  971. 289.84 s > |
  972. 289.84 s > 87 | lmb_channel_edge_ids: None,
  973. 289.84 s > | ^^^^^^^^^^^^^^^^^^^^ `CutInfo` does not have this field
  974. 289.84 s > |
  975. 289.84 s > = note: available fields are: `sampling_channel_id`, `sampling_channel_edge_ids`
  976. 289.84 s >
  977. 289.84 s > error[E0063]: missing field `reference_moments` in initializer of `GraphEvaluationResult<_>`
  978. 289.84 s > --> tests/tests/test_differential.rs:532:19
  979. 289.84 s > |
  980. 289.84 s > 532 | let mut lhs = GraphEvaluationResult {
  981. 289.84 s > | ^^^^^^^^^^^^^^^^^^^^^ missing `reference_moments`
  982. 289.84 s >
  983. 289.84 s > error[E0063]: missing field `reference_moments` in initializer of `GraphEvaluationResult<_>`
  984. 289.84 s > --> tests/tests/test_differential.rs:539:15
  985. 289.84 s > |
  986. 289.84 s > 539 | let rhs = GraphEvaluationResult {
  987. 289.84 s > | ^^^^^^^^^^^^^^^^^^^^^ missing `reference_moments`
  988. 289.84 s >
  989. 289.84 s > error[E0609]: no field `lmb_channel_edge_ids` on type `CutInfo`
  990. 289.84 s > --> tests/tests/test_evaluation_api.rs:311:10
  991. 289.84 s > |
  992. 289.84 s > 311 | .lmb_channel_edge_ids
  993. 289.84 s > | ^^^^^^^^^^^^^^^^^^^^ unknown field
  994. 289.84 s > |
  995. 289.84 s > = note: available fields are: `particle_pdgs`, `cut_id`, `graph_id`, `graph_group_id`, `orientation_id` ... and 2 others
  996. 289.84 s >
  997. 289.84 s > Some errors have detailed explanations: E0063, E0560.
  998. 289.84 s > For more information about an error, try `rustc --explain E0063`.
  999. 289.84 s > error[E0609]: no field `lmb_channel_edge_ids` on type `CutInfo`
  1000. 289.84 s > --> tests/tests/test_evaluation_api.rs:591:26
  1001. 289.84 s > |
  1002. 289.84 s > 591 | .lmb_channel_edge_ids
  1003. 289.84 s > | ^^^^^^^^^^^^^^^^^^^^ unknown field
  1004. 289.84 s > |
  1005. 289.84 s > = note: available fields are: `particle_pdgs`, `cut_id`, `graph_id`, `graph_group_id`, `orientation_id` ... and 2 others
  1006. 289.84 s >
  1007. 289.84 s > error: could not compile `gammaloop-integration-tests` (test "test_differential") due to 4 previous errors
  1008. 289.84 s > warning: build failed, waiting for other jobs to finish...
  1009. 289.84 s > error[E0609]: no field `lmb_channel_edge_ids` on type `CutInfo`
  1010. 289.84 s > --> tests/tests/test_evaluation_api.rs:1177:18
  1011. 289.84 s > |
  1012. 289.84 s > 1177 | .lmb_channel_edge_ids
  1013. 289.84 s > | ^^^^^^^^^^^^^^^^^^^^ unknown field
  1014. 289.84 s > |
  1015. 289.84 s > = note: available fields are: `particle_pdgs`, `cut_id`, `graph_id`, `graph_group_id`, `orientation_id` ... and 2 others
  1016. 289.84 s >
  1017. 289.84 s > error[E0609]: no field `lmb_channel_edge_ids` on type `CutInfo`
  1018. 289.84 s > --> tests/tests/test_evaluation_api.rs:1222:22
  1019. 289.84 s > |
  1020. 289.84 s > 1222 | .lmb_channel_edge_ids
  1021. 289.84 s > | ^^^^^^^^^^^^^^^^^^^^ unknown field
  1022. 289.84 s > |
  1023. 289.84 s > = note: available fields are: `particle_pdgs`, `cut_id`, `graph_id`, `graph_group_id`, `orientation_id` ... and 2 others
  1024. 289.84 s >
  1025. 289.84 s > error[E0609]: no field `lmb_channel_edge_ids` on type `CutInfo`
  1026. 289.84 s > --> tests/tests/test_evaluation_api.rs:1281:14
  1027. 289.84 s > |
  1028. 289.84 s > 1281 | .lmb_channel_edge_ids
  1029. 289.84 s > | ^^^^^^^^^^^^^^^^^^^^ unknown field
  1030. 289.84 s > |
  1031. 289.84 s > = note: available fields are: `particle_pdgs`, `cut_id`, `graph_id`, `graph_group_id`, `orientation_id` ... and 2 others
  1032. 289.84 s >
  1033. 289.84 s > error[E0609]: no field `lmb_channel_edge_ids` on type `CutInfo`
  1034. 289.84 s > --> tests/tests/test_evaluation_api.rs:1428:18
  1035. 289.84 s > |
  1036. 289.84 s > 1428 | .lmb_channel_edge_ids
  1037. 289.84 s > | ^^^^^^^^^^^^^^^^^^^^ unknown field
  1038. 289.84 s > |
  1039. 289.84 s > = note: available fields are: `particle_pdgs`, `cut_id`, `graph_id`, `graph_group_id`, `orientation_id` ... and 2 others
  1040. 289.84 s >
  1041. 289.84 s > For more information about this error, try `rustc --explain E0609`.
  1042. 289.84 s > error: could not compile `gammaloop-integration-tests` (test "test_evaluation_api") due to 6 previous errors
  1043. 289.84 s > error[E0609]: no field `lmb_channel_id` on type `CutInfo`
  1044. 289.84 s > --> tests/tests/test_runs/utils.rs:568:36
  1045. 289.84 s > |
  1046. 289.84 s > 568 | event.cut_info.lmb_channel_id,
  1047. 289.84 s > | ^^^^^^^^^^^^^^ unknown field
  1048. 289.84 s > |
  1049. 289.84 s > = note: available fields are: `particle_pdgs`, `cut_id`, `graph_id`, `graph_group_id`, `orientation_id` ... and 2 others
  1050. 289.84 s >
  1051. 289.84 s > error[E0609]: no field `lmb_channel_id` on type `CutInfo`
  1052. 289.84 s > --> tests/tests/test_runs/utils.rs:580:36
  1053. 289.84 s > |
  1054. 289.84 s > 580 | event.cut_info.lmb_channel_id,
  1055. 289.84 s > | ^^^^^^^^^^^^^^ unknown field
  1056. 289.84 s > |
  1057. 289.84 s > = note: available fields are: `particle_pdgs`, `cut_id`, `graph_id`, `graph_group_id`, `orientation_id` ... and 2 others
  1058. 289.84 s >
  1059. 289.84 s > error: could not compile `gammaloop-integration-tests` (test "test_runs") due to 2 previous errors
  1060. 289.84 s For full logs, run:
  1061. 289.84 s nix log /nix/store/i729pk8pca0mvg4wgc9cqnnlslm5qsi9-gammaloop-workspace-check-0.1.0.drv
  1062. 289.87 s Build failed.