0.00 s
$ /nix/store/9ypz3flqsrl5xl495mm8h645gadjsxi1-coreutils-9.11/bin/timeout --kill-after=15s 7200s /nix/store/23zk8sgzamrbmj1fday15szf7f2279s8-nix-2.34.7/bin/nix --extra-experimental-features nix-command --extra-experimental-features flakes --log-format internal-json build --no-link --print-out-paths git+https://github.com/alphal00p/gammaloop?ref=advanced_sampling&rev=06d470409cd34d8d57afa11b04a3fb208ca20890&shallow=1#packages.x86_64-linux.crate-test-binaries-python-api-gammaloop-integration-tests --print-build-logs
8.24 s
10.13 s
Downloading cached gammaloop-crate-test-dependencies-ea99827d76e4dd39-deps from https://cache.nix-ci.com
27.13 s
Downloaded cached gammaloop-crate-test-dependencies-ea99827d76e4dd39-deps (94.9 MiB) in 17.0s
27.13 s
Progress: 0 of 4 built, 1 of 5 downloaded from cache
27.14 s
Downloading cached gammaloop-crate-test-dependencies-6e86b9f305aafb81-inputs from https://cache.nix-ci.com
67.46 s
Downloaded cached gammaloop-crate-test-dependencies-6e86b9f305aafb81-inputs (2.4 GiB) in 40.3s
67.46 s
Progress: 0 of 4 built, 2 of 5 downloaded from cache
67.46 s
Downloading cached gammaloop-crate-test-dependencies-6e86b9f305aafb81-deps from https://cache.nix-ci.com
69.38 s
Downloaded cached gammaloop-crate-test-dependencies-6e86b9f305aafb81-deps (125.8 MiB) in 1.9s
69.38 s
Progress: 0 of 4 built, 3 of 5 downloaded from cache
69.38 s
Downloading cached gammaloop-crate-test-dependencies-d6e55b48f8214f9c-inputs from https://cache.nix-ci.com
88.96 s
Downloaded cached gammaloop-crate-test-dependencies-d6e55b48f8214f9c-inputs (3.1 GiB) in 19.5s
88.96 s
Progress: 0 of 4 built, 4 of 5 downloaded from cache
88.96 s
Downloading cached gammaloop-crate-test-dependencies-d6e55b48f8214f9c-deps from https://cache.nix-ci.com
89.67 s
Downloaded cached gammaloop-crate-test-dependencies-d6e55b48f8214f9c-deps (29.9 MiB) in 704ms
89.68 s
Progress: 0 of 4 built, 5 of 5 downloaded from cache
90.32 s
Building /nix/store/mdn38269w8l6pkjc2rwbv1i63fzin6qm-gammaloop-crate-test-binaries-gammaloop-integration-tests-d6e55b48f8214f9c-inputs.drv
107.67 s
[gammaloop-crate-test-binaries-gammaloop-integration-tests-d6e55b48f8214f9c-inputs:post-build] Uploading to the NixCI cache: /nix/store/s7hml746kzs7r51nrawckz4jpgmg98bq-gammaloop-crate-test-binaries-gammaloop-integration-tests-d6e55b48f8214f9c-inputs
108.04 s
[gammaloop-crate-test-binaries-gammaloop-integration-tests-d6e55b48f8214f9c-inputs:post-build] warning: 'warn-short-path-literals' is deprecated, use 'lint-short-path-literals = ignore' instead
108.21 s
[gammaloop-crate-test-binaries-gammaloop-integration-tests-d6e55b48f8214f9c-inputs:post-build] copying 1 paths...
108.21 s
[gammaloop-crate-test-binaries-gammaloop-integration-tests-d6e55b48f8214f9c-inputs:post-build] copying path '/nix/store/s7hml746kzs7r51nrawckz4jpgmg98bq-gammaloop-crate-test-binaries-gammaloop-integration-tests-d6e55b48f8214f9c-inputs' to 'https://cache.nix-ci.com'...
229.76 s
[gammaloop-crate-test-binaries-gammaloop-integration-tests-d6e55b48f8214f9c-inputs:post-build] warning: 'warn-short-path-literals' is deprecated, use 'lint-short-path-literals = ignore' instead
230.07 s
[gammaloop-crate-test-binaries-gammaloop-integration-tests-d6e55b48f8214f9c-inputs:post-build] copying 1 paths...
230.07 s
[gammaloop-crate-test-binaries-gammaloop-integration-tests-d6e55b48f8214f9c-inputs:post-build] copying path '/nix/store/mdn38269w8l6pkjc2rwbv1i63fzin6qm-gammaloop-crate-test-binaries-gammaloop-integration-tests-d6e55b48f8214f9c-inputs.drv' to 'https://cache.nix-ci.com'...
230.32 s
Uploaded gammaloop-crate-test-binaries-gammaloop-integration-tests-d6e55b48f8214f9c-inputs in 2m02s
230.32 s
Progress: 1 of 4 built, 5 of 5 downloaded from cache
230.32 s
Built gammaloop-crate-test-binaries-gammaloop-integration-tests-d6e55b48f8214f9c-inputs in 2m20s
230.40 s
Building /nix/store/xp7k7p3yrpzhm16dwixd43zg74c390bn-gammaloop-crate-test-binaries-gammaloop-integration-tests-d6e55b48f8214f9c-deps-0.1.0.drv
230.46 s
[gammaloop-crate-test-binaries-gammaloop-integration-tests-d6e55b48f8214f9c-deps] Phase: unpackPhase
230.47 s
[gammaloop-crate-test-binaries-gammaloop-integration-tests-d6e55b48f8214f9c-deps] unpacking source archive /nix/store/2myk8wcfjr9c5h56dnv9nv4lrgsfyarf-source
230.53 s
[gammaloop-crate-test-binaries-gammaloop-integration-tests-d6e55b48f8214f9c-deps] source root is source
230.54 s
[gammaloop-crate-test-binaries-gammaloop-integration-tests-d6e55b48f8214f9c-deps] Phase: patchPhase
230.63 s
[gammaloop-crate-test-binaries-gammaloop-integration-tests-d6e55b48f8214f9c-deps] Executing configureCargoCommonVars
230.63 s
[gammaloop-crate-test-binaries-gammaloop-integration-tests-d6e55b48f8214f9c-deps] copying cargo artifacts from /nix/store/s7hml746kzs7r51nrawckz4jpgmg98bq-gammaloop-crate-test-binaries-gammaloop-integration-tests-d6e55b48f8214f9c-inputs/target to target
230.63 s
[gammaloop-crate-test-binaries-gammaloop-integration-tests-d6e55b48f8214f9c-deps] will deep copy artifacts (instead of symlinking) as requested
232.33 s
[gammaloop-crate-test-binaries-gammaloop-integration-tests-d6e55b48f8214f9c-deps] Phase: updateAutotoolsGnuConfigScriptsPhase
232.37 s
[gammaloop-crate-test-binaries-gammaloop-integration-tests-d6e55b48f8214f9c-deps] Phase: configurePhase
232.38 s
[gammaloop-crate-test-binaries-gammaloop-integration-tests-d6e55b48f8214f9c-deps] will append /build/source/.cargo-home/config.toml with contents of /nix/store/5drf77x6km4ky7gwlrzdx9bbd6fz09g3-vendor-cargo-deps/config.toml
232.38 s
[gammaloop-crate-test-binaries-gammaloop-integration-tests-d6e55b48f8214f9c-deps] default configurePhase, nothing to do
232.38 s
[gammaloop-crate-test-binaries-gammaloop-integration-tests-d6e55b48f8214f9c-deps] Phase: buildPhase
232.39 s
[gammaloop-crate-test-binaries-gammaloop-integration-tests-d6e55b48f8214f9c-deps] +++ command cargo --version
232.39 s
[gammaloop-crate-test-binaries-gammaloop-integration-tests-d6e55b48f8214f9c-deps] cargo 1.97.0 (c980f4866 2026-06-30)
232.40 s
[gammaloop-crate-test-binaries-gammaloop-integration-tests-d6e55b48f8214f9c-deps] +++ command cargo test --profile ci-optim --no-run --offline -p gammaloop-integration-tests --features gammaloop-integration-tests/python-api-tests
232.87 s
[gammaloop-crate-test-binaries-gammaloop-integration-tests-d6e55b48f8214f9c-deps] Compiling gammaloop-integration-tests v0.1.0 (/build/source/tests)
233.00 s
[gammaloop-crate-test-binaries-gammaloop-integration-tests-d6e55b48f8214f9c-deps] error[E0560] : struct `CutInfo` has no field named `lmb_channel_id`
233.00 s
[gammaloop-crate-test-binaries-gammaloop-integration-tests-d6e55b48f8214f9c-deps] --> tests/tests/test_differential.rs:86:13
233.00 s
[gammaloop-crate-test-binaries-gammaloop-integration-tests-d6e55b48f8214f9c-deps] |
233.00 s
[gammaloop-crate-test-binaries-gammaloop-integration-tests-d6e55b48f8214f9c-deps] 86 | lmb_channel_id: None,
233.00 s
[gammaloop-crate-test-binaries-gammaloop-integration-tests-d6e55b48f8214f9c-deps] | ^^^^^^^^^^^^^^ `CutInfo` does not have this field
233.00 s
[gammaloop-crate-test-binaries-gammaloop-integration-tests-d6e55b48f8214f9c-deps] |
233.00 s
[gammaloop-crate-test-binaries-gammaloop-integration-tests-d6e55b48f8214f9c-deps] = note : available fields are: `sampling_channel_id`, `sampling_channel_edge_ids`
233.00 s
[gammaloop-crate-test-binaries-gammaloop-integration-tests-d6e55b48f8214f9c-deps]
233.00 s
[gammaloop-crate-test-binaries-gammaloop-integration-tests-d6e55b48f8214f9c-deps] error[E0560] : struct `CutInfo` has no field named `lmb_channel_edge_ids`
233.00 s
[gammaloop-crate-test-binaries-gammaloop-integration-tests-d6e55b48f8214f9c-deps] --> tests/tests/test_differential.rs:87:13
233.00 s
[gammaloop-crate-test-binaries-gammaloop-integration-tests-d6e55b48f8214f9c-deps] |
233.00 s
[gammaloop-crate-test-binaries-gammaloop-integration-tests-d6e55b48f8214f9c-deps] 87 | lmb_channel_edge_ids: None,
233.00 s
[gammaloop-crate-test-binaries-gammaloop-integration-tests-d6e55b48f8214f9c-deps] | ^^^^^^^^^^^^^^^^^^^^ `CutInfo` does not have this field
233.00 s
[gammaloop-crate-test-binaries-gammaloop-integration-tests-d6e55b48f8214f9c-deps] |
233.00 s
[gammaloop-crate-test-binaries-gammaloop-integration-tests-d6e55b48f8214f9c-deps] = note : available fields are: `sampling_channel_id`, `sampling_channel_edge_ids`
233.00 s
[gammaloop-crate-test-binaries-gammaloop-integration-tests-d6e55b48f8214f9c-deps]
233.02 s
[gammaloop-crate-test-binaries-gammaloop-integration-tests-d6e55b48f8214f9c-deps] error[E0063] : missing field `reference_moments` in initializer of `GraphEvaluationResult<_>`
233.02 s
[gammaloop-crate-test-binaries-gammaloop-integration-tests-d6e55b48f8214f9c-deps] --> tests/tests/test_differential.rs:532:19
233.02 s
[gammaloop-crate-test-binaries-gammaloop-integration-tests-d6e55b48f8214f9c-deps] |
233.02 s
[gammaloop-crate-test-binaries-gammaloop-integration-tests-d6e55b48f8214f9c-deps] 532 | let mut lhs = GraphEvaluationResult {
233.02 s
[gammaloop-crate-test-binaries-gammaloop-integration-tests-d6e55b48f8214f9c-deps] | ^^^^^^^^^^^^^^^^^^^^^ missing `reference_moments`
233.02 s
[gammaloop-crate-test-binaries-gammaloop-integration-tests-d6e55b48f8214f9c-deps]
233.02 s
[gammaloop-crate-test-binaries-gammaloop-integration-tests-d6e55b48f8214f9c-deps] error[E0063] : missing field `reference_moments` in initializer of `GraphEvaluationResult<_>`
233.02 s
[gammaloop-crate-test-binaries-gammaloop-integration-tests-d6e55b48f8214f9c-deps] --> tests/tests/test_differential.rs:539:15
233.02 s
[gammaloop-crate-test-binaries-gammaloop-integration-tests-d6e55b48f8214f9c-deps] |
233.02 s
[gammaloop-crate-test-binaries-gammaloop-integration-tests-d6e55b48f8214f9c-deps] 539 | let rhs = GraphEvaluationResult {
233.02 s
[gammaloop-crate-test-binaries-gammaloop-integration-tests-d6e55b48f8214f9c-deps] | ^^^^^^^^^^^^^^^^^^^^^ missing `reference_moments`
233.02 s
[gammaloop-crate-test-binaries-gammaloop-integration-tests-d6e55b48f8214f9c-deps]
233.11 s
[gammaloop-crate-test-binaries-gammaloop-integration-tests-d6e55b48f8214f9c-deps] Some errors have detailed explanations: E0063, E0560.
233.11 s
[gammaloop-crate-test-binaries-gammaloop-integration-tests-d6e55b48f8214f9c-deps] For more information about an error, try `rustc --explain E0063`.
233.14 s
[gammaloop-crate-test-binaries-gammaloop-integration-tests-d6e55b48f8214f9c-deps] error : could not compile `gammaloop-integration-tests` (test "test_differential") due to 4 previous errors
233.14 s
[gammaloop-crate-test-binaries-gammaloop-integration-tests-d6e55b48f8214f9c-deps] warning : build failed, waiting for other jobs to finish...
233.19 s
[gammaloop-crate-test-binaries-gammaloop-integration-tests-d6e55b48f8214f9c-deps] error[E0609] : no field `lmb_channel_edge_ids` on type `CutInfo`
233.19 s
[gammaloop-crate-test-binaries-gammaloop-integration-tests-d6e55b48f8214f9c-deps] --> tests/tests/test_evaluation_api.rs:311:10
233.19 s
[gammaloop-crate-test-binaries-gammaloop-integration-tests-d6e55b48f8214f9c-deps] |
233.19 s
[gammaloop-crate-test-binaries-gammaloop-integration-tests-d6e55b48f8214f9c-deps] 311 | .lmb_channel_edge_ids
233.19 s
[gammaloop-crate-test-binaries-gammaloop-integration-tests-d6e55b48f8214f9c-deps] | ^^^^^^^^^^^^^^^^^^^^ unknown field
233.19 s
[gammaloop-crate-test-binaries-gammaloop-integration-tests-d6e55b48f8214f9c-deps] |
233.20 s
[gammaloop-crate-test-binaries-gammaloop-integration-tests-d6e55b48f8214f9c-deps] = note : available fields are: `particle_pdgs`, `cut_id`, `graph_id`, `graph_group_id`, `orientation_id` ... and 2 others
233.20 s
[gammaloop-crate-test-binaries-gammaloop-integration-tests-d6e55b48f8214f9c-deps]
233.26 s
[gammaloop-crate-test-binaries-gammaloop-integration-tests-d6e55b48f8214f9c-deps] error[E0609] : no field `lmb_channel_edge_ids` on type `CutInfo`
233.26 s
[gammaloop-crate-test-binaries-gammaloop-integration-tests-d6e55b48f8214f9c-deps] --> tests/tests/test_evaluation_api.rs:591:26
233.26 s
[gammaloop-crate-test-binaries-gammaloop-integration-tests-d6e55b48f8214f9c-deps] |
233.26 s
[gammaloop-crate-test-binaries-gammaloop-integration-tests-d6e55b48f8214f9c-deps] 591 | .lmb_channel_edge_ids
233.26 s
[gammaloop-crate-test-binaries-gammaloop-integration-tests-d6e55b48f8214f9c-deps] | ^^^^^^^^^^^^^^^^^^^^ unknown field
233.26 s
[gammaloop-crate-test-binaries-gammaloop-integration-tests-d6e55b48f8214f9c-deps] |
233.26 s
[gammaloop-crate-test-binaries-gammaloop-integration-tests-d6e55b48f8214f9c-deps] = note : available fields are: `particle_pdgs`, `cut_id`, `graph_id`, `graph_group_id`, `orientation_id` ... and 2 others
233.26 s
[gammaloop-crate-test-binaries-gammaloop-integration-tests-d6e55b48f8214f9c-deps]
233.38 s
[gammaloop-crate-test-binaries-gammaloop-integration-tests-d6e55b48f8214f9c-deps] error[E0609] : no field `lmb_channel_edge_ids` on type `CutInfo`
233.38 s
[gammaloop-crate-test-binaries-gammaloop-integration-tests-d6e55b48f8214f9c-deps] --> tests/tests/test_evaluation_api.rs:1177:18
233.38 s
[gammaloop-crate-test-binaries-gammaloop-integration-tests-d6e55b48f8214f9c-deps] |
233.38 s
[gammaloop-crate-test-binaries-gammaloop-integration-tests-d6e55b48f8214f9c-deps] 1177 | .lmb_channel_edge_ids
233.38 s
[gammaloop-crate-test-binaries-gammaloop-integration-tests-d6e55b48f8214f9c-deps] | ^^^^^^^^^^^^^^^^^^^^ unknown field
233.38 s
[gammaloop-crate-test-binaries-gammaloop-integration-tests-d6e55b48f8214f9c-deps] |
233.38 s
[gammaloop-crate-test-binaries-gammaloop-integration-tests-d6e55b48f8214f9c-deps] = note : available fields are: `particle_pdgs`, `cut_id`, `graph_id`, `graph_group_id`, `orientation_id` ... and 2 others
233.38 s
[gammaloop-crate-test-binaries-gammaloop-integration-tests-d6e55b48f8214f9c-deps]
233.67 s
[gammaloop-crate-test-binaries-gammaloop-integration-tests-d6e55b48f8214f9c-deps] error[E0609] : no field `lmb_channel_edge_ids` on type `CutInfo`
233.67 s
[gammaloop-crate-test-binaries-gammaloop-integration-tests-d6e55b48f8214f9c-deps] --> tests/tests/test_evaluation_api.rs:1222:22
233.67 s
[gammaloop-crate-test-binaries-gammaloop-integration-tests-d6e55b48f8214f9c-deps] |
233.67 s
[gammaloop-crate-test-binaries-gammaloop-integration-tests-d6e55b48f8214f9c-deps] 1222 | .lmb_channel_edge_ids
233.67 s
[gammaloop-crate-test-binaries-gammaloop-integration-tests-d6e55b48f8214f9c-deps] | ^^^^^^^^^^^^^^^^^^^^ unknown field
233.67 s
[gammaloop-crate-test-binaries-gammaloop-integration-tests-d6e55b48f8214f9c-deps] |
233.67 s
[gammaloop-crate-test-binaries-gammaloop-integration-tests-d6e55b48f8214f9c-deps] = note : available fields are: `particle_pdgs`, `cut_id`, `graph_id`, `graph_group_id`, `orientation_id` ... and 2 others
233.67 s
[gammaloop-crate-test-binaries-gammaloop-integration-tests-d6e55b48f8214f9c-deps]
233.68 s
[gammaloop-crate-test-binaries-gammaloop-integration-tests-d6e55b48f8214f9c-deps] error[E0609] : no field `lmb_channel_edge_ids` on type `CutInfo`
233.68 s
[gammaloop-crate-test-binaries-gammaloop-integration-tests-d6e55b48f8214f9c-deps] --> tests/tests/test_evaluation_api.rs:1281:14
233.68 s
[gammaloop-crate-test-binaries-gammaloop-integration-tests-d6e55b48f8214f9c-deps] |
233.68 s
[gammaloop-crate-test-binaries-gammaloop-integration-tests-d6e55b48f8214f9c-deps] 1281 | .lmb_channel_edge_ids
233.68 s
[gammaloop-crate-test-binaries-gammaloop-integration-tests-d6e55b48f8214f9c-deps] | ^^^^^^^^^^^^^^^^^^^^ unknown field
233.68 s
[gammaloop-crate-test-binaries-gammaloop-integration-tests-d6e55b48f8214f9c-deps] |
233.68 s
[gammaloop-crate-test-binaries-gammaloop-integration-tests-d6e55b48f8214f9c-deps] = note : available fields are: `particle_pdgs`, `cut_id`, `graph_id`, `graph_group_id`, `orientation_id` ... and 2 others
233.68 s
[gammaloop-crate-test-binaries-gammaloop-integration-tests-d6e55b48f8214f9c-deps]
233.85 s
[gammaloop-crate-test-binaries-gammaloop-integration-tests-d6e55b48f8214f9c-deps] error[E0609] : no field `lmb_channel_edge_ids` on type `CutInfo`
233.85 s
[gammaloop-crate-test-binaries-gammaloop-integration-tests-d6e55b48f8214f9c-deps] --> tests/tests/test_evaluation_api.rs:1428:18
233.85 s
[gammaloop-crate-test-binaries-gammaloop-integration-tests-d6e55b48f8214f9c-deps] |
233.85 s
[gammaloop-crate-test-binaries-gammaloop-integration-tests-d6e55b48f8214f9c-deps] 1428 | .lmb_channel_edge_ids
233.85 s
[gammaloop-crate-test-binaries-gammaloop-integration-tests-d6e55b48f8214f9c-deps] | ^^^^^^^^^^^^^^^^^^^^ unknown field
233.85 s
[gammaloop-crate-test-binaries-gammaloop-integration-tests-d6e55b48f8214f9c-deps] |
233.85 s
[gammaloop-crate-test-binaries-gammaloop-integration-tests-d6e55b48f8214f9c-deps] = note : available fields are: `particle_pdgs`, `cut_id`, `graph_id`, `graph_group_id`, `orientation_id` ... and 2 others
233.85 s
[gammaloop-crate-test-binaries-gammaloop-integration-tests-d6e55b48f8214f9c-deps]
234.15 s
[gammaloop-crate-test-binaries-gammaloop-integration-tests-d6e55b48f8214f9c-deps] For more information about this error, try `rustc --explain E0609`.
234.17 s
[gammaloop-crate-test-binaries-gammaloop-integration-tests-d6e55b48f8214f9c-deps] error : could not compile `gammaloop-integration-tests` (test "test_evaluation_api") due to 6 previous errors
235.40 s
[gammaloop-crate-test-binaries-gammaloop-integration-tests-d6e55b48f8214f9c-deps] error[E0609] : no field `lmb_channel_id` on type `CutInfo`
235.40 s
[gammaloop-crate-test-binaries-gammaloop-integration-tests-d6e55b48f8214f9c-deps] --> tests/tests/test_runs/utils.rs:568:36
235.40 s
[gammaloop-crate-test-binaries-gammaloop-integration-tests-d6e55b48f8214f9c-deps] |
235.40 s
[gammaloop-crate-test-binaries-gammaloop-integration-tests-d6e55b48f8214f9c-deps] 568 | event.cut_info.lmb_channel_id,
235.40 s
[gammaloop-crate-test-binaries-gammaloop-integration-tests-d6e55b48f8214f9c-deps] | ^^^^^^^^^^^^^^ unknown field
235.40 s
[gammaloop-crate-test-binaries-gammaloop-integration-tests-d6e55b48f8214f9c-deps] |
235.40 s
[gammaloop-crate-test-binaries-gammaloop-integration-tests-d6e55b48f8214f9c-deps] = note : available fields are: `particle_pdgs`, `cut_id`, `graph_id`, `graph_group_id`, `orientation_id` ... and 2 others
235.40 s
[gammaloop-crate-test-binaries-gammaloop-integration-tests-d6e55b48f8214f9c-deps]
235.40 s
[gammaloop-crate-test-binaries-gammaloop-integration-tests-d6e55b48f8214f9c-deps] error[E0609] : no field `lmb_channel_id` on type `CutInfo`
235.40 s
[gammaloop-crate-test-binaries-gammaloop-integration-tests-d6e55b48f8214f9c-deps] --> tests/tests/test_runs/utils.rs:580:36
235.40 s
[gammaloop-crate-test-binaries-gammaloop-integration-tests-d6e55b48f8214f9c-deps] |
235.40 s
[gammaloop-crate-test-binaries-gammaloop-integration-tests-d6e55b48f8214f9c-deps] 580 | event.cut_info.lmb_channel_id,
235.40 s
[gammaloop-crate-test-binaries-gammaloop-integration-tests-d6e55b48f8214f9c-deps] | ^^^^^^^^^^^^^^ unknown field
235.40 s
[gammaloop-crate-test-binaries-gammaloop-integration-tests-d6e55b48f8214f9c-deps] |
235.40 s
[gammaloop-crate-test-binaries-gammaloop-integration-tests-d6e55b48f8214f9c-deps] = note : available fields are: `particle_pdgs`, `cut_id`, `graph_id`, `graph_group_id`, `orientation_id` ... and 2 others
235.40 s
[gammaloop-crate-test-binaries-gammaloop-integration-tests-d6e55b48f8214f9c-deps]
236.62 s
[gammaloop-crate-test-binaries-gammaloop-integration-tests-d6e55b48f8214f9c-deps] error : could not compile `gammaloop-integration-tests` (test "test_runs") due to 2 previous errors
330.58 s
Progress: 1 of 3 built (1 failed), 5 of 5 downloaded from cache
330.58 s
Failed to build gammaloop-crate-test-binaries-gammaloop-integration-tests-d6e55b48f8214f9c-deps after 1m40s
330.58 s
error: Cannot build '/nix/store/xp7k7p3yrpzhm16dwixd43zg74c390bn-gammaloop-crate-test-binaries-gammaloop-integration-tests-d6e55b48f8214f9c-deps-0.1.0.drv '.
330.58 s
Reason: builder failed with exit code 101 .
330.58 s
Output paths:
330.58 s
/nix/store/np2m2pyqrykbyx3cw8p4cjgwihh3k7r2-gammaloop-crate-test-binaries-gammaloop-integration-tests-d6e55b48f8214f9c-deps-0.1.0
330.58 s
Last 115 log lines:
330.58 s
> Running phase: unpackPhase
330.58 s
> unpacking source archive /nix/store/2myk8wcfjr9c5h56dnv9nv4lrgsfyarf-source
330.58 s
> source root is source
330.58 s
> Running phase: patchPhase
330.58 s
> Executing configureCargoCommonVars
330.58 s
> copying cargo artifacts from /nix/store/s7hml746kzs7r51nrawckz4jpgmg98bq-gammaloop-crate-test-binaries-gammaloop-integration-tests-d6e55b48f8214f9c-inputs/target to target
330.58 s
> will deep copy artifacts (instead of symlinking) as requested
330.58 s
> Running phase: updateAutotoolsGnuConfigScriptsPhase
330.58 s
> Running phase: configurePhase
330.58 s
> will append /build/source/.cargo-home/config.toml with contents of /nix/store/5drf77x6km4ky7gwlrzdx9bbd6fz09g3-vendor-cargo-deps/config.toml
330.58 s
> default configurePhase, nothing to do
330.58 s
> Running phase: buildPhase
330.58 s
> +++ command cargo --version
330.58 s
> cargo 1.97.0 (c980f4866 2026-06-30)
330.58 s
> +++ command cargo test --profile ci-optim --no-run --offline -p gammaloop-integration-tests --features gammaloop-integration-tests/python-api-tests
330.58 s
> Compiling gammaloop-integration-tests v0.1.0 (/build/source/tests)
330.58 s
> error[E0560] : struct `CutInfo` has no field named `lmb_channel_id`
330.58 s
> --> tests/tests/test_differential.rs:86:13
330.58 s
> |
330.58 s
> 86 | lmb_channel_id: None,
330.58 s
> | ^^^^^^^^^^^^^^ `CutInfo` does not have this field
330.58 s
> |
330.58 s
> = note : available fields are: `sampling_channel_id`, `sampling_channel_edge_ids`
330.58 s
>
330.58 s
> error[E0560] : struct `CutInfo` has no field named `lmb_channel_edge_ids`
330.58 s
> --> tests/tests/test_differential.rs:87:13
330.58 s
> |
330.58 s
> 87 | lmb_channel_edge_ids: None,
330.58 s
> | ^^^^^^^^^^^^^^^^^^^^ `CutInfo` does not have this field
330.58 s
> |
330.58 s
> = note : available fields are: `sampling_channel_id`, `sampling_channel_edge_ids`
330.58 s
>
330.58 s
> error[E0063] : missing field `reference_moments` in initializer of `GraphEvaluationResult<_>`
330.58 s
> --> tests/tests/test_differential.rs:532:19
330.58 s
> |
330.58 s
> 532 | let mut lhs = GraphEvaluationResult {
330.58 s
> | ^^^^^^^^^^^^^^^^^^^^^ missing `reference_moments`
330.58 s
>
330.58 s
> error[E0063] : missing field `reference_moments` in initializer of `GraphEvaluationResult<_>`
330.58 s
> --> tests/tests/test_differential.rs:539:15
330.58 s
> |
330.58 s
> 539 | let rhs = GraphEvaluationResult {
330.58 s
> | ^^^^^^^^^^^^^^^^^^^^^ missing `reference_moments`
330.58 s
>
330.58 s
> Some errors have detailed explanations: E0063, E0560.
330.58 s
> For more information about an error, try `rustc --explain E0063`.
330.58 s
> error : could not compile `gammaloop-integration-tests` (test "test_differential") due to 4 previous errors
330.58 s
> warning : build failed, waiting for other jobs to finish...
330.58 s
> error[E0609] : no field `lmb_channel_edge_ids` on type `CutInfo`
330.58 s
> --> tests/tests/test_evaluation_api.rs:311:10
330.58 s
> |
330.58 s
> 311 | .lmb_channel_edge_ids
330.58 s
> | ^^^^^^^^^^^^^^^^^^^^ unknown field
330.58 s
> |
330.58 s
> = note : available fields are: `particle_pdgs`, `cut_id`, `graph_id`, `graph_group_id`, `orientation_id` ... and 2 others
330.58 s
>
330.58 s
> error[E0609] : no field `lmb_channel_edge_ids` on type `CutInfo`
330.58 s
> --> tests/tests/test_evaluation_api.rs:591:26
330.58 s
> |
330.58 s
> 591 | .lmb_channel_edge_ids
330.58 s
> | ^^^^^^^^^^^^^^^^^^^^ unknown field
330.58 s
> |
330.58 s
> = note : available fields are: `particle_pdgs`, `cut_id`, `graph_id`, `graph_group_id`, `orientation_id` ... and 2 others
330.58 s
>
330.58 s
> error[E0609] : no field `lmb_channel_edge_ids` on type `CutInfo`
330.58 s
> --> tests/tests/test_evaluation_api.rs:1177:18
330.58 s
> |
330.58 s
> 1177 | .lmb_channel_edge_ids
330.58 s
> | ^^^^^^^^^^^^^^^^^^^^ unknown field
330.58 s
> |
330.58 s
> = note : available fields are: `particle_pdgs`, `cut_id`, `graph_id`, `graph_group_id`, `orientation_id` ... and 2 others
330.58 s
>
330.58 s
> error[E0609] : no field `lmb_channel_edge_ids` on type `CutInfo`
330.58 s
> --> tests/tests/test_evaluation_api.rs:1222:22
330.58 s
> |
330.58 s
> 1222 | .lmb_channel_edge_ids
330.58 s
> | ^^^^^^^^^^^^^^^^^^^^ unknown field
330.58 s
> |
330.58 s
> = note : available fields are: `particle_pdgs`, `cut_id`, `graph_id`, `graph_group_id`, `orientation_id` ... and 2 others
330.58 s
>
330.58 s
> error[E0609] : no field `lmb_channel_edge_ids` on type `CutInfo`
330.58 s
> --> tests/tests/test_evaluation_api.rs:1281:14
330.58 s
> |
330.58 s
> 1281 | .lmb_channel_edge_ids
330.58 s
> | ^^^^^^^^^^^^^^^^^^^^ unknown field
330.58 s
> |
330.58 s
> = note : available fields are: `particle_pdgs`, `cut_id`, `graph_id`, `graph_group_id`, `orientation_id` ... and 2 others
330.58 s
>
330.58 s
> error[E0609] : no field `lmb_channel_edge_ids` on type `CutInfo`
330.58 s
> --> tests/tests/test_evaluation_api.rs:1428:18
330.58 s
> |
330.58 s
> 1428 | .lmb_channel_edge_ids
330.58 s
> | ^^^^^^^^^^^^^^^^^^^^ unknown field
330.58 s
> |
330.58 s
> = note : available fields are: `particle_pdgs`, `cut_id`, `graph_id`, `graph_group_id`, `orientation_id` ... and 2 others
330.58 s
>
330.58 s
> For more information about this error, try `rustc --explain E0609`.
330.58 s
> error : could not compile `gammaloop-integration-tests` (test "test_evaluation_api") due to 6 previous errors
330.58 s
> error[E0609] : no field `lmb_channel_id` on type `CutInfo`
330.58 s
> --> tests/tests/test_runs/utils.rs:568:36
330.58 s
> |
330.58 s
> 568 | event.cut_info.lmb_channel_id,
330.58 s
> | ^^^^^^^^^^^^^^ unknown field
330.58 s
> |
330.58 s
> = note : available fields are: `particle_pdgs`, `cut_id`, `graph_id`, `graph_group_id`, `orientation_id` ... and 2 others
330.58 s
>
330.58 s
> error[E0609] : no field `lmb_channel_id` on type `CutInfo`
330.58 s
> --> tests/tests/test_runs/utils.rs:580:36
330.58 s
> |
330.58 s
> 580 | event.cut_info.lmb_channel_id,
330.58 s
> | ^^^^^^^^^^^^^^ unknown field
330.58 s
> |
330.58 s
> = note : available fields are: `particle_pdgs`, `cut_id`, `graph_id`, `graph_group_id`, `orientation_id` ... and 2 others
330.58 s
>
330.58 s
> error : could not compile `gammaloop-integration-tests` (test "test_runs") due to 2 previous errors
330.58 s
For full logs, run:
330.58 s
nix log /nix/store/xp7k7p3yrpzhm16dwixd43zg74c390bn-gammaloop-crate-test-binaries-gammaloop-integration-tests-d6e55b48f8214f9c-deps-0.1.0.drv
330.58 s
error: Cannot build '/nix/store/vfyaq6awg65dd1dcabdkzlfcdm1jlk66-nix-ci-artifact-barrier-crate-test-binaries-python-api-gammaloop-integration-tests.drv '.
330.58 s
Reason: 1 dependency failed .
330.58 s
Output paths:
330.58 s
/nix/store/sl24q9s5z1cdh06lzx2gzi3mcf26ma38-nix-ci-artifact-barrier-crate-test-binaries-python-api-gammaloop-integration-tests
330.58 s
Build failed due to failed dependency
330.63 s
Build failed.