build packages.x86_64-linux.crate-test-binaries-python-api-gammaloop-integration-tests
0.00 s
$ /nix/store/9ypz3flqsrl5xl495mm8h645gadjsxi1-coreutils-9.11/bin/timeout --kill-after=15s 7200s /nix/store/23zk8sgzamrbmj1fday15szf7f2279s8-nix-2.34.7/bin/nix --extra-experimental-features nix-command --extra-experimental-features flakes --log-format internal-json build --no-link --print-out-paths git+https://github.com/alphal00p/gammaloop?ref=advanced_sampling&rev=06d470409cd34d8d57afa11b04a3fb208ca20890&shallow=1#packages.x86_64-linux.crate-test-binaries-python-api-gammaloop-integration-tests --print-build-logs
12.35 s
13.12 s
Downloading cached gammaloop-python-module from https://cache.nix-ci.com
13.13 s
Downloading cached gammaloop-crate-test-dependencies-d6e55b48f8214f9c-inputs from https://cache.nix-ci.com
16.69 s
Downloaded cached gammaloop-python-module (146.4 MiB) in 3.5s
16.69 s
Progress: 0 of 4 built, 1 of 4 downloaded from cache (1 downloading)
41.66 s
Downloaded cached gammaloop-crate-test-dependencies-d6e55b48f8214f9c-inputs (3.1 GiB) in 28.5s
41.66 s
Progress: 0 of 3 built, 2 of 4 downloaded from cache
41.66 s
Downloading cached gammaloop-crate-test-dependencies-d6e55b48f8214f9c-deps from https://cache.nix-ci.com
41.91 s
Downloaded cached gammaloop-crate-test-dependencies-d6e55b48f8214f9c-deps (29.9 MiB) in 252ms
41.91 s
Progress: 0 of 3 built, 3 of 4 downloaded from cache
41.92 s
Downloading cached gammaloop-crate-test-binaries-gammaloop-integration-tests-d6e55b48f8214f9c-inputs from https://cache.nix-ci.com
65.10 s
Downloaded cached gammaloop-crate-test-binaries-gammaloop-integration-tests-d6e55b48f8214f9c-inputs (3.2 GiB) in 23.1s
65.10 s
Progress: 0 of 3 built, 4 of 4 downloaded from cache
65.76 s
Building /nix/store/xp7k7p3yrpzhm16dwixd43zg74c390bn-gammaloop-crate-test-binaries-gammaloop-integration-tests-d6e55b48f8214f9c-deps-0.1.0.drv
65.86 s
[gammaloop-crate-test-binaries-gammaloop-integration-tests-d6e55b48f8214f9c-deps] Phase: unpackPhase
65.87 s
[gammaloop-crate-test-binaries-gammaloop-integration-tests-d6e55b48f8214f9c-deps] unpacking source archive /nix/store/2myk8wcfjr9c5h56dnv9nv4lrgsfyarf-source
66.34 s
[gammaloop-crate-test-binaries-gammaloop-integration-tests-d6e55b48f8214f9c-deps] source root is source
66.37 s
[gammaloop-crate-test-binaries-gammaloop-integration-tests-d6e55b48f8214f9c-deps] Phase: patchPhase
66.45 s
[gammaloop-crate-test-binaries-gammaloop-integration-tests-d6e55b48f8214f9c-deps] Executing configureCargoCommonVars
66.45 s
[gammaloop-crate-test-binaries-gammaloop-integration-tests-d6e55b48f8214f9c-deps] copying cargo artifacts from /nix/store/s7hml746kzs7r51nrawckz4jpgmg98bq-gammaloop-crate-test-binaries-gammaloop-integration-tests-d6e55b48f8214f9c-inputs/target to target
66.45 s
[gammaloop-crate-test-binaries-gammaloop-integration-tests-d6e55b48f8214f9c-deps] will deep copy artifacts (instead of symlinking) as requested
76.96 s
[gammaloop-crate-test-binaries-gammaloop-integration-tests-d6e55b48f8214f9c-deps] Phase: updateAutotoolsGnuConfigScriptsPhase
77.00 s
[gammaloop-crate-test-binaries-gammaloop-integration-tests-d6e55b48f8214f9c-deps] Phase: configurePhase
77.01 s
[gammaloop-crate-test-binaries-gammaloop-integration-tests-d6e55b48f8214f9c-deps] will append /build/source/.cargo-home/config.toml with contents of /nix/store/5drf77x6km4ky7gwlrzdx9bbd6fz09g3-vendor-cargo-deps/config.toml
77.01 s
[gammaloop-crate-test-binaries-gammaloop-integration-tests-d6e55b48f8214f9c-deps] default configurePhase, nothing to do
77.02 s
[gammaloop-crate-test-binaries-gammaloop-integration-tests-d6e55b48f8214f9c-deps] Phase: buildPhase
77.02 s
[gammaloop-crate-test-binaries-gammaloop-integration-tests-d6e55b48f8214f9c-deps] +++ command cargo --version
77.03 s
[gammaloop-crate-test-binaries-gammaloop-integration-tests-d6e55b48f8214f9c-deps] cargo 1.97.0 (c980f4866 2026-06-30)
77.03 s
[gammaloop-crate-test-binaries-gammaloop-integration-tests-d6e55b48f8214f9c-deps] +++ command cargo test --profile ci-optim --no-run --offline -p gammaloop-integration-tests --features gammaloop-integration-tests/python-api-tests
78.22 s
[gammaloop-crate-test-binaries-gammaloop-integration-tests-d6e55b48f8214f9c-deps] Compiling gammaloop-integration-tests v0.1.0 (/build/source/tests)
78.37 s
[gammaloop-crate-test-binaries-gammaloop-integration-tests-d6e55b48f8214f9c-deps] error[E0560] : struct `CutInfo` has no field named `lmb_channel_id`
78.37 s
[gammaloop-crate-test-binaries-gammaloop-integration-tests-d6e55b48f8214f9c-deps] --> tests/tests/test_differential.rs:86:13
78.37 s
[gammaloop-crate-test-binaries-gammaloop-integration-tests-d6e55b48f8214f9c-deps] |
78.37 s
[gammaloop-crate-test-binaries-gammaloop-integration-tests-d6e55b48f8214f9c-deps] 86 | lmb_channel_id: None,
78.37 s
[gammaloop-crate-test-binaries-gammaloop-integration-tests-d6e55b48f8214f9c-deps] | ^^^^^^^^^^^^^^ `CutInfo` does not have this field
78.37 s
[gammaloop-crate-test-binaries-gammaloop-integration-tests-d6e55b48f8214f9c-deps] |
78.37 s
[gammaloop-crate-test-binaries-gammaloop-integration-tests-d6e55b48f8214f9c-deps] = note : available fields are: `sampling_channel_id`, `sampling_channel_edge_ids`
78.37 s
[gammaloop-crate-test-binaries-gammaloop-integration-tests-d6e55b48f8214f9c-deps]
78.37 s
[gammaloop-crate-test-binaries-gammaloop-integration-tests-d6e55b48f8214f9c-deps] error[E0560] : struct `CutInfo` has no field named `lmb_channel_edge_ids`
78.37 s
[gammaloop-crate-test-binaries-gammaloop-integration-tests-d6e55b48f8214f9c-deps] --> tests/tests/test_differential.rs:87:13
78.37 s
[gammaloop-crate-test-binaries-gammaloop-integration-tests-d6e55b48f8214f9c-deps] |
78.37 s
[gammaloop-crate-test-binaries-gammaloop-integration-tests-d6e55b48f8214f9c-deps] 87 | lmb_channel_edge_ids: None,
78.37 s
[gammaloop-crate-test-binaries-gammaloop-integration-tests-d6e55b48f8214f9c-deps] | ^^^^^^^^^^^^^^^^^^^^ `CutInfo` does not have this field
78.37 s
[gammaloop-crate-test-binaries-gammaloop-integration-tests-d6e55b48f8214f9c-deps] |
78.37 s
[gammaloop-crate-test-binaries-gammaloop-integration-tests-d6e55b48f8214f9c-deps] = note : available fields are: `sampling_channel_id`, `sampling_channel_edge_ids`
78.37 s
[gammaloop-crate-test-binaries-gammaloop-integration-tests-d6e55b48f8214f9c-deps]
78.38 s
[gammaloop-crate-test-binaries-gammaloop-integration-tests-d6e55b48f8214f9c-deps] error[E0063] : missing field `reference_moments` in initializer of `GraphEvaluationResult<_>`
78.38 s
[gammaloop-crate-test-binaries-gammaloop-integration-tests-d6e55b48f8214f9c-deps] --> tests/tests/test_differential.rs:532:19
78.38 s
[gammaloop-crate-test-binaries-gammaloop-integration-tests-d6e55b48f8214f9c-deps] |
78.38 s
[gammaloop-crate-test-binaries-gammaloop-integration-tests-d6e55b48f8214f9c-deps] 532 | let mut lhs = GraphEvaluationResult {
78.38 s
[gammaloop-crate-test-binaries-gammaloop-integration-tests-d6e55b48f8214f9c-deps] | ^^^^^^^^^^^^^^^^^^^^^ missing `reference_moments`
78.38 s
[gammaloop-crate-test-binaries-gammaloop-integration-tests-d6e55b48f8214f9c-deps]
78.38 s
[gammaloop-crate-test-binaries-gammaloop-integration-tests-d6e55b48f8214f9c-deps] error[E0063] : missing field `reference_moments` in initializer of `GraphEvaluationResult<_>`
78.38 s
[gammaloop-crate-test-binaries-gammaloop-integration-tests-d6e55b48f8214f9c-deps] --> tests/tests/test_differential.rs:539:15
78.38 s
[gammaloop-crate-test-binaries-gammaloop-integration-tests-d6e55b48f8214f9c-deps] |
78.38 s
[gammaloop-crate-test-binaries-gammaloop-integration-tests-d6e55b48f8214f9c-deps] 539 | let rhs = GraphEvaluationResult {
78.38 s
[gammaloop-crate-test-binaries-gammaloop-integration-tests-d6e55b48f8214f9c-deps] | ^^^^^^^^^^^^^^^^^^^^^ missing `reference_moments`
78.38 s
[gammaloop-crate-test-binaries-gammaloop-integration-tests-d6e55b48f8214f9c-deps]
78.44 s
[gammaloop-crate-test-binaries-gammaloop-integration-tests-d6e55b48f8214f9c-deps] Some errors have detailed explanations: E0063, E0560.
78.44 s
[gammaloop-crate-test-binaries-gammaloop-integration-tests-d6e55b48f8214f9c-deps] For more information about an error, try `rustc --explain E0063`.
78.45 s
[gammaloop-crate-test-binaries-gammaloop-integration-tests-d6e55b48f8214f9c-deps] error : could not compile `gammaloop-integration-tests` (test "test_differential") due to 4 previous errors
78.45 s
[gammaloop-crate-test-binaries-gammaloop-integration-tests-d6e55b48f8214f9c-deps] warning : build failed, waiting for other jobs to finish...
78.52 s
[gammaloop-crate-test-binaries-gammaloop-integration-tests-d6e55b48f8214f9c-deps] error[E0609] : no field `lmb_channel_edge_ids` on type `CutInfo`
78.52 s
[gammaloop-crate-test-binaries-gammaloop-integration-tests-d6e55b48f8214f9c-deps] --> tests/tests/test_evaluation_api.rs:311:10
78.52 s
[gammaloop-crate-test-binaries-gammaloop-integration-tests-d6e55b48f8214f9c-deps] |
78.52 s
[gammaloop-crate-test-binaries-gammaloop-integration-tests-d6e55b48f8214f9c-deps] 311 | .lmb_channel_edge_ids
78.52 s
[gammaloop-crate-test-binaries-gammaloop-integration-tests-d6e55b48f8214f9c-deps] | ^^^^^^^^^^^^^^^^^^^^ unknown field
78.52 s
[gammaloop-crate-test-binaries-gammaloop-integration-tests-d6e55b48f8214f9c-deps] |
78.52 s
[gammaloop-crate-test-binaries-gammaloop-integration-tests-d6e55b48f8214f9c-deps] = note : available fields are: `particle_pdgs`, `cut_id`, `graph_id`, `graph_group_id`, `orientation_id` ... and 2 others
78.52 s
[gammaloop-crate-test-binaries-gammaloop-integration-tests-d6e55b48f8214f9c-deps]
78.58 s
[gammaloop-crate-test-binaries-gammaloop-integration-tests-d6e55b48f8214f9c-deps] error[E0609] : no field `lmb_channel_edge_ids` on type `CutInfo`
78.58 s
[gammaloop-crate-test-binaries-gammaloop-integration-tests-d6e55b48f8214f9c-deps] --> tests/tests/test_evaluation_api.rs:591:26
78.58 s
[gammaloop-crate-test-binaries-gammaloop-integration-tests-d6e55b48f8214f9c-deps] |
78.58 s
[gammaloop-crate-test-binaries-gammaloop-integration-tests-d6e55b48f8214f9c-deps] 591 | .lmb_channel_edge_ids
78.58 s
[gammaloop-crate-test-binaries-gammaloop-integration-tests-d6e55b48f8214f9c-deps] | ^^^^^^^^^^^^^^^^^^^^ unknown field
78.58 s
[gammaloop-crate-test-binaries-gammaloop-integration-tests-d6e55b48f8214f9c-deps] |
78.58 s
[gammaloop-crate-test-binaries-gammaloop-integration-tests-d6e55b48f8214f9c-deps] = note : available fields are: `particle_pdgs`, `cut_id`, `graph_id`, `graph_group_id`, `orientation_id` ... and 2 others
78.58 s
[gammaloop-crate-test-binaries-gammaloop-integration-tests-d6e55b48f8214f9c-deps]
78.67 s
[gammaloop-crate-test-binaries-gammaloop-integration-tests-d6e55b48f8214f9c-deps] error[E0609] : no field `lmb_channel_edge_ids` on type `CutInfo`
78.67 s
[gammaloop-crate-test-binaries-gammaloop-integration-tests-d6e55b48f8214f9c-deps] --> tests/tests/test_evaluation_api.rs:1177:18
78.67 s
[gammaloop-crate-test-binaries-gammaloop-integration-tests-d6e55b48f8214f9c-deps] |
78.67 s
[gammaloop-crate-test-binaries-gammaloop-integration-tests-d6e55b48f8214f9c-deps] 1177 | .lmb_channel_edge_ids
78.67 s
[gammaloop-crate-test-binaries-gammaloop-integration-tests-d6e55b48f8214f9c-deps] | ^^^^^^^^^^^^^^^^^^^^ unknown field
78.67 s
[gammaloop-crate-test-binaries-gammaloop-integration-tests-d6e55b48f8214f9c-deps] |
78.67 s
[gammaloop-crate-test-binaries-gammaloop-integration-tests-d6e55b48f8214f9c-deps] = note : available fields are: `particle_pdgs`, `cut_id`, `graph_id`, `graph_group_id`, `orientation_id` ... and 2 others
78.67 s
[gammaloop-crate-test-binaries-gammaloop-integration-tests-d6e55b48f8214f9c-deps]
78.88 s
[gammaloop-crate-test-binaries-gammaloop-integration-tests-d6e55b48f8214f9c-deps] error[E0609] : no field `lmb_channel_edge_ids` on type `CutInfo`
78.88 s
[gammaloop-crate-test-binaries-gammaloop-integration-tests-d6e55b48f8214f9c-deps] --> tests/tests/test_evaluation_api.rs:1222:22
78.88 s
[gammaloop-crate-test-binaries-gammaloop-integration-tests-d6e55b48f8214f9c-deps] |
78.88 s
[gammaloop-crate-test-binaries-gammaloop-integration-tests-d6e55b48f8214f9c-deps] 1222 | .lmb_channel_edge_ids
78.88 s
[gammaloop-crate-test-binaries-gammaloop-integration-tests-d6e55b48f8214f9c-deps] | ^^^^^^^^^^^^^^^^^^^^ unknown field
78.88 s
[gammaloop-crate-test-binaries-gammaloop-integration-tests-d6e55b48f8214f9c-deps] |
78.88 s
[gammaloop-crate-test-binaries-gammaloop-integration-tests-d6e55b48f8214f9c-deps] = note : available fields are: `particle_pdgs`, `cut_id`, `graph_id`, `graph_group_id`, `orientation_id` ... and 2 others
78.88 s
[gammaloop-crate-test-binaries-gammaloop-integration-tests-d6e55b48f8214f9c-deps]
78.88 s
[gammaloop-crate-test-binaries-gammaloop-integration-tests-d6e55b48f8214f9c-deps] error[E0609] : no field `lmb_channel_edge_ids` on type `CutInfo`
78.88 s
[gammaloop-crate-test-binaries-gammaloop-integration-tests-d6e55b48f8214f9c-deps] --> tests/tests/test_evaluation_api.rs:1281:14
78.88 s
[gammaloop-crate-test-binaries-gammaloop-integration-tests-d6e55b48f8214f9c-deps] |
78.88 s
[gammaloop-crate-test-binaries-gammaloop-integration-tests-d6e55b48f8214f9c-deps] 1281 | .lmb_channel_edge_ids
78.88 s
[gammaloop-crate-test-binaries-gammaloop-integration-tests-d6e55b48f8214f9c-deps] | ^^^^^^^^^^^^^^^^^^^^ unknown field
78.88 s
[gammaloop-crate-test-binaries-gammaloop-integration-tests-d6e55b48f8214f9c-deps] |
78.88 s
[gammaloop-crate-test-binaries-gammaloop-integration-tests-d6e55b48f8214f9c-deps] = note : available fields are: `particle_pdgs`, `cut_id`, `graph_id`, `graph_group_id`, `orientation_id` ... and 2 others
78.88 s
[gammaloop-crate-test-binaries-gammaloop-integration-tests-d6e55b48f8214f9c-deps]
78.98 s
[gammaloop-crate-test-binaries-gammaloop-integration-tests-d6e55b48f8214f9c-deps] error[E0609] : no field `lmb_channel_edge_ids` on type `CutInfo`
78.98 s
[gammaloop-crate-test-binaries-gammaloop-integration-tests-d6e55b48f8214f9c-deps] --> tests/tests/test_evaluation_api.rs:1428:18
78.98 s
[gammaloop-crate-test-binaries-gammaloop-integration-tests-d6e55b48f8214f9c-deps] |
78.98 s
[gammaloop-crate-test-binaries-gammaloop-integration-tests-d6e55b48f8214f9c-deps] 1428 | .lmb_channel_edge_ids
78.98 s
[gammaloop-crate-test-binaries-gammaloop-integration-tests-d6e55b48f8214f9c-deps] | ^^^^^^^^^^^^^^^^^^^^ unknown field
78.98 s
[gammaloop-crate-test-binaries-gammaloop-integration-tests-d6e55b48f8214f9c-deps] |
78.98 s
[gammaloop-crate-test-binaries-gammaloop-integration-tests-d6e55b48f8214f9c-deps] = note : available fields are: `particle_pdgs`, `cut_id`, `graph_id`, `graph_group_id`, `orientation_id` ... and 2 others
78.98 s
[gammaloop-crate-test-binaries-gammaloop-integration-tests-d6e55b48f8214f9c-deps]
79.27 s
[gammaloop-crate-test-binaries-gammaloop-integration-tests-d6e55b48f8214f9c-deps] For more information about this error, try `rustc --explain E0609`.
79.30 s
[gammaloop-crate-test-binaries-gammaloop-integration-tests-d6e55b48f8214f9c-deps] error : could not compile `gammaloop-integration-tests` (test "test_evaluation_api") due to 6 previous errors
80.46 s
[gammaloop-crate-test-binaries-gammaloop-integration-tests-d6e55b48f8214f9c-deps] error[E0609] : no field `lmb_channel_id` on type `CutInfo`
80.46 s
[gammaloop-crate-test-binaries-gammaloop-integration-tests-d6e55b48f8214f9c-deps] --> tests/tests/test_runs/utils.rs:568:36
80.46 s
[gammaloop-crate-test-binaries-gammaloop-integration-tests-d6e55b48f8214f9c-deps] |
80.46 s
[gammaloop-crate-test-binaries-gammaloop-integration-tests-d6e55b48f8214f9c-deps] 568 | event.cut_info.lmb_channel_id,
80.46 s
[gammaloop-crate-test-binaries-gammaloop-integration-tests-d6e55b48f8214f9c-deps] | ^^^^^^^^^^^^^^ unknown field
80.46 s
[gammaloop-crate-test-binaries-gammaloop-integration-tests-d6e55b48f8214f9c-deps] |
80.46 s
[gammaloop-crate-test-binaries-gammaloop-integration-tests-d6e55b48f8214f9c-deps] = note : available fields are: `particle_pdgs`, `cut_id`, `graph_id`, `graph_group_id`, `orientation_id` ... and 2 others
80.46 s
[gammaloop-crate-test-binaries-gammaloop-integration-tests-d6e55b48f8214f9c-deps]
80.46 s
[gammaloop-crate-test-binaries-gammaloop-integration-tests-d6e55b48f8214f9c-deps] error[E0609] : no field `lmb_channel_id` on type `CutInfo`
80.46 s
[gammaloop-crate-test-binaries-gammaloop-integration-tests-d6e55b48f8214f9c-deps] --> tests/tests/test_runs/utils.rs:580:36
80.46 s
[gammaloop-crate-test-binaries-gammaloop-integration-tests-d6e55b48f8214f9c-deps] |
80.46 s
[gammaloop-crate-test-binaries-gammaloop-integration-tests-d6e55b48f8214f9c-deps] 580 | event.cut_info.lmb_channel_id,
80.46 s
[gammaloop-crate-test-binaries-gammaloop-integration-tests-d6e55b48f8214f9c-deps] | ^^^^^^^^^^^^^^ unknown field
80.46 s
[gammaloop-crate-test-binaries-gammaloop-integration-tests-d6e55b48f8214f9c-deps] |
80.46 s
[gammaloop-crate-test-binaries-gammaloop-integration-tests-d6e55b48f8214f9c-deps] = note : available fields are: `particle_pdgs`, `cut_id`, `graph_id`, `graph_group_id`, `orientation_id` ... and 2 others
80.46 s
[gammaloop-crate-test-binaries-gammaloop-integration-tests-d6e55b48f8214f9c-deps]
82.21 s
[gammaloop-crate-test-binaries-gammaloop-integration-tests-d6e55b48f8214f9c-deps] error : could not compile `gammaloop-integration-tests` (test "test_runs") due to 2 previous errors
176.10 s
Progress: 0 of 2 built (1 failed), 4 of 4 downloaded from cache
176.10 s
Failed to build gammaloop-crate-test-binaries-gammaloop-integration-tests-d6e55b48f8214f9c-deps after 1m50s
176.10 s
error: Cannot build '/nix/store/xp7k7p3yrpzhm16dwixd43zg74c390bn-gammaloop-crate-test-binaries-gammaloop-integration-tests-d6e55b48f8214f9c-deps-0.1.0.drv '.
176.10 s
Reason: builder failed with exit code 101 .
176.10 s
Output paths:
176.10 s
/nix/store/np2m2pyqrykbyx3cw8p4cjgwihh3k7r2-gammaloop-crate-test-binaries-gammaloop-integration-tests-d6e55b48f8214f9c-deps-0.1.0
176.10 s
Last 115 log lines:
176.10 s
> Running phase: unpackPhase
176.10 s
> unpacking source archive /nix/store/2myk8wcfjr9c5h56dnv9nv4lrgsfyarf-source
176.10 s
> source root is source
176.10 s
> Running phase: patchPhase
176.10 s
> Executing configureCargoCommonVars
176.10 s
> copying cargo artifacts from /nix/store/s7hml746kzs7r51nrawckz4jpgmg98bq-gammaloop-crate-test-binaries-gammaloop-integration-tests-d6e55b48f8214f9c-inputs/target to target
176.10 s
> will deep copy artifacts (instead of symlinking) as requested
176.10 s
> Running phase: updateAutotoolsGnuConfigScriptsPhase
176.10 s
> Running phase: configurePhase
176.10 s
> will append /build/source/.cargo-home/config.toml with contents of /nix/store/5drf77x6km4ky7gwlrzdx9bbd6fz09g3-vendor-cargo-deps/config.toml
176.10 s
> default configurePhase, nothing to do
176.10 s
> Running phase: buildPhase
176.10 s
> +++ command cargo --version
176.10 s
> cargo 1.97.0 (c980f4866 2026-06-30)
176.10 s
> +++ command cargo test --profile ci-optim --no-run --offline -p gammaloop-integration-tests --features gammaloop-integration-tests/python-api-tests
176.10 s
> Compiling gammaloop-integration-tests v0.1.0 (/build/source/tests)
176.10 s
> error[E0560] : struct `CutInfo` has no field named `lmb_channel_id`
176.10 s
> --> tests/tests/test_differential.rs:86:13
176.10 s
> |
176.10 s
> 86 | lmb_channel_id: None,
176.10 s
> | ^^^^^^^^^^^^^^ `CutInfo` does not have this field
176.10 s
> |
176.10 s
> = note : available fields are: `sampling_channel_id`, `sampling_channel_edge_ids`
176.10 s
>
176.10 s
> error[E0560] : struct `CutInfo` has no field named `lmb_channel_edge_ids`
176.10 s
> --> tests/tests/test_differential.rs:87:13
176.10 s
> |
176.10 s
> 87 | lmb_channel_edge_ids: None,
176.10 s
> | ^^^^^^^^^^^^^^^^^^^^ `CutInfo` does not have this field
176.10 s
> |
176.10 s
> = note : available fields are: `sampling_channel_id`, `sampling_channel_edge_ids`
176.10 s
>
176.10 s
> error[E0063] : missing field `reference_moments` in initializer of `GraphEvaluationResult<_>`
176.10 s
> --> tests/tests/test_differential.rs:532:19
176.10 s
> |
176.10 s
> 532 | let mut lhs = GraphEvaluationResult {
176.10 s
> | ^^^^^^^^^^^^^^^^^^^^^ missing `reference_moments`
176.10 s
>
176.10 s
> error[E0063] : missing field `reference_moments` in initializer of `GraphEvaluationResult<_>`
176.10 s
> --> tests/tests/test_differential.rs:539:15
176.10 s
> |
176.10 s
> 539 | let rhs = GraphEvaluationResult {
176.10 s
> | ^^^^^^^^^^^^^^^^^^^^^ missing `reference_moments`
176.10 s
>
176.10 s
> Some errors have detailed explanations: E0063, E0560.
176.10 s
> For more information about an error, try `rustc --explain E0063`.
176.10 s
> error : could not compile `gammaloop-integration-tests` (test "test_differential") due to 4 previous errors
176.10 s
> warning : build failed, waiting for other jobs to finish...
176.10 s
> error[E0609] : no field `lmb_channel_edge_ids` on type `CutInfo`
176.10 s
> --> tests/tests/test_evaluation_api.rs:311:10
176.10 s
> |
176.10 s
> 311 | .lmb_channel_edge_ids
176.10 s
> | ^^^^^^^^^^^^^^^^^^^^ unknown field
176.10 s
> |
176.10 s
> = note : available fields are: `particle_pdgs`, `cut_id`, `graph_id`, `graph_group_id`, `orientation_id` ... and 2 others
176.10 s
>
176.10 s
> error[E0609] : no field `lmb_channel_edge_ids` on type `CutInfo`
176.10 s
> --> tests/tests/test_evaluation_api.rs:591:26
176.10 s
> |
176.10 s
> 591 | .lmb_channel_edge_ids
176.10 s
> | ^^^^^^^^^^^^^^^^^^^^ unknown field
176.10 s
> |
176.10 s
> = note : available fields are: `particle_pdgs`, `cut_id`, `graph_id`, `graph_group_id`, `orientation_id` ... and 2 others
176.10 s
>
176.10 s
> error[E0609] : no field `lmb_channel_edge_ids` on type `CutInfo`
176.10 s
> --> tests/tests/test_evaluation_api.rs:1177:18
176.10 s
> |
176.10 s
> 1177 | .lmb_channel_edge_ids
176.10 s
> | ^^^^^^^^^^^^^^^^^^^^ unknown field
176.10 s
> |
176.10 s
> = note : available fields are: `particle_pdgs`, `cut_id`, `graph_id`, `graph_group_id`, `orientation_id` ... and 2 others
176.10 s
>
176.10 s
> error[E0609] : no field `lmb_channel_edge_ids` on type `CutInfo`
176.10 s
> --> tests/tests/test_evaluation_api.rs:1222:22
176.10 s
> |
176.10 s
> 1222 | .lmb_channel_edge_ids
176.10 s
> | ^^^^^^^^^^^^^^^^^^^^ unknown field
176.10 s
> |
176.10 s
> = note : available fields are: `particle_pdgs`, `cut_id`, `graph_id`, `graph_group_id`, `orientation_id` ... and 2 others
176.10 s
>
176.10 s
> error[E0609] : no field `lmb_channel_edge_ids` on type `CutInfo`
176.10 s
> --> tests/tests/test_evaluation_api.rs:1281:14
176.10 s
> |
176.10 s
> 1281 | .lmb_channel_edge_ids
176.10 s
> | ^^^^^^^^^^^^^^^^^^^^ unknown field
176.10 s
> |
176.10 s
> = note : available fields are: `particle_pdgs`, `cut_id`, `graph_id`, `graph_group_id`, `orientation_id` ... and 2 others
176.10 s
>
176.10 s
> error[E0609] : no field `lmb_channel_edge_ids` on type `CutInfo`
176.10 s
> --> tests/tests/test_evaluation_api.rs:1428:18
176.10 s
> |
176.10 s
> 1428 | .lmb_channel_edge_ids
176.10 s
> | ^^^^^^^^^^^^^^^^^^^^ unknown field
176.10 s
> |
176.10 s
> = note : available fields are: `particle_pdgs`, `cut_id`, `graph_id`, `graph_group_id`, `orientation_id` ... and 2 others
176.10 s
>
176.10 s
> For more information about this error, try `rustc --explain E0609`.
176.10 s
> error : could not compile `gammaloop-integration-tests` (test "test_evaluation_api") due to 6 previous errors
176.10 s
> error[E0609] : no field `lmb_channel_id` on type `CutInfo`
176.10 s
> --> tests/tests/test_runs/utils.rs:568:36
176.10 s
> |
176.10 s
> 568 | event.cut_info.lmb_channel_id,
176.10 s
> | ^^^^^^^^^^^^^^ unknown field
176.10 s
> |
176.10 s
> = note : available fields are: `particle_pdgs`, `cut_id`, `graph_id`, `graph_group_id`, `orientation_id` ... and 2 others
176.10 s
>
176.10 s
> error[E0609] : no field `lmb_channel_id` on type `CutInfo`
176.10 s
> --> tests/tests/test_runs/utils.rs:580:36
176.10 s
> |
176.10 s
> 580 | event.cut_info.lmb_channel_id,
176.10 s
> | ^^^^^^^^^^^^^^ unknown field
176.10 s
> |
176.10 s
> = note : available fields are: `particle_pdgs`, `cut_id`, `graph_id`, `graph_group_id`, `orientation_id` ... and 2 others
176.10 s
>
176.10 s
> error : could not compile `gammaloop-integration-tests` (test "test_runs") due to 2 previous errors
176.10 s
For full logs, run:
176.10 s
nix log /nix/store/xp7k7p3yrpzhm16dwixd43zg74c390bn-gammaloop-crate-test-binaries-gammaloop-integration-tests-d6e55b48f8214f9c-deps-0.1.0.drv
176.10 s
error: Cannot build '/nix/store/vfyaq6awg65dd1dcabdkzlfcdm1jlk66-nix-ci-artifact-barrier-crate-test-binaries-python-api-gammaloop-integration-tests.drv '.
176.10 s
Reason: 1 dependency failed .
176.10 s
Output paths:
176.10 s
/nix/store/sl24q9s5z1cdh06lzx2gzi3mcf26ma38-nix-ci-artifact-barrier-crate-test-binaries-python-api-gammaloop-integration-tests
176.10 s
Build failed due to failed dependency
176.15 s
Build failed.