build packages.x86_64-linux.crate-test-binaries-python-api-gammaloop-integration-tests

Reproduce this run
Original Run
  1. 0.00 s $ /nix/store/9ypz3flqsrl5xl495mm8h645gadjsxi1-coreutils-9.11/bin/timeout --kill-after=15s 7200s /nix/store/23zk8sgzamrbmj1fday15szf7f2279s8-nix-2.34.7/bin/nix --extra-experimental-features nix-command --extra-experimental-features flakes --log-format internal-json build --no-link --print-out-paths git+https://github.com/alphal00p/gammaloop?ref=advanced_sampling&rev=17cab6f72c1df1d8c1446d47281e0e8c60d52e8b&shallow=1#packages.x86_64-linux.crate-test-binaries-python-api-gammaloop-integration-tests --print-build-logs
  2. 9.87 s
  3. 10.61 s Downloading cached gammaloop-crate-test-dependencies-d6e55b48f8214f9c-inputs from https://cache.nix-ci.com
  4. 34.93 s Downloaded cached gammaloop-crate-test-dependencies-d6e55b48f8214f9c-inputs (3.1 GiB) in 24.3s
  5. 34.93 s Progress: 0 of 3 built, 1 of 3 downloaded from cache
  6. 34.94 s Downloading cached gammaloop-crate-test-dependencies-d6e55b48f8214f9c-deps from https://cache.nix-ci.com
  7. 35.19 s Downloaded cached gammaloop-crate-test-dependencies-d6e55b48f8214f9c-deps (30 MiB) in 255ms
  8. 35.19 s Progress: 0 of 3 built, 2 of 3 downloaded from cache
  9. 35.19 s Downloading cached gammaloop-crate-test-binaries-gammaloop-integration-tests-d6e55b48f8214f9c-inputs from https://cache.nix-ci.com
  10. 55.16 s Downloaded cached gammaloop-crate-test-binaries-gammaloop-integration-tests-d6e55b48f8214f9c-inputs (3.2 GiB) in 19.9s
  11. 55.16 s Progress: 0 of 3 built, 3 of 3 downloaded from cache
  12. 55.30 s Building /nix/store/id05n9ldlsz3iwbdiqvlzf69f1zh838x-gammaloop-crate-test-binaries-gammaloop-integration-tests-d6e55b48f8214f9c-deps-0.1.0.drv
  13. 55.35 s [gammaloop-crate-test-binaries-gammaloop-integration-tests-d6e55b48f8214f9c-deps] Phase: unpackPhase
  14. 55.36 s [gammaloop-crate-test-binaries-gammaloop-integration-tests-d6e55b48f8214f9c-deps] unpacking source archive /nix/store/psvpmn2b6k8zcmqkjki4va0q3z3cd12j-source
  15. 55.47 s [gammaloop-crate-test-binaries-gammaloop-integration-tests-d6e55b48f8214f9c-deps] source root is source
  16. 55.49 s [gammaloop-crate-test-binaries-gammaloop-integration-tests-d6e55b48f8214f9c-deps] Phase: patchPhase
  17. 55.56 s [gammaloop-crate-test-binaries-gammaloop-integration-tests-d6e55b48f8214f9c-deps] Executing configureCargoCommonVars
  18. 55.56 s [gammaloop-crate-test-binaries-gammaloop-integration-tests-d6e55b48f8214f9c-deps] copying cargo artifacts from /nix/store/9jjn08k46n5wvkcyymcnbaqw3xywg4z7-gammaloop-crate-test-binaries-gammaloop-integration-tests-d6e55b48f8214f9c-inputs/target to target
  19. 55.56 s [gammaloop-crate-test-binaries-gammaloop-integration-tests-d6e55b48f8214f9c-deps] will deep copy artifacts (instead of symlinking) as requested
  20. 57.94 s [gammaloop-crate-test-binaries-gammaloop-integration-tests-d6e55b48f8214f9c-deps] Phase: updateAutotoolsGnuConfigScriptsPhase
  21. 58.08 s [gammaloop-crate-test-binaries-gammaloop-integration-tests-d6e55b48f8214f9c-deps] Phase: configurePhase
  22. 58.22 s [gammaloop-crate-test-binaries-gammaloop-integration-tests-d6e55b48f8214f9c-deps] will append /build/source/.cargo-home/config.toml with contents of /nix/store/5drf77x6km4ky7gwlrzdx9bbd6fz09g3-vendor-cargo-deps/config.toml
  23. 58.22 s [gammaloop-crate-test-binaries-gammaloop-integration-tests-d6e55b48f8214f9c-deps] default configurePhase, nothing to do
  24. 58.23 s [gammaloop-crate-test-binaries-gammaloop-integration-tests-d6e55b48f8214f9c-deps] Phase: buildPhase
  25. 58.24 s [gammaloop-crate-test-binaries-gammaloop-integration-tests-d6e55b48f8214f9c-deps] +++ command cargo --version
  26. 58.24 s [gammaloop-crate-test-binaries-gammaloop-integration-tests-d6e55b48f8214f9c-deps] cargo 1.97.0 (c980f4866 2026-06-30)
  27. 58.24 s [gammaloop-crate-test-binaries-gammaloop-integration-tests-d6e55b48f8214f9c-deps] +++ command cargo test --profile ci-optim --no-run --offline -p gammaloop-integration-tests --features gammaloop-integration-tests/python-api-tests
  28. 60.60 s [gammaloop-crate-test-binaries-gammaloop-integration-tests-d6e55b48f8214f9c-deps] Compiling gammaloop-integration-tests v0.1.0 (/build/source/tests)
  29. 60.70 s [gammaloop-crate-test-binaries-gammaloop-integration-tests-d6e55b48f8214f9c-deps] error[E0560]: struct `CutInfo` has no field named `lmb_channel_id`
  30. 60.70 s [gammaloop-crate-test-binaries-gammaloop-integration-tests-d6e55b48f8214f9c-deps] --> tests/tests/test_differential.rs:86:13
  31. 60.70 s [gammaloop-crate-test-binaries-gammaloop-integration-tests-d6e55b48f8214f9c-deps] |
  32. 60.70 s [gammaloop-crate-test-binaries-gammaloop-integration-tests-d6e55b48f8214f9c-deps] 86 | lmb_channel_id: None,
  33. 60.70 s [gammaloop-crate-test-binaries-gammaloop-integration-tests-d6e55b48f8214f9c-deps] | ^^^^^^^^^^^^^^ `CutInfo` does not have this field
  34. 60.70 s [gammaloop-crate-test-binaries-gammaloop-integration-tests-d6e55b48f8214f9c-deps] |
  35. 60.70 s [gammaloop-crate-test-binaries-gammaloop-integration-tests-d6e55b48f8214f9c-deps] = note: available fields are: `sampling_channel_id`, `sampling_channel_edge_ids`
  36. 60.70 s [gammaloop-crate-test-binaries-gammaloop-integration-tests-d6e55b48f8214f9c-deps]
  37. 60.70 s [gammaloop-crate-test-binaries-gammaloop-integration-tests-d6e55b48f8214f9c-deps] error[E0560]: struct `CutInfo` has no field named `lmb_channel_edge_ids`
  38. 60.70 s [gammaloop-crate-test-binaries-gammaloop-integration-tests-d6e55b48f8214f9c-deps] --> tests/tests/test_differential.rs:87:13
  39. 60.70 s [gammaloop-crate-test-binaries-gammaloop-integration-tests-d6e55b48f8214f9c-deps] |
  40. 60.70 s [gammaloop-crate-test-binaries-gammaloop-integration-tests-d6e55b48f8214f9c-deps] 87 | lmb_channel_edge_ids: None,
  41. 60.70 s [gammaloop-crate-test-binaries-gammaloop-integration-tests-d6e55b48f8214f9c-deps] | ^^^^^^^^^^^^^^^^^^^^ `CutInfo` does not have this field
  42. 60.70 s [gammaloop-crate-test-binaries-gammaloop-integration-tests-d6e55b48f8214f9c-deps] |
  43. 60.70 s [gammaloop-crate-test-binaries-gammaloop-integration-tests-d6e55b48f8214f9c-deps] = note: available fields are: `sampling_channel_id`, `sampling_channel_edge_ids`
  44. 60.70 s [gammaloop-crate-test-binaries-gammaloop-integration-tests-d6e55b48f8214f9c-deps]
  45. 60.72 s [gammaloop-crate-test-binaries-gammaloop-integration-tests-d6e55b48f8214f9c-deps] error[E0609]: no field `lmb_channel_edge_ids` on type `CutInfo`
  46. 60.72 s [gammaloop-crate-test-binaries-gammaloop-integration-tests-d6e55b48f8214f9c-deps] --> tests/tests/test_evaluation_api.rs:311:10
  47. 60.72 s [gammaloop-crate-test-binaries-gammaloop-integration-tests-d6e55b48f8214f9c-deps] |
  48. 60.72 s [gammaloop-crate-test-binaries-gammaloop-integration-tests-d6e55b48f8214f9c-deps] 311 | .lmb_channel_edge_ids
  49. 60.72 s [gammaloop-crate-test-binaries-gammaloop-integration-tests-d6e55b48f8214f9c-deps] | ^^^^^^^^^^^^^^^^^^^^ unknown field
  50. 60.72 s [gammaloop-crate-test-binaries-gammaloop-integration-tests-d6e55b48f8214f9c-deps] |
  51. 60.72 s [gammaloop-crate-test-binaries-gammaloop-integration-tests-d6e55b48f8214f9c-deps] = note: available fields are: `particle_pdgs`, `cut_id`, `graph_id`, `graph_group_id`, `orientation_id` ... and 2 others
  52. 60.72 s [gammaloop-crate-test-binaries-gammaloop-integration-tests-d6e55b48f8214f9c-deps]
  53. 60.74 s [gammaloop-crate-test-binaries-gammaloop-integration-tests-d6e55b48f8214f9c-deps] error[E0609]: no field `lmb_channel_edge_ids` on type `CutInfo`
  54. 60.74 s [gammaloop-crate-test-binaries-gammaloop-integration-tests-d6e55b48f8214f9c-deps] --> tests/tests/test_evaluation_api.rs:591:26
  55. 60.74 s [gammaloop-crate-test-binaries-gammaloop-integration-tests-d6e55b48f8214f9c-deps] |
  56. 60.74 s [gammaloop-crate-test-binaries-gammaloop-integration-tests-d6e55b48f8214f9c-deps] 591 | .lmb_channel_edge_ids
  57. 60.74 s [gammaloop-crate-test-binaries-gammaloop-integration-tests-d6e55b48f8214f9c-deps] | ^^^^^^^^^^^^^^^^^^^^ unknown field
  58. 60.74 s [gammaloop-crate-test-binaries-gammaloop-integration-tests-d6e55b48f8214f9c-deps] |
  59. 60.74 s [gammaloop-crate-test-binaries-gammaloop-integration-tests-d6e55b48f8214f9c-deps] = note: available fields are: `particle_pdgs`, `cut_id`, `graph_id`, `graph_group_id`, `orientation_id` ... and 2 others
  60. 60.74 s [gammaloop-crate-test-binaries-gammaloop-integration-tests-d6e55b48f8214f9c-deps]
  61. 60.75 s [gammaloop-crate-test-binaries-gammaloop-integration-tests-d6e55b48f8214f9c-deps] For more information about this error, try `rustc --explain E0560`.
  62. 60.77 s [gammaloop-crate-test-binaries-gammaloop-integration-tests-d6e55b48f8214f9c-deps] error: could not compile `gammaloop-integration-tests` (test "test_differential") due to 2 previous errors
  63. 60.77 s [gammaloop-crate-test-binaries-gammaloop-integration-tests-d6e55b48f8214f9c-deps] warning: build failed, waiting for other jobs to finish...
  64. 60.77 s [gammaloop-crate-test-binaries-gammaloop-integration-tests-d6e55b48f8214f9c-deps] error[E0609]: no field `lmb_channel_edge_ids` on type `CutInfo`
  65. 60.77 s [gammaloop-crate-test-binaries-gammaloop-integration-tests-d6e55b48f8214f9c-deps] --> tests/tests/test_evaluation_api.rs:1177:18
  66. 60.77 s [gammaloop-crate-test-binaries-gammaloop-integration-tests-d6e55b48f8214f9c-deps] |
  67. 60.77 s [gammaloop-crate-test-binaries-gammaloop-integration-tests-d6e55b48f8214f9c-deps] 1177 | .lmb_channel_edge_ids
  68. 60.77 s [gammaloop-crate-test-binaries-gammaloop-integration-tests-d6e55b48f8214f9c-deps] | ^^^^^^^^^^^^^^^^^^^^ unknown field
  69. 60.77 s [gammaloop-crate-test-binaries-gammaloop-integration-tests-d6e55b48f8214f9c-deps] |
  70. 60.77 s [gammaloop-crate-test-binaries-gammaloop-integration-tests-d6e55b48f8214f9c-deps] = note: available fields are: `particle_pdgs`, `cut_id`, `graph_id`, `graph_group_id`, `orientation_id` ... and 2 others
  71. 60.77 s [gammaloop-crate-test-binaries-gammaloop-integration-tests-d6e55b48f8214f9c-deps]
  72. 60.85 s [gammaloop-crate-test-binaries-gammaloop-integration-tests-d6e55b48f8214f9c-deps] error[E0609]: no field `lmb_channel_edge_ids` on type `CutInfo`
  73. 60.85 s [gammaloop-crate-test-binaries-gammaloop-integration-tests-d6e55b48f8214f9c-deps] --> tests/tests/test_evaluation_api.rs:1222:22
  74. 60.85 s [gammaloop-crate-test-binaries-gammaloop-integration-tests-d6e55b48f8214f9c-deps] |
  75. 60.85 s [gammaloop-crate-test-binaries-gammaloop-integration-tests-d6e55b48f8214f9c-deps] 1222 | .lmb_channel_edge_ids
  76. 60.85 s [gammaloop-crate-test-binaries-gammaloop-integration-tests-d6e55b48f8214f9c-deps] | ^^^^^^^^^^^^^^^^^^^^ unknown field
  77. 60.85 s [gammaloop-crate-test-binaries-gammaloop-integration-tests-d6e55b48f8214f9c-deps] |
  78. 60.85 s [gammaloop-crate-test-binaries-gammaloop-integration-tests-d6e55b48f8214f9c-deps] = note: available fields are: `particle_pdgs`, `cut_id`, `graph_id`, `graph_group_id`, `orientation_id` ... and 2 others
  79. 60.85 s [gammaloop-crate-test-binaries-gammaloop-integration-tests-d6e55b48f8214f9c-deps]
  80. 60.85 s [gammaloop-crate-test-binaries-gammaloop-integration-tests-d6e55b48f8214f9c-deps] error[E0609]: no field `lmb_channel_edge_ids` on type `CutInfo`
  81. 60.85 s [gammaloop-crate-test-binaries-gammaloop-integration-tests-d6e55b48f8214f9c-deps] --> tests/tests/test_evaluation_api.rs:1281:14
  82. 60.85 s [gammaloop-crate-test-binaries-gammaloop-integration-tests-d6e55b48f8214f9c-deps] |
  83. 60.85 s [gammaloop-crate-test-binaries-gammaloop-integration-tests-d6e55b48f8214f9c-deps] 1281 | .lmb_channel_edge_ids
  84. 60.85 s [gammaloop-crate-test-binaries-gammaloop-integration-tests-d6e55b48f8214f9c-deps] | ^^^^^^^^^^^^^^^^^^^^ unknown field
  85. 60.85 s [gammaloop-crate-test-binaries-gammaloop-integration-tests-d6e55b48f8214f9c-deps] |
  86. 60.85 s [gammaloop-crate-test-binaries-gammaloop-integration-tests-d6e55b48f8214f9c-deps] = note: available fields are: `particle_pdgs`, `cut_id`, `graph_id`, `graph_group_id`, `orientation_id` ... and 2 others
  87. 60.85 s [gammaloop-crate-test-binaries-gammaloop-integration-tests-d6e55b48f8214f9c-deps]
  88. 60.89 s [gammaloop-crate-test-binaries-gammaloop-integration-tests-d6e55b48f8214f9c-deps] error[E0609]: no field `lmb_channel_edge_ids` on type `CutInfo`
  89. 60.89 s [gammaloop-crate-test-binaries-gammaloop-integration-tests-d6e55b48f8214f9c-deps] --> tests/tests/test_evaluation_api.rs:1428:18
  90. 60.89 s [gammaloop-crate-test-binaries-gammaloop-integration-tests-d6e55b48f8214f9c-deps] |
  91. 60.89 s [gammaloop-crate-test-binaries-gammaloop-integration-tests-d6e55b48f8214f9c-deps] 1428 | .lmb_channel_edge_ids
  92. 60.89 s [gammaloop-crate-test-binaries-gammaloop-integration-tests-d6e55b48f8214f9c-deps] | ^^^^^^^^^^^^^^^^^^^^ unknown field
  93. 60.89 s [gammaloop-crate-test-binaries-gammaloop-integration-tests-d6e55b48f8214f9c-deps] |
  94. 60.89 s [gammaloop-crate-test-binaries-gammaloop-integration-tests-d6e55b48f8214f9c-deps] = note: available fields are: `particle_pdgs`, `cut_id`, `graph_id`, `graph_group_id`, `orientation_id` ... and 2 others
  95. 60.89 s [gammaloop-crate-test-binaries-gammaloop-integration-tests-d6e55b48f8214f9c-deps]
  96. 60.98 s [gammaloop-crate-test-binaries-gammaloop-integration-tests-d6e55b48f8214f9c-deps] For more information about this error, try `rustc --explain E0609`.
  97. 60.99 s [gammaloop-crate-test-binaries-gammaloop-integration-tests-d6e55b48f8214f9c-deps] error: could not compile `gammaloop-integration-tests` (test "test_evaluation_api") due to 6 previous errors
  98. 61.61 s [gammaloop-crate-test-binaries-gammaloop-integration-tests-d6e55b48f8214f9c-deps] error[E0609]: no field `lmb_channel_id` on type `CutInfo`
  99. 61.61 s [gammaloop-crate-test-binaries-gammaloop-integration-tests-d6e55b48f8214f9c-deps] --> tests/tests/test_runs/utils.rs:568:36
  100. 61.61 s [gammaloop-crate-test-binaries-gammaloop-integration-tests-d6e55b48f8214f9c-deps] |
  101. 61.61 s [gammaloop-crate-test-binaries-gammaloop-integration-tests-d6e55b48f8214f9c-deps] 568 | event.cut_info.lmb_channel_id,
  102. 61.61 s [gammaloop-crate-test-binaries-gammaloop-integration-tests-d6e55b48f8214f9c-deps] | ^^^^^^^^^^^^^^ unknown field
  103. 61.61 s [gammaloop-crate-test-binaries-gammaloop-integration-tests-d6e55b48f8214f9c-deps] |
  104. 61.61 s [gammaloop-crate-test-binaries-gammaloop-integration-tests-d6e55b48f8214f9c-deps] = note: available fields are: `particle_pdgs`, `cut_id`, `graph_id`, `graph_group_id`, `orientation_id` ... and 2 others
  105. 61.61 s [gammaloop-crate-test-binaries-gammaloop-integration-tests-d6e55b48f8214f9c-deps]
  106. 61.61 s [gammaloop-crate-test-binaries-gammaloop-integration-tests-d6e55b48f8214f9c-deps] error[E0609]: no field `lmb_channel_id` on type `CutInfo`
  107. 61.61 s [gammaloop-crate-test-binaries-gammaloop-integration-tests-d6e55b48f8214f9c-deps] --> tests/tests/test_runs/utils.rs:580:36
  108. 61.61 s [gammaloop-crate-test-binaries-gammaloop-integration-tests-d6e55b48f8214f9c-deps] |
  109. 61.61 s [gammaloop-crate-test-binaries-gammaloop-integration-tests-d6e55b48f8214f9c-deps] 580 | event.cut_info.lmb_channel_id,
  110. 61.61 s [gammaloop-crate-test-binaries-gammaloop-integration-tests-d6e55b48f8214f9c-deps] | ^^^^^^^^^^^^^^ unknown field
  111. 61.61 s [gammaloop-crate-test-binaries-gammaloop-integration-tests-d6e55b48f8214f9c-deps] |
  112. 61.61 s [gammaloop-crate-test-binaries-gammaloop-integration-tests-d6e55b48f8214f9c-deps] = note: available fields are: `particle_pdgs`, `cut_id`, `graph_id`, `graph_group_id`, `orientation_id` ... and 2 others
  113. 61.61 s [gammaloop-crate-test-binaries-gammaloop-integration-tests-d6e55b48f8214f9c-deps]
  114. 62.25 s [gammaloop-crate-test-binaries-gammaloop-integration-tests-d6e55b48f8214f9c-deps] error: could not compile `gammaloop-integration-tests` (test "test_runs") due to 2 previous errors
  115. 107.13 s Progress: 0 of 2 built (1 failed), 3 of 3 downloaded from cache
  116. 107.13 s Failed to build gammaloop-crate-test-binaries-gammaloop-integration-tests-d6e55b48f8214f9c-deps after 51.8s
  117. 107.13 s error: Cannot build '/nix/store/id05n9ldlsz3iwbdiqvlzf69f1zh838x-gammaloop-crate-test-binaries-gammaloop-integration-tests-d6e55b48f8214f9c-deps-0.1.0.drv'.
  118. 107.13 s Reason: builder failed with exit code 101.
  119. 107.13 s Output paths:
  120. 107.13 s /nix/store/m2x6qq8c5j6rjga09gbywjp2qbvmg7jp-gammaloop-crate-test-binaries-gammaloop-integration-tests-d6e55b48f8214f9c-deps-0.1.0
  121. 107.13 s Last 102 log lines:
  122. 107.13 s > Running phase: unpackPhase
  123. 107.13 s > unpacking source archive /nix/store/psvpmn2b6k8zcmqkjki4va0q3z3cd12j-source
  124. 107.13 s > source root is source
  125. 107.13 s > Running phase: patchPhase
  126. 107.13 s > Executing configureCargoCommonVars
  127. 107.13 s > copying cargo artifacts from /nix/store/9jjn08k46n5wvkcyymcnbaqw3xywg4z7-gammaloop-crate-test-binaries-gammaloop-integration-tests-d6e55b48f8214f9c-inputs/target to target
  128. 107.13 s > will deep copy artifacts (instead of symlinking) as requested
  129. 107.13 s > Running phase: updateAutotoolsGnuConfigScriptsPhase
  130. 107.13 s > Running phase: configurePhase
  131. 107.13 s > will append /build/source/.cargo-home/config.toml with contents of /nix/store/5drf77x6km4ky7gwlrzdx9bbd6fz09g3-vendor-cargo-deps/config.toml
  132. 107.13 s > default configurePhase, nothing to do
  133. 107.13 s > Running phase: buildPhase
  134. 107.13 s > +++ command cargo --version
  135. 107.13 s > cargo 1.97.0 (c980f4866 2026-06-30)
  136. 107.13 s > +++ command cargo test --profile ci-optim --no-run --offline -p gammaloop-integration-tests --features gammaloop-integration-tests/python-api-tests
  137. 107.13 s > Compiling gammaloop-integration-tests v0.1.0 (/build/source/tests)
  138. 107.13 s > error[E0560]: struct `CutInfo` has no field named `lmb_channel_id`
  139. 107.13 s > --> tests/tests/test_differential.rs:86:13
  140. 107.13 s > |
  141. 107.13 s > 86 | lmb_channel_id: None,
  142. 107.13 s > | ^^^^^^^^^^^^^^ `CutInfo` does not have this field
  143. 107.13 s > |
  144. 107.13 s > = note: available fields are: `sampling_channel_id`, `sampling_channel_edge_ids`
  145. 107.13 s >
  146. 107.13 s > error[E0560]: struct `CutInfo` has no field named `lmb_channel_edge_ids`
  147. 107.13 s > --> tests/tests/test_differential.rs:87:13
  148. 107.13 s > |
  149. 107.13 s > 87 | lmb_channel_edge_ids: None,
  150. 107.13 s > | ^^^^^^^^^^^^^^^^^^^^ `CutInfo` does not have this field
  151. 107.13 s > |
  152. 107.13 s > = note: available fields are: `sampling_channel_id`, `sampling_channel_edge_ids`
  153. 107.13 s >
  154. 107.13 s > error[E0609]: no field `lmb_channel_edge_ids` on type `CutInfo`
  155. 107.13 s > --> tests/tests/test_evaluation_api.rs:311:10
  156. 107.13 s > |
  157. 107.13 s > 311 | .lmb_channel_edge_ids
  158. 107.13 s > | ^^^^^^^^^^^^^^^^^^^^ unknown field
  159. 107.13 s > |
  160. 107.13 s > = note: available fields are: `particle_pdgs`, `cut_id`, `graph_id`, `graph_group_id`, `orientation_id` ... and 2 others
  161. 107.13 s >
  162. 107.13 s > error[E0609]: no field `lmb_channel_edge_ids` on type `CutInfo`
  163. 107.13 s > --> tests/tests/test_evaluation_api.rs:591:26
  164. 107.13 s > |
  165. 107.13 s > 591 | .lmb_channel_edge_ids
  166. 107.13 s > | ^^^^^^^^^^^^^^^^^^^^ unknown field
  167. 107.13 s > |
  168. 107.13 s > = note: available fields are: `particle_pdgs`, `cut_id`, `graph_id`, `graph_group_id`, `orientation_id` ... and 2 others
  169. 107.13 s >
  170. 107.13 s > For more information about this error, try `rustc --explain E0560`.
  171. 107.13 s > error: could not compile `gammaloop-integration-tests` (test "test_differential") due to 2 previous errors
  172. 107.13 s > warning: build failed, waiting for other jobs to finish...
  173. 107.13 s > error[E0609]: no field `lmb_channel_edge_ids` on type `CutInfo`
  174. 107.13 s > --> tests/tests/test_evaluation_api.rs:1177:18
  175. 107.13 s > |
  176. 107.13 s > 1177 | .lmb_channel_edge_ids
  177. 107.13 s > | ^^^^^^^^^^^^^^^^^^^^ unknown field
  178. 107.13 s > |
  179. 107.13 s > = note: available fields are: `particle_pdgs`, `cut_id`, `graph_id`, `graph_group_id`, `orientation_id` ... and 2 others
  180. 107.13 s >
  181. 107.13 s > error[E0609]: no field `lmb_channel_edge_ids` on type `CutInfo`
  182. 107.13 s > --> tests/tests/test_evaluation_api.rs:1222:22
  183. 107.13 s > |
  184. 107.13 s > 1222 | .lmb_channel_edge_ids
  185. 107.13 s > | ^^^^^^^^^^^^^^^^^^^^ unknown field
  186. 107.13 s > |
  187. 107.13 s > = note: available fields are: `particle_pdgs`, `cut_id`, `graph_id`, `graph_group_id`, `orientation_id` ... and 2 others
  188. 107.13 s >
  189. 107.13 s > error[E0609]: no field `lmb_channel_edge_ids` on type `CutInfo`
  190. 107.13 s > --> tests/tests/test_evaluation_api.rs:1281:14
  191. 107.13 s > |
  192. 107.13 s > 1281 | .lmb_channel_edge_ids
  193. 107.13 s > | ^^^^^^^^^^^^^^^^^^^^ unknown field
  194. 107.13 s > |
  195. 107.13 s > = note: available fields are: `particle_pdgs`, `cut_id`, `graph_id`, `graph_group_id`, `orientation_id` ... and 2 others
  196. 107.13 s >
  197. 107.13 s > error[E0609]: no field `lmb_channel_edge_ids` on type `CutInfo`
  198. 107.13 s > --> tests/tests/test_evaluation_api.rs:1428:18
  199. 107.13 s > |
  200. 107.13 s > 1428 | .lmb_channel_edge_ids
  201. 107.13 s > | ^^^^^^^^^^^^^^^^^^^^ unknown field
  202. 107.13 s > |
  203. 107.13 s > = note: available fields are: `particle_pdgs`, `cut_id`, `graph_id`, `graph_group_id`, `orientation_id` ... and 2 others
  204. 107.13 s >
  205. 107.13 s > For more information about this error, try `rustc --explain E0609`.
  206. 107.13 s > error: could not compile `gammaloop-integration-tests` (test "test_evaluation_api") due to 6 previous errors
  207. 107.13 s > error[E0609]: no field `lmb_channel_id` on type `CutInfo`
  208. 107.13 s > --> tests/tests/test_runs/utils.rs:568:36
  209. 107.13 s > |
  210. 107.13 s > 568 | event.cut_info.lmb_channel_id,
  211. 107.13 s > | ^^^^^^^^^^^^^^ unknown field
  212. 107.13 s > |
  213. 107.13 s > = note: available fields are: `particle_pdgs`, `cut_id`, `graph_id`, `graph_group_id`, `orientation_id` ... and 2 others
  214. 107.13 s >
  215. 107.13 s > error[E0609]: no field `lmb_channel_id` on type `CutInfo`
  216. 107.13 s > --> tests/tests/test_runs/utils.rs:580:36
  217. 107.13 s > |
  218. 107.13 s > 580 | event.cut_info.lmb_channel_id,
  219. 107.13 s > | ^^^^^^^^^^^^^^ unknown field
  220. 107.13 s > |
  221. 107.13 s > = note: available fields are: `particle_pdgs`, `cut_id`, `graph_id`, `graph_group_id`, `orientation_id` ... and 2 others
  222. 107.13 s >
  223. 107.13 s > error: could not compile `gammaloop-integration-tests` (test "test_runs") due to 2 previous errors
  224. 107.13 s For full logs, run:
  225. 107.13 s nix log /nix/store/id05n9ldlsz3iwbdiqvlzf69f1zh838x-gammaloop-crate-test-binaries-gammaloop-integration-tests-d6e55b48f8214f9c-deps-0.1.0.drv
  226. 107.13 s error: Cannot build '/nix/store/x3c5ksmwa58whva0zl75f0j87pxlnqd2-nix-ci-artifact-barrier-crate-test-binaries-python-api-gammaloop-integration-tests.drv'.
  227. 107.13 s Reason: 1 dependency failed.
  228. 107.13 s Output paths:
  229. 107.13 s /nix/store/5fny7vb1bqf4vms4r263sk9jwa2l9aas-nix-ci-artifact-barrier-crate-test-binaries-python-api-gammaloop-integration-tests
  230. 107.14 s Build failed due to failed dependency
  231. 107.20 s Build failed.