build packages.x86_64-linux.crate-test-binaries-gammaloop-integration-tests
0.00 s
$ /nix/store/9ypz3flqsrl5xl495mm8h645gadjsxi1-coreutils-9.11/bin/timeout --kill-after=15s 7200s /nix/store/23zk8sgzamrbmj1fday15szf7f2279s8-nix-2.34.7/bin/nix --extra-experimental-features nix-command --extra-experimental-features flakes --log-format internal-json build --no-link --print-out-paths git+https://github.com/alphal00p/gammaloop?ref=advanced_sampling&rev=17cab6f72c1df1d8c1446d47281e0e8c60d52e8b&shallow=1#packages.x86_64-linux.crate-test-binaries-gammaloop-integration-tests --print-build-logs
1.00 s
error (ignored): SQLite database '/var/cache/nix-ci-worker/eval-cache-v6/046551c7d658884e20b0213a08a3c791ef5049872c44dded8c2e54afcf6d43c3.sqlite ' is busy
4.53 s
5.36 s
Downloading cached gammaloop-crate-test-dependencies-ea99827d76e4dd39-deps from https://cache.nix-ci.com
5.98 s
Downloaded cached gammaloop-crate-test-dependencies-ea99827d76e4dd39-deps (92.9 MiB) in 627ms
5.98 s
Progress: 0 of 4 built, 1 of 5 downloaded from cache
5.99 s
Downloading cached gammaloop-crate-test-dependencies-6e86b9f305aafb81-inputs from https://cache.nix-ci.com
20.75 s
Downloaded cached gammaloop-crate-test-dependencies-6e86b9f305aafb81-inputs (2.4 GiB) in 14.7s
20.75 s
Progress: 0 of 4 built, 2 of 5 downloaded from cache
20.75 s
Downloading cached gammaloop-crate-test-dependencies-6e86b9f305aafb81-deps from https://cache.nix-ci.com
22.10 s
Downloaded cached gammaloop-crate-test-dependencies-6e86b9f305aafb81-deps (123.9 MiB) in 1.3s
22.10 s
Progress: 0 of 4 built, 3 of 5 downloaded from cache
22.10 s
Downloading cached gammaloop-crate-test-dependencies-b8cda0d438c96d4f-inputs from https://cache.nix-ci.com
41.74 s
Downloaded cached gammaloop-crate-test-dependencies-b8cda0d438c96d4f-inputs (3.1 GiB) in 19.6s
41.74 s
Progress: 0 of 4 built, 4 of 5 downloaded from cache
41.74 s
Downloading cached gammaloop-crate-test-dependencies-b8cda0d438c96d4f-deps from https://cache.nix-ci.com
41.93 s
Downloaded cached gammaloop-crate-test-dependencies-b8cda0d438c96d4f-deps (30 MiB) in 189ms
41.93 s
Progress: 0 of 4 built, 5 of 5 downloaded from cache
42.06 s
Building /nix/store/kzavnkv1cl1yvfaq8lrs8hrd8m379hnj-gammaloop-crate-test-binaries-gammaloop-integration-tests-b8cda0d438c96d4f-inputs.drv
51.30 s
[gammaloop-crate-test-binaries-gammaloop-integration-tests-b8cda0d438c96d4f-inputs:post-build] Uploading to the NixCI cache: /nix/store/486yz5i6mjcn1qlgxwrh5l1vnxj9gg24-gammaloop-crate-test-binaries-gammaloop-integration-tests-b8cda0d438c96d4f-inputs
51.34 s
[gammaloop-crate-test-binaries-gammaloop-integration-tests-b8cda0d438c96d4f-inputs:post-build] warning: 'warn-short-path-literals' is deprecated, use 'lint-short-path-literals = ignore' instead
51.38 s
[gammaloop-crate-test-binaries-gammaloop-integration-tests-b8cda0d438c96d4f-inputs:post-build] copying 1 paths...
51.38 s
[gammaloop-crate-test-binaries-gammaloop-integration-tests-b8cda0d438c96d4f-inputs:post-build] copying path '/nix/store/486yz5i6mjcn1qlgxwrh5l1vnxj9gg24-gammaloop-crate-test-binaries-gammaloop-integration-tests-b8cda0d438c96d4f-inputs' to 'https://cache.nix-ci.com'...
179.51 s
[gammaloop-crate-test-binaries-gammaloop-integration-tests-b8cda0d438c96d4f-inputs:post-build] warning: 'warn-short-path-literals' is deprecated, use 'lint-short-path-literals = ignore' instead
179.74 s
[gammaloop-crate-test-binaries-gammaloop-integration-tests-b8cda0d438c96d4f-inputs:post-build] copying 1 paths...
179.74 s
[gammaloop-crate-test-binaries-gammaloop-integration-tests-b8cda0d438c96d4f-inputs:post-build] copying path '/nix/store/kzavnkv1cl1yvfaq8lrs8hrd8m379hnj-gammaloop-crate-test-binaries-gammaloop-integration-tests-b8cda0d438c96d4f-inputs.drv' to 'https://cache.nix-ci.com'...
179.89 s
Uploaded gammaloop-crate-test-binaries-gammaloop-integration-tests-b8cda0d438c96d4f-inputs in 2m08s
179.89 s
Progress: 1 of 4 built, 5 of 5 downloaded from cache
179.89 s
Built gammaloop-crate-test-binaries-gammaloop-integration-tests-b8cda0d438c96d4f-inputs in 2m17s
179.96 s
Building /nix/store/zh33vvdkbhlrp41mhi2kklvb40mlk2lw-gammaloop-crate-test-binaries-gammaloop-integration-tests-b8cda0d438c96d4f-deps-0.1.0.drv
180.02 s
[gammaloop-crate-test-binaries-gammaloop-integration-tests-b8cda0d438c96d4f-deps] Phase: unpackPhase
180.03 s
[gammaloop-crate-test-binaries-gammaloop-integration-tests-b8cda0d438c96d4f-deps] unpacking source archive /nix/store/psvpmn2b6k8zcmqkjki4va0q3z3cd12j-source
180.15 s
[gammaloop-crate-test-binaries-gammaloop-integration-tests-b8cda0d438c96d4f-deps] source root is source
180.16 s
[gammaloop-crate-test-binaries-gammaloop-integration-tests-b8cda0d438c96d4f-deps] Phase: patchPhase
180.24 s
[gammaloop-crate-test-binaries-gammaloop-integration-tests-b8cda0d438c96d4f-deps] Executing configureCargoCommonVars
180.24 s
[gammaloop-crate-test-binaries-gammaloop-integration-tests-b8cda0d438c96d4f-deps] copying cargo artifacts from /nix/store/486yz5i6mjcn1qlgxwrh5l1vnxj9gg24-gammaloop-crate-test-binaries-gammaloop-integration-tests-b8cda0d438c96d4f-inputs/target to target
180.24 s
[gammaloop-crate-test-binaries-gammaloop-integration-tests-b8cda0d438c96d4f-deps] will deep copy artifacts (instead of symlinking) as requested
181.96 s
[gammaloop-crate-test-binaries-gammaloop-integration-tests-b8cda0d438c96d4f-deps] Phase: updateAutotoolsGnuConfigScriptsPhase
181.99 s
[gammaloop-crate-test-binaries-gammaloop-integration-tests-b8cda0d438c96d4f-deps] Phase: configurePhase
182.00 s
[gammaloop-crate-test-binaries-gammaloop-integration-tests-b8cda0d438c96d4f-deps] will append /build/source/.cargo-home/config.toml with contents of /nix/store/5drf77x6km4ky7gwlrzdx9bbd6fz09g3-vendor-cargo-deps/config.toml
182.00 s
[gammaloop-crate-test-binaries-gammaloop-integration-tests-b8cda0d438c96d4f-deps] default configurePhase, nothing to do
182.00 s
[gammaloop-crate-test-binaries-gammaloop-integration-tests-b8cda0d438c96d4f-deps] Phase: buildPhase
182.01 s
[gammaloop-crate-test-binaries-gammaloop-integration-tests-b8cda0d438c96d4f-deps] +++ command cargo --version
182.01 s
[gammaloop-crate-test-binaries-gammaloop-integration-tests-b8cda0d438c96d4f-deps] cargo 1.97.0 (c980f4866 2026-06-30)
182.01 s
[gammaloop-crate-test-binaries-gammaloop-integration-tests-b8cda0d438c96d4f-deps] +++ command cargo test --profile ci-optim --no-run --offline -p gammaloop-integration-tests
182.39 s
[gammaloop-crate-test-binaries-gammaloop-integration-tests-b8cda0d438c96d4f-deps] Compiling gammaloop-integration-tests v0.1.0 (/build/source/tests)
182.49 s
[gammaloop-crate-test-binaries-gammaloop-integration-tests-b8cda0d438c96d4f-deps] error[E0560] : struct `CutInfo` has no field named `lmb_channel_id`
182.49 s
[gammaloop-crate-test-binaries-gammaloop-integration-tests-b8cda0d438c96d4f-deps] --> tests/tests/test_differential.rs:86:13
182.49 s
[gammaloop-crate-test-binaries-gammaloop-integration-tests-b8cda0d438c96d4f-deps] |
182.49 s
[gammaloop-crate-test-binaries-gammaloop-integration-tests-b8cda0d438c96d4f-deps] 86 | lmb_channel_id: None,
182.49 s
[gammaloop-crate-test-binaries-gammaloop-integration-tests-b8cda0d438c96d4f-deps] | ^^^^^^^^^^^^^^ `CutInfo` does not have this field
182.49 s
[gammaloop-crate-test-binaries-gammaloop-integration-tests-b8cda0d438c96d4f-deps] |
182.49 s
[gammaloop-crate-test-binaries-gammaloop-integration-tests-b8cda0d438c96d4f-deps] = note : available fields are: `sampling_channel_id`, `sampling_channel_edge_ids`
182.49 s
[gammaloop-crate-test-binaries-gammaloop-integration-tests-b8cda0d438c96d4f-deps]
182.49 s
[gammaloop-crate-test-binaries-gammaloop-integration-tests-b8cda0d438c96d4f-deps] error[E0560] : struct `CutInfo` has no field named `lmb_channel_edge_ids`
182.49 s
[gammaloop-crate-test-binaries-gammaloop-integration-tests-b8cda0d438c96d4f-deps] --> tests/tests/test_differential.rs:87:13
182.49 s
[gammaloop-crate-test-binaries-gammaloop-integration-tests-b8cda0d438c96d4f-deps] |
182.49 s
[gammaloop-crate-test-binaries-gammaloop-integration-tests-b8cda0d438c96d4f-deps] 87 | lmb_channel_edge_ids: None,
182.49 s
[gammaloop-crate-test-binaries-gammaloop-integration-tests-b8cda0d438c96d4f-deps] | ^^^^^^^^^^^^^^^^^^^^ `CutInfo` does not have this field
182.49 s
[gammaloop-crate-test-binaries-gammaloop-integration-tests-b8cda0d438c96d4f-deps] |
182.49 s
[gammaloop-crate-test-binaries-gammaloop-integration-tests-b8cda0d438c96d4f-deps] = note : available fields are: `sampling_channel_id`, `sampling_channel_edge_ids`
182.49 s
[gammaloop-crate-test-binaries-gammaloop-integration-tests-b8cda0d438c96d4f-deps]
182.53 s
[gammaloop-crate-test-binaries-gammaloop-integration-tests-b8cda0d438c96d4f-deps] error[E0609] : no field `lmb_channel_edge_ids` on type `CutInfo`
182.53 s
[gammaloop-crate-test-binaries-gammaloop-integration-tests-b8cda0d438c96d4f-deps] --> tests/tests/test_evaluation_api.rs:311:10
182.53 s
[gammaloop-crate-test-binaries-gammaloop-integration-tests-b8cda0d438c96d4f-deps] |
182.53 s
[gammaloop-crate-test-binaries-gammaloop-integration-tests-b8cda0d438c96d4f-deps] 311 | .lmb_channel_edge_ids
182.53 s
[gammaloop-crate-test-binaries-gammaloop-integration-tests-b8cda0d438c96d4f-deps] | ^^^^^^^^^^^^^^^^^^^^ unknown field
182.53 s
[gammaloop-crate-test-binaries-gammaloop-integration-tests-b8cda0d438c96d4f-deps] |
182.53 s
[gammaloop-crate-test-binaries-gammaloop-integration-tests-b8cda0d438c96d4f-deps] = note : available fields are: `particle_pdgs`, `cut_id`, `graph_id`, `graph_group_id`, `orientation_id` ... and 2 others
182.53 s
[gammaloop-crate-test-binaries-gammaloop-integration-tests-b8cda0d438c96d4f-deps]
182.55 s
[gammaloop-crate-test-binaries-gammaloop-integration-tests-b8cda0d438c96d4f-deps] error[E0609] : no field `lmb_channel_edge_ids` on type `CutInfo`
182.55 s
[gammaloop-crate-test-binaries-gammaloop-integration-tests-b8cda0d438c96d4f-deps] --> tests/tests/test_evaluation_api.rs:591:26
182.55 s
[gammaloop-crate-test-binaries-gammaloop-integration-tests-b8cda0d438c96d4f-deps] |
182.55 s
[gammaloop-crate-test-binaries-gammaloop-integration-tests-b8cda0d438c96d4f-deps] 591 | .lmb_channel_edge_ids
182.55 s
[gammaloop-crate-test-binaries-gammaloop-integration-tests-b8cda0d438c96d4f-deps] | ^^^^^^^^^^^^^^^^^^^^ unknown field
182.55 s
[gammaloop-crate-test-binaries-gammaloop-integration-tests-b8cda0d438c96d4f-deps] |
182.55 s
[gammaloop-crate-test-binaries-gammaloop-integration-tests-b8cda0d438c96d4f-deps] = note : available fields are: `particle_pdgs`, `cut_id`, `graph_id`, `graph_group_id`, `orientation_id` ... and 2 others
182.55 s
[gammaloop-crate-test-binaries-gammaloop-integration-tests-b8cda0d438c96d4f-deps]
182.56 s
[gammaloop-crate-test-binaries-gammaloop-integration-tests-b8cda0d438c96d4f-deps] For more information about this error, try `rustc --explain E0560`.
182.57 s
[gammaloop-crate-test-binaries-gammaloop-integration-tests-b8cda0d438c96d4f-deps] error : could not compile `gammaloop-integration-tests` (test "test_differential") due to 2 previous errors
182.57 s
[gammaloop-crate-test-binaries-gammaloop-integration-tests-b8cda0d438c96d4f-deps] warning : build failed, waiting for other jobs to finish...
182.58 s
[gammaloop-crate-test-binaries-gammaloop-integration-tests-b8cda0d438c96d4f-deps] error[E0609] : no field `lmb_channel_edge_ids` on type `CutInfo`
182.58 s
[gammaloop-crate-test-binaries-gammaloop-integration-tests-b8cda0d438c96d4f-deps] --> tests/tests/test_evaluation_api.rs:1177:18
182.58 s
[gammaloop-crate-test-binaries-gammaloop-integration-tests-b8cda0d438c96d4f-deps] |
182.58 s
[gammaloop-crate-test-binaries-gammaloop-integration-tests-b8cda0d438c96d4f-deps] 1177 | .lmb_channel_edge_ids
182.58 s
[gammaloop-crate-test-binaries-gammaloop-integration-tests-b8cda0d438c96d4f-deps] | ^^^^^^^^^^^^^^^^^^^^ unknown field
182.58 s
[gammaloop-crate-test-binaries-gammaloop-integration-tests-b8cda0d438c96d4f-deps] |
182.58 s
[gammaloop-crate-test-binaries-gammaloop-integration-tests-b8cda0d438c96d4f-deps] = note : available fields are: `particle_pdgs`, `cut_id`, `graph_id`, `graph_group_id`, `orientation_id` ... and 2 others
182.58 s
[gammaloop-crate-test-binaries-gammaloop-integration-tests-b8cda0d438c96d4f-deps]
182.65 s
[gammaloop-crate-test-binaries-gammaloop-integration-tests-b8cda0d438c96d4f-deps] error[E0609] : no field `lmb_channel_edge_ids` on type `CutInfo`
182.65 s
[gammaloop-crate-test-binaries-gammaloop-integration-tests-b8cda0d438c96d4f-deps] --> tests/tests/test_evaluation_api.rs:1222:22
182.65 s
[gammaloop-crate-test-binaries-gammaloop-integration-tests-b8cda0d438c96d4f-deps] |
182.65 s
[gammaloop-crate-test-binaries-gammaloop-integration-tests-b8cda0d438c96d4f-deps] 1222 | .lmb_channel_edge_ids
182.65 s
[gammaloop-crate-test-binaries-gammaloop-integration-tests-b8cda0d438c96d4f-deps] | ^^^^^^^^^^^^^^^^^^^^ unknown field
182.65 s
[gammaloop-crate-test-binaries-gammaloop-integration-tests-b8cda0d438c96d4f-deps] |
182.65 s
[gammaloop-crate-test-binaries-gammaloop-integration-tests-b8cda0d438c96d4f-deps] = note : available fields are: `particle_pdgs`, `cut_id`, `graph_id`, `graph_group_id`, `orientation_id` ... and 2 others
182.65 s
[gammaloop-crate-test-binaries-gammaloop-integration-tests-b8cda0d438c96d4f-deps]
182.65 s
[gammaloop-crate-test-binaries-gammaloop-integration-tests-b8cda0d438c96d4f-deps] error[E0609] : no field `lmb_channel_edge_ids` on type `CutInfo`
182.65 s
[gammaloop-crate-test-binaries-gammaloop-integration-tests-b8cda0d438c96d4f-deps] --> tests/tests/test_evaluation_api.rs:1281:14
182.65 s
[gammaloop-crate-test-binaries-gammaloop-integration-tests-b8cda0d438c96d4f-deps] |
182.65 s
[gammaloop-crate-test-binaries-gammaloop-integration-tests-b8cda0d438c96d4f-deps] 1281 | .lmb_channel_edge_ids
182.65 s
[gammaloop-crate-test-binaries-gammaloop-integration-tests-b8cda0d438c96d4f-deps] | ^^^^^^^^^^^^^^^^^^^^ unknown field
182.65 s
[gammaloop-crate-test-binaries-gammaloop-integration-tests-b8cda0d438c96d4f-deps] |
182.65 s
[gammaloop-crate-test-binaries-gammaloop-integration-tests-b8cda0d438c96d4f-deps] = note : available fields are: `particle_pdgs`, `cut_id`, `graph_id`, `graph_group_id`, `orientation_id` ... and 2 others
182.65 s
[gammaloop-crate-test-binaries-gammaloop-integration-tests-b8cda0d438c96d4f-deps]
182.69 s
[gammaloop-crate-test-binaries-gammaloop-integration-tests-b8cda0d438c96d4f-deps] error[E0609] : no field `lmb_channel_edge_ids` on type `CutInfo`
182.69 s
[gammaloop-crate-test-binaries-gammaloop-integration-tests-b8cda0d438c96d4f-deps] --> tests/tests/test_evaluation_api.rs:1428:18
182.69 s
[gammaloop-crate-test-binaries-gammaloop-integration-tests-b8cda0d438c96d4f-deps] |
182.69 s
[gammaloop-crate-test-binaries-gammaloop-integration-tests-b8cda0d438c96d4f-deps] 1428 | .lmb_channel_edge_ids
182.69 s
[gammaloop-crate-test-binaries-gammaloop-integration-tests-b8cda0d438c96d4f-deps] | ^^^^^^^^^^^^^^^^^^^^ unknown field
182.69 s
[gammaloop-crate-test-binaries-gammaloop-integration-tests-b8cda0d438c96d4f-deps] |
182.69 s
[gammaloop-crate-test-binaries-gammaloop-integration-tests-b8cda0d438c96d4f-deps] = note : available fields are: `particle_pdgs`, `cut_id`, `graph_id`, `graph_group_id`, `orientation_id` ... and 2 others
182.69 s
[gammaloop-crate-test-binaries-gammaloop-integration-tests-b8cda0d438c96d4f-deps]
182.78 s
[gammaloop-crate-test-binaries-gammaloop-integration-tests-b8cda0d438c96d4f-deps] For more information about this error, try `rustc --explain E0609`.
182.79 s
[gammaloop-crate-test-binaries-gammaloop-integration-tests-b8cda0d438c96d4f-deps] error : could not compile `gammaloop-integration-tests` (test "test_evaluation_api") due to 6 previous errors
183.37 s
[gammaloop-crate-test-binaries-gammaloop-integration-tests-b8cda0d438c96d4f-deps] error[E0609] : no field `lmb_channel_id` on type `CutInfo`
183.37 s
[gammaloop-crate-test-binaries-gammaloop-integration-tests-b8cda0d438c96d4f-deps] --> tests/tests/test_runs/utils.rs:568:36
183.37 s
[gammaloop-crate-test-binaries-gammaloop-integration-tests-b8cda0d438c96d4f-deps] |
183.37 s
[gammaloop-crate-test-binaries-gammaloop-integration-tests-b8cda0d438c96d4f-deps] 568 | event.cut_info.lmb_channel_id,
183.37 s
[gammaloop-crate-test-binaries-gammaloop-integration-tests-b8cda0d438c96d4f-deps] | ^^^^^^^^^^^^^^ unknown field
183.37 s
[gammaloop-crate-test-binaries-gammaloop-integration-tests-b8cda0d438c96d4f-deps] |
183.37 s
[gammaloop-crate-test-binaries-gammaloop-integration-tests-b8cda0d438c96d4f-deps] = note : available fields are: `particle_pdgs`, `cut_id`, `graph_id`, `graph_group_id`, `orientation_id` ... and 2 others
183.37 s
[gammaloop-crate-test-binaries-gammaloop-integration-tests-b8cda0d438c96d4f-deps]
183.37 s
[gammaloop-crate-test-binaries-gammaloop-integration-tests-b8cda0d438c96d4f-deps] error[E0609] : no field `lmb_channel_id` on type `CutInfo`
183.37 s
[gammaloop-crate-test-binaries-gammaloop-integration-tests-b8cda0d438c96d4f-deps] --> tests/tests/test_runs/utils.rs:580:36
183.37 s
[gammaloop-crate-test-binaries-gammaloop-integration-tests-b8cda0d438c96d4f-deps] |
183.37 s
[gammaloop-crate-test-binaries-gammaloop-integration-tests-b8cda0d438c96d4f-deps] 580 | event.cut_info.lmb_channel_id,
183.37 s
[gammaloop-crate-test-binaries-gammaloop-integration-tests-b8cda0d438c96d4f-deps] | ^^^^^^^^^^^^^^ unknown field
183.37 s
[gammaloop-crate-test-binaries-gammaloop-integration-tests-b8cda0d438c96d4f-deps] |
183.37 s
[gammaloop-crate-test-binaries-gammaloop-integration-tests-b8cda0d438c96d4f-deps] = note : available fields are: `particle_pdgs`, `cut_id`, `graph_id`, `graph_group_id`, `orientation_id` ... and 2 others
183.37 s
[gammaloop-crate-test-binaries-gammaloop-integration-tests-b8cda0d438c96d4f-deps]
184.07 s
[gammaloop-crate-test-binaries-gammaloop-integration-tests-b8cda0d438c96d4f-deps] error : could not compile `gammaloop-integration-tests` (test "test_runs") due to 2 previous errors
258.28 s
Progress: 1 of 3 built (1 failed), 5 of 5 downloaded from cache
258.28 s
Failed to build gammaloop-crate-test-binaries-gammaloop-integration-tests-b8cda0d438c96d4f-deps after 1m18s
258.29 s
error: Cannot build '/nix/store/zh33vvdkbhlrp41mhi2kklvb40mlk2lw-gammaloop-crate-test-binaries-gammaloop-integration-tests-b8cda0d438c96d4f-deps-0.1.0.drv '.
258.29 s
Reason: builder failed with exit code 101 .
258.29 s
Output paths:
258.29 s
/nix/store/qw4ah8nv7jm7rivbarx040j7vk11dfd0-gammaloop-crate-test-binaries-gammaloop-integration-tests-b8cda0d438c96d4f-deps-0.1.0
258.29 s
Last 102 log lines:
258.29 s
> Running phase: unpackPhase
258.29 s
> unpacking source archive /nix/store/psvpmn2b6k8zcmqkjki4va0q3z3cd12j-source
258.29 s
> source root is source
258.29 s
> Running phase: patchPhase
258.29 s
> Executing configureCargoCommonVars
258.29 s
> copying cargo artifacts from /nix/store/486yz5i6mjcn1qlgxwrh5l1vnxj9gg24-gammaloop-crate-test-binaries-gammaloop-integration-tests-b8cda0d438c96d4f-inputs/target to target
258.29 s
> will deep copy artifacts (instead of symlinking) as requested
258.29 s
> Running phase: updateAutotoolsGnuConfigScriptsPhase
258.29 s
> Running phase: configurePhase
258.29 s
> will append /build/source/.cargo-home/config.toml with contents of /nix/store/5drf77x6km4ky7gwlrzdx9bbd6fz09g3-vendor-cargo-deps/config.toml
258.29 s
> default configurePhase, nothing to do
258.29 s
> Running phase: buildPhase
258.29 s
> +++ command cargo --version
258.29 s
> cargo 1.97.0 (c980f4866 2026-06-30)
258.29 s
> +++ command cargo test --profile ci-optim --no-run --offline -p gammaloop-integration-tests
258.29 s
> Compiling gammaloop-integration-tests v0.1.0 (/build/source/tests)
258.29 s
> error[E0560] : struct `CutInfo` has no field named `lmb_channel_id`
258.29 s
> --> tests/tests/test_differential.rs:86:13
258.29 s
> |
258.29 s
> 86 | lmb_channel_id: None,
258.29 s
> | ^^^^^^^^^^^^^^ `CutInfo` does not have this field
258.29 s
> |
258.29 s
> = note : available fields are: `sampling_channel_id`, `sampling_channel_edge_ids`
258.29 s
>
258.29 s
> error[E0560] : struct `CutInfo` has no field named `lmb_channel_edge_ids`
258.29 s
> --> tests/tests/test_differential.rs:87:13
258.29 s
> |
258.29 s
> 87 | lmb_channel_edge_ids: None,
258.29 s
> | ^^^^^^^^^^^^^^^^^^^^ `CutInfo` does not have this field
258.29 s
> |
258.29 s
> = note : available fields are: `sampling_channel_id`, `sampling_channel_edge_ids`
258.29 s
>
258.29 s
> error[E0609] : no field `lmb_channel_edge_ids` on type `CutInfo`
258.29 s
> --> tests/tests/test_evaluation_api.rs:311:10
258.29 s
> |
258.29 s
> 311 | .lmb_channel_edge_ids
258.29 s
> | ^^^^^^^^^^^^^^^^^^^^ unknown field
258.29 s
> |
258.29 s
> = note : available fields are: `particle_pdgs`, `cut_id`, `graph_id`, `graph_group_id`, `orientation_id` ... and 2 others
258.29 s
>
258.29 s
> error[E0609] : no field `lmb_channel_edge_ids` on type `CutInfo`
258.29 s
> --> tests/tests/test_evaluation_api.rs:591:26
258.29 s
> |
258.29 s
> 591 | .lmb_channel_edge_ids
258.29 s
> | ^^^^^^^^^^^^^^^^^^^^ unknown field
258.29 s
> |
258.29 s
> = note : available fields are: `particle_pdgs`, `cut_id`, `graph_id`, `graph_group_id`, `orientation_id` ... and 2 others
258.29 s
>
258.29 s
> For more information about this error, try `rustc --explain E0560`.
258.29 s
> error : could not compile `gammaloop-integration-tests` (test "test_differential") due to 2 previous errors
258.29 s
> warning : build failed, waiting for other jobs to finish...
258.29 s
> error[E0609] : no field `lmb_channel_edge_ids` on type `CutInfo`
258.29 s
> --> tests/tests/test_evaluation_api.rs:1177:18
258.29 s
> |
258.29 s
> 1177 | .lmb_channel_edge_ids
258.29 s
> | ^^^^^^^^^^^^^^^^^^^^ unknown field
258.29 s
> |
258.29 s
> = note : available fields are: `particle_pdgs`, `cut_id`, `graph_id`, `graph_group_id`, `orientation_id` ... and 2 others
258.29 s
>
258.29 s
> error[E0609] : no field `lmb_channel_edge_ids` on type `CutInfo`
258.29 s
> --> tests/tests/test_evaluation_api.rs:1222:22
258.29 s
> |
258.29 s
> 1222 | .lmb_channel_edge_ids
258.29 s
> | ^^^^^^^^^^^^^^^^^^^^ unknown field
258.29 s
> |
258.29 s
> = note : available fields are: `particle_pdgs`, `cut_id`, `graph_id`, `graph_group_id`, `orientation_id` ... and 2 others
258.29 s
>
258.29 s
> error[E0609] : no field `lmb_channel_edge_ids` on type `CutInfo`
258.29 s
> --> tests/tests/test_evaluation_api.rs:1281:14
258.29 s
> |
258.29 s
> 1281 | .lmb_channel_edge_ids
258.29 s
> | ^^^^^^^^^^^^^^^^^^^^ unknown field
258.29 s
> |
258.29 s
> = note : available fields are: `particle_pdgs`, `cut_id`, `graph_id`, `graph_group_id`, `orientation_id` ... and 2 others
258.29 s
>
258.29 s
> error[E0609] : no field `lmb_channel_edge_ids` on type `CutInfo`
258.29 s
> --> tests/tests/test_evaluation_api.rs:1428:18
258.29 s
> |
258.29 s
> 1428 | .lmb_channel_edge_ids
258.29 s
> | ^^^^^^^^^^^^^^^^^^^^ unknown field
258.29 s
> |
258.29 s
> = note : available fields are: `particle_pdgs`, `cut_id`, `graph_id`, `graph_group_id`, `orientation_id` ... and 2 others
258.29 s
>
258.29 s
> For more information about this error, try `rustc --explain E0609`.
258.29 s
> error : could not compile `gammaloop-integration-tests` (test "test_evaluation_api") due to 6 previous errors
258.29 s
> error[E0609] : no field `lmb_channel_id` on type `CutInfo`
258.29 s
> --> tests/tests/test_runs/utils.rs:568:36
258.29 s
> |
258.29 s
> 568 | event.cut_info.lmb_channel_id,
258.29 s
> | ^^^^^^^^^^^^^^ unknown field
258.29 s
> |
258.29 s
> = note : available fields are: `particle_pdgs`, `cut_id`, `graph_id`, `graph_group_id`, `orientation_id` ... and 2 others
258.29 s
>
258.29 s
> error[E0609] : no field `lmb_channel_id` on type `CutInfo`
258.29 s
> --> tests/tests/test_runs/utils.rs:580:36
258.29 s
> |
258.29 s
> 580 | event.cut_info.lmb_channel_id,
258.29 s
> | ^^^^^^^^^^^^^^ unknown field
258.29 s
> |
258.29 s
> = note : available fields are: `particle_pdgs`, `cut_id`, `graph_id`, `graph_group_id`, `orientation_id` ... and 2 others
258.29 s
>
258.29 s
> error : could not compile `gammaloop-integration-tests` (test "test_runs") due to 2 previous errors
258.29 s
For full logs, run:
258.29 s
nix log /nix/store/zh33vvdkbhlrp41mhi2kklvb40mlk2lw-gammaloop-crate-test-binaries-gammaloop-integration-tests-b8cda0d438c96d4f-deps-0.1.0.drv
258.29 s
error: Cannot build '/nix/store/carn0p0z8gn4dah4yipq2b5626fi4887-nix-ci-artifact-barrier-crate-test-binaries-gammaloop-integration-tests.drv '.
258.29 s
Reason: 1 dependency failed .
258.29 s
Output paths:
258.29 s
/nix/store/shf9h8iafpj309z50m7r4s3ywf4c033q-nix-ci-artifact-barrier-crate-test-binaries-gammaloop-integration-tests
258.29 s
Build failed due to failed dependency
258.35 s
Build failed.