0.01 s
$ /nix/store/9ypz3flqsrl5xl495mm8h645gadjsxi1-coreutils-9.11/bin/timeout --kill-after=15s 7200s /nix/store/23zk8sgzamrbmj1fday15szf7f2279s8-nix-2.34.7/bin/nix --extra-experimental-features nix-command --extra-experimental-features flakes --log-format internal-json build --no-link --print-out-paths git+https://github.com/alphal00p/gammaloop?ref=advanced_sampling&rev=17cab6f72c1df1d8c1446d47281e0e8c60d52e8b&shallow=1#packages.x86_64-linux.crate-test-binaries-gammaloop-integration-tests --print-build-logs
0.30 s
error (ignored): SQLite database '/var/cache/nix-ci-worker/eval-cache-v6/046551c7d658884e20b0213a08a3c791ef5049872c44dded8c2e54afcf6d43c3.sqlite ' is busy
4.64 s
5.34 s
Building /nix/store/zh33vvdkbhlrp41mhi2kklvb40mlk2lw-gammaloop-crate-test-binaries-gammaloop-integration-tests-b8cda0d438c96d4f-deps-0.1.0.drv
5.43 s
[gammaloop-crate-test-binaries-gammaloop-integration-tests-b8cda0d438c96d4f-deps] Phase: unpackPhase
5.43 s
[gammaloop-crate-test-binaries-gammaloop-integration-tests-b8cda0d438c96d4f-deps] unpacking source archive /nix/store/psvpmn2b6k8zcmqkjki4va0q3z3cd12j-source
6.55 s
[gammaloop-crate-test-binaries-gammaloop-integration-tests-b8cda0d438c96d4f-deps] source root is source
6.58 s
[gammaloop-crate-test-binaries-gammaloop-integration-tests-b8cda0d438c96d4f-deps] Phase: patchPhase
6.65 s
[gammaloop-crate-test-binaries-gammaloop-integration-tests-b8cda0d438c96d4f-deps] Executing configureCargoCommonVars
6.65 s
[gammaloop-crate-test-binaries-gammaloop-integration-tests-b8cda0d438c96d4f-deps] copying cargo artifacts from /nix/store/486yz5i6mjcn1qlgxwrh5l1vnxj9gg24-gammaloop-crate-test-binaries-gammaloop-integration-tests-b8cda0d438c96d4f-inputs/target to target
6.65 s
[gammaloop-crate-test-binaries-gammaloop-integration-tests-b8cda0d438c96d4f-deps] will deep copy artifacts (instead of symlinking) as requested
9.71 s
[gammaloop-crate-test-binaries-gammaloop-integration-tests-b8cda0d438c96d4f-deps] Phase: updateAutotoolsGnuConfigScriptsPhase
9.74 s
[gammaloop-crate-test-binaries-gammaloop-integration-tests-b8cda0d438c96d4f-deps] Phase: configurePhase
9.75 s
[gammaloop-crate-test-binaries-gammaloop-integration-tests-b8cda0d438c96d4f-deps] will append /build/source/.cargo-home/config.toml with contents of /nix/store/5drf77x6km4ky7gwlrzdx9bbd6fz09g3-vendor-cargo-deps/config.toml
9.75 s
[gammaloop-crate-test-binaries-gammaloop-integration-tests-b8cda0d438c96d4f-deps] default configurePhase, nothing to do
9.75 s
[gammaloop-crate-test-binaries-gammaloop-integration-tests-b8cda0d438c96d4f-deps] Phase: buildPhase
9.75 s
[gammaloop-crate-test-binaries-gammaloop-integration-tests-b8cda0d438c96d4f-deps] +++ command cargo --version
9.76 s
[gammaloop-crate-test-binaries-gammaloop-integration-tests-b8cda0d438c96d4f-deps] cargo 1.97.0 (c980f4866 2026-06-30)
9.76 s
[gammaloop-crate-test-binaries-gammaloop-integration-tests-b8cda0d438c96d4f-deps] +++ command cargo test --profile ci-optim --no-run --offline -p gammaloop-integration-tests
10.54 s
[gammaloop-crate-test-binaries-gammaloop-integration-tests-b8cda0d438c96d4f-deps] Compiling gammaloop-integration-tests v0.1.0 (/build/source/tests)
10.65 s
[gammaloop-crate-test-binaries-gammaloop-integration-tests-b8cda0d438c96d4f-deps] error[E0560] : struct `CutInfo` has no field named `lmb_channel_id`
10.65 s
[gammaloop-crate-test-binaries-gammaloop-integration-tests-b8cda0d438c96d4f-deps] --> tests/tests/test_differential.rs:86:13
10.65 s
[gammaloop-crate-test-binaries-gammaloop-integration-tests-b8cda0d438c96d4f-deps] |
10.65 s
[gammaloop-crate-test-binaries-gammaloop-integration-tests-b8cda0d438c96d4f-deps] 86 | lmb_channel_id: None,
10.65 s
[gammaloop-crate-test-binaries-gammaloop-integration-tests-b8cda0d438c96d4f-deps] | ^^^^^^^^^^^^^^ `CutInfo` does not have this field
10.65 s
[gammaloop-crate-test-binaries-gammaloop-integration-tests-b8cda0d438c96d4f-deps] |
10.65 s
[gammaloop-crate-test-binaries-gammaloop-integration-tests-b8cda0d438c96d4f-deps] = note : available fields are: `sampling_channel_id`, `sampling_channel_edge_ids`
10.65 s
[gammaloop-crate-test-binaries-gammaloop-integration-tests-b8cda0d438c96d4f-deps]
10.65 s
[gammaloop-crate-test-binaries-gammaloop-integration-tests-b8cda0d438c96d4f-deps] error[E0560] : struct `CutInfo` has no field named `lmb_channel_edge_ids`
10.65 s
[gammaloop-crate-test-binaries-gammaloop-integration-tests-b8cda0d438c96d4f-deps] --> tests/tests/test_differential.rs:87:13
10.65 s
[gammaloop-crate-test-binaries-gammaloop-integration-tests-b8cda0d438c96d4f-deps] |
10.65 s
[gammaloop-crate-test-binaries-gammaloop-integration-tests-b8cda0d438c96d4f-deps] 87 | lmb_channel_edge_ids: None,
10.65 s
[gammaloop-crate-test-binaries-gammaloop-integration-tests-b8cda0d438c96d4f-deps] | ^^^^^^^^^^^^^^^^^^^^ `CutInfo` does not have this field
10.65 s
[gammaloop-crate-test-binaries-gammaloop-integration-tests-b8cda0d438c96d4f-deps] |
10.65 s
[gammaloop-crate-test-binaries-gammaloop-integration-tests-b8cda0d438c96d4f-deps] = note : available fields are: `sampling_channel_id`, `sampling_channel_edge_ids`
10.65 s
[gammaloop-crate-test-binaries-gammaloop-integration-tests-b8cda0d438c96d4f-deps]
10.68 s
[gammaloop-crate-test-binaries-gammaloop-integration-tests-b8cda0d438c96d4f-deps] error[E0609] : no field `lmb_channel_edge_ids` on type `CutInfo`
10.68 s
[gammaloop-crate-test-binaries-gammaloop-integration-tests-b8cda0d438c96d4f-deps] --> tests/tests/test_evaluation_api.rs:311:10
10.68 s
[gammaloop-crate-test-binaries-gammaloop-integration-tests-b8cda0d438c96d4f-deps] |
10.68 s
[gammaloop-crate-test-binaries-gammaloop-integration-tests-b8cda0d438c96d4f-deps] 311 | .lmb_channel_edge_ids
10.68 s
[gammaloop-crate-test-binaries-gammaloop-integration-tests-b8cda0d438c96d4f-deps] | ^^^^^^^^^^^^^^^^^^^^ unknown field
10.68 s
[gammaloop-crate-test-binaries-gammaloop-integration-tests-b8cda0d438c96d4f-deps] |
10.68 s
[gammaloop-crate-test-binaries-gammaloop-integration-tests-b8cda0d438c96d4f-deps] = note : available fields are: `particle_pdgs`, `cut_id`, `graph_id`, `graph_group_id`, `orientation_id` ... and 2 others
10.68 s
[gammaloop-crate-test-binaries-gammaloop-integration-tests-b8cda0d438c96d4f-deps]
10.70 s
[gammaloop-crate-test-binaries-gammaloop-integration-tests-b8cda0d438c96d4f-deps] error[E0609] : no field `lmb_channel_edge_ids` on type `CutInfo`
10.70 s
[gammaloop-crate-test-binaries-gammaloop-integration-tests-b8cda0d438c96d4f-deps] --> tests/tests/test_evaluation_api.rs:591:26
10.70 s
[gammaloop-crate-test-binaries-gammaloop-integration-tests-b8cda0d438c96d4f-deps] |
10.70 s
[gammaloop-crate-test-binaries-gammaloop-integration-tests-b8cda0d438c96d4f-deps] 591 | .lmb_channel_edge_ids
10.70 s
[gammaloop-crate-test-binaries-gammaloop-integration-tests-b8cda0d438c96d4f-deps] | ^^^^^^^^^^^^^^^^^^^^ unknown field
10.70 s
[gammaloop-crate-test-binaries-gammaloop-integration-tests-b8cda0d438c96d4f-deps] |
10.70 s
[gammaloop-crate-test-binaries-gammaloop-integration-tests-b8cda0d438c96d4f-deps] = note : available fields are: `particle_pdgs`, `cut_id`, `graph_id`, `graph_group_id`, `orientation_id` ... and 2 others
10.70 s
[gammaloop-crate-test-binaries-gammaloop-integration-tests-b8cda0d438c96d4f-deps]
10.72 s
[gammaloop-crate-test-binaries-gammaloop-integration-tests-b8cda0d438c96d4f-deps] For more information about this error, try `rustc --explain E0560`.
10.73 s
[gammaloop-crate-test-binaries-gammaloop-integration-tests-b8cda0d438c96d4f-deps] error : could not compile `gammaloop-integration-tests` (test "test_differential") due to 2 previous errors
10.73 s
[gammaloop-crate-test-binaries-gammaloop-integration-tests-b8cda0d438c96d4f-deps] warning : build failed, waiting for other jobs to finish...
10.73 s
[gammaloop-crate-test-binaries-gammaloop-integration-tests-b8cda0d438c96d4f-deps] error[E0609] : no field `lmb_channel_edge_ids` on type `CutInfo`
10.73 s
[gammaloop-crate-test-binaries-gammaloop-integration-tests-b8cda0d438c96d4f-deps] --> tests/tests/test_evaluation_api.rs:1177:18
10.73 s
[gammaloop-crate-test-binaries-gammaloop-integration-tests-b8cda0d438c96d4f-deps] |
10.73 s
[gammaloop-crate-test-binaries-gammaloop-integration-tests-b8cda0d438c96d4f-deps] 1177 | .lmb_channel_edge_ids
10.73 s
[gammaloop-crate-test-binaries-gammaloop-integration-tests-b8cda0d438c96d4f-deps] | ^^^^^^^^^^^^^^^^^^^^ unknown field
10.73 s
[gammaloop-crate-test-binaries-gammaloop-integration-tests-b8cda0d438c96d4f-deps] |
10.73 s
[gammaloop-crate-test-binaries-gammaloop-integration-tests-b8cda0d438c96d4f-deps] = note : available fields are: `particle_pdgs`, `cut_id`, `graph_id`, `graph_group_id`, `orientation_id` ... and 2 others
10.73 s
[gammaloop-crate-test-binaries-gammaloop-integration-tests-b8cda0d438c96d4f-deps]
10.81 s
[gammaloop-crate-test-binaries-gammaloop-integration-tests-b8cda0d438c96d4f-deps] error[E0609] : no field `lmb_channel_edge_ids` on type `CutInfo`
10.81 s
[gammaloop-crate-test-binaries-gammaloop-integration-tests-b8cda0d438c96d4f-deps] --> tests/tests/test_evaluation_api.rs:1222:22
10.81 s
[gammaloop-crate-test-binaries-gammaloop-integration-tests-b8cda0d438c96d4f-deps] |
10.81 s
[gammaloop-crate-test-binaries-gammaloop-integration-tests-b8cda0d438c96d4f-deps] 1222 | .lmb_channel_edge_ids
10.81 s
[gammaloop-crate-test-binaries-gammaloop-integration-tests-b8cda0d438c96d4f-deps] | ^^^^^^^^^^^^^^^^^^^^ unknown field
10.81 s
[gammaloop-crate-test-binaries-gammaloop-integration-tests-b8cda0d438c96d4f-deps] |
10.81 s
[gammaloop-crate-test-binaries-gammaloop-integration-tests-b8cda0d438c96d4f-deps] = note : available fields are: `particle_pdgs`, `cut_id`, `graph_id`, `graph_group_id`, `orientation_id` ... and 2 others
10.81 s
[gammaloop-crate-test-binaries-gammaloop-integration-tests-b8cda0d438c96d4f-deps]
10.81 s
[gammaloop-crate-test-binaries-gammaloop-integration-tests-b8cda0d438c96d4f-deps] error[E0609] : no field `lmb_channel_edge_ids` on type `CutInfo`
10.81 s
[gammaloop-crate-test-binaries-gammaloop-integration-tests-b8cda0d438c96d4f-deps] --> tests/tests/test_evaluation_api.rs:1281:14
10.81 s
[gammaloop-crate-test-binaries-gammaloop-integration-tests-b8cda0d438c96d4f-deps] |
10.81 s
[gammaloop-crate-test-binaries-gammaloop-integration-tests-b8cda0d438c96d4f-deps] 1281 | .lmb_channel_edge_ids
10.81 s
[gammaloop-crate-test-binaries-gammaloop-integration-tests-b8cda0d438c96d4f-deps] | ^^^^^^^^^^^^^^^^^^^^ unknown field
10.81 s
[gammaloop-crate-test-binaries-gammaloop-integration-tests-b8cda0d438c96d4f-deps] |
10.81 s
[gammaloop-crate-test-binaries-gammaloop-integration-tests-b8cda0d438c96d4f-deps] = note : available fields are: `particle_pdgs`, `cut_id`, `graph_id`, `graph_group_id`, `orientation_id` ... and 2 others
10.81 s
[gammaloop-crate-test-binaries-gammaloop-integration-tests-b8cda0d438c96d4f-deps]
10.85 s
[gammaloop-crate-test-binaries-gammaloop-integration-tests-b8cda0d438c96d4f-deps] error[E0609] : no field `lmb_channel_edge_ids` on type `CutInfo`
10.85 s
[gammaloop-crate-test-binaries-gammaloop-integration-tests-b8cda0d438c96d4f-deps] --> tests/tests/test_evaluation_api.rs:1428:18
10.85 s
[gammaloop-crate-test-binaries-gammaloop-integration-tests-b8cda0d438c96d4f-deps] |
10.85 s
[gammaloop-crate-test-binaries-gammaloop-integration-tests-b8cda0d438c96d4f-deps] 1428 | .lmb_channel_edge_ids
10.85 s
[gammaloop-crate-test-binaries-gammaloop-integration-tests-b8cda0d438c96d4f-deps] | ^^^^^^^^^^^^^^^^^^^^ unknown field
10.85 s
[gammaloop-crate-test-binaries-gammaloop-integration-tests-b8cda0d438c96d4f-deps] |
10.85 s
[gammaloop-crate-test-binaries-gammaloop-integration-tests-b8cda0d438c96d4f-deps] = note : available fields are: `particle_pdgs`, `cut_id`, `graph_id`, `graph_group_id`, `orientation_id` ... and 2 others
10.85 s
[gammaloop-crate-test-binaries-gammaloop-integration-tests-b8cda0d438c96d4f-deps]
10.94 s
[gammaloop-crate-test-binaries-gammaloop-integration-tests-b8cda0d438c96d4f-deps] For more information about this error, try `rustc --explain E0609`.
10.96 s
[gammaloop-crate-test-binaries-gammaloop-integration-tests-b8cda0d438c96d4f-deps] error : could not compile `gammaloop-integration-tests` (test "test_evaluation_api") due to 6 previous errors
11.59 s
[gammaloop-crate-test-binaries-gammaloop-integration-tests-b8cda0d438c96d4f-deps] error[E0609] : no field `lmb_channel_id` on type `CutInfo`
11.59 s
[gammaloop-crate-test-binaries-gammaloop-integration-tests-b8cda0d438c96d4f-deps] --> tests/tests/test_runs/utils.rs:568:36
11.59 s
[gammaloop-crate-test-binaries-gammaloop-integration-tests-b8cda0d438c96d4f-deps] |
11.59 s
[gammaloop-crate-test-binaries-gammaloop-integration-tests-b8cda0d438c96d4f-deps] 568 | event.cut_info.lmb_channel_id,
11.59 s
[gammaloop-crate-test-binaries-gammaloop-integration-tests-b8cda0d438c96d4f-deps] | ^^^^^^^^^^^^^^ unknown field
11.59 s
[gammaloop-crate-test-binaries-gammaloop-integration-tests-b8cda0d438c96d4f-deps] |
11.59 s
[gammaloop-crate-test-binaries-gammaloop-integration-tests-b8cda0d438c96d4f-deps] = note : available fields are: `particle_pdgs`, `cut_id`, `graph_id`, `graph_group_id`, `orientation_id` ... and 2 others
11.59 s
[gammaloop-crate-test-binaries-gammaloop-integration-tests-b8cda0d438c96d4f-deps]
11.59 s
[gammaloop-crate-test-binaries-gammaloop-integration-tests-b8cda0d438c96d4f-deps] error[E0609] : no field `lmb_channel_id` on type `CutInfo`
11.59 s
[gammaloop-crate-test-binaries-gammaloop-integration-tests-b8cda0d438c96d4f-deps] --> tests/tests/test_runs/utils.rs:580:36
11.59 s
[gammaloop-crate-test-binaries-gammaloop-integration-tests-b8cda0d438c96d4f-deps] |
11.59 s
[gammaloop-crate-test-binaries-gammaloop-integration-tests-b8cda0d438c96d4f-deps] 580 | event.cut_info.lmb_channel_id,
11.59 s
[gammaloop-crate-test-binaries-gammaloop-integration-tests-b8cda0d438c96d4f-deps] | ^^^^^^^^^^^^^^ unknown field
11.59 s
[gammaloop-crate-test-binaries-gammaloop-integration-tests-b8cda0d438c96d4f-deps] |
11.59 s
[gammaloop-crate-test-binaries-gammaloop-integration-tests-b8cda0d438c96d4f-deps] = note : available fields are: `particle_pdgs`, `cut_id`, `graph_id`, `graph_group_id`, `orientation_id` ... and 2 others
11.59 s
[gammaloop-crate-test-binaries-gammaloop-integration-tests-b8cda0d438c96d4f-deps]
12.31 s
[gammaloop-crate-test-binaries-gammaloop-integration-tests-b8cda0d438c96d4f-deps] error : could not compile `gammaloop-integration-tests` (test "test_runs") due to 2 previous errors
61.08 s
Progress: 0 of 2 built (1 failed)
61.08 s
Failed to build gammaloop-crate-test-binaries-gammaloop-integration-tests-b8cda0d438c96d4f-deps after 55.7s
61.08 s
error: Cannot build '/nix/store/zh33vvdkbhlrp41mhi2kklvb40mlk2lw-gammaloop-crate-test-binaries-gammaloop-integration-tests-b8cda0d438c96d4f-deps-0.1.0.drv '.
61.08 s
Reason: builder failed with exit code 101 .
61.08 s
Output paths:
61.08 s
/nix/store/qw4ah8nv7jm7rivbarx040j7vk11dfd0-gammaloop-crate-test-binaries-gammaloop-integration-tests-b8cda0d438c96d4f-deps-0.1.0
61.08 s
Last 102 log lines:
61.08 s
> Running phase: unpackPhase
61.08 s
> unpacking source archive /nix/store/psvpmn2b6k8zcmqkjki4va0q3z3cd12j-source
61.08 s
> source root is source
61.08 s
> Running phase: patchPhase
61.08 s
> Executing configureCargoCommonVars
61.08 s
> copying cargo artifacts from /nix/store/486yz5i6mjcn1qlgxwrh5l1vnxj9gg24-gammaloop-crate-test-binaries-gammaloop-integration-tests-b8cda0d438c96d4f-inputs/target to target
61.08 s
> will deep copy artifacts (instead of symlinking) as requested
61.08 s
> Running phase: updateAutotoolsGnuConfigScriptsPhase
61.08 s
> Running phase: configurePhase
61.08 s
> will append /build/source/.cargo-home/config.toml with contents of /nix/store/5drf77x6km4ky7gwlrzdx9bbd6fz09g3-vendor-cargo-deps/config.toml
61.08 s
> default configurePhase, nothing to do
61.08 s
> Running phase: buildPhase
61.08 s
> +++ command cargo --version
61.08 s
> cargo 1.97.0 (c980f4866 2026-06-30)
61.08 s
> +++ command cargo test --profile ci-optim --no-run --offline -p gammaloop-integration-tests
61.08 s
> Compiling gammaloop-integration-tests v0.1.0 (/build/source/tests)
61.08 s
> error[E0560] : struct `CutInfo` has no field named `lmb_channel_id`
61.08 s
> --> tests/tests/test_differential.rs:86:13
61.08 s
> |
61.08 s
> 86 | lmb_channel_id: None,
61.08 s
> | ^^^^^^^^^^^^^^ `CutInfo` does not have this field
61.08 s
> |
61.08 s
> = note : available fields are: `sampling_channel_id`, `sampling_channel_edge_ids`
61.08 s
>
61.08 s
> error[E0560] : struct `CutInfo` has no field named `lmb_channel_edge_ids`
61.08 s
> --> tests/tests/test_differential.rs:87:13
61.08 s
> |
61.08 s
> 87 | lmb_channel_edge_ids: None,
61.08 s
> | ^^^^^^^^^^^^^^^^^^^^ `CutInfo` does not have this field
61.08 s
> |
61.08 s
> = note : available fields are: `sampling_channel_id`, `sampling_channel_edge_ids`
61.08 s
>
61.08 s
> error[E0609] : no field `lmb_channel_edge_ids` on type `CutInfo`
61.08 s
> --> tests/tests/test_evaluation_api.rs:311:10
61.08 s
> |
61.08 s
> 311 | .lmb_channel_edge_ids
61.08 s
> | ^^^^^^^^^^^^^^^^^^^^ unknown field
61.08 s
> |
61.08 s
> = note : available fields are: `particle_pdgs`, `cut_id`, `graph_id`, `graph_group_id`, `orientation_id` ... and 2 others
61.08 s
>
61.08 s
> error[E0609] : no field `lmb_channel_edge_ids` on type `CutInfo`
61.08 s
> --> tests/tests/test_evaluation_api.rs:591:26
61.08 s
> |
61.08 s
> 591 | .lmb_channel_edge_ids
61.08 s
> | ^^^^^^^^^^^^^^^^^^^^ unknown field
61.08 s
> |
61.08 s
> = note : available fields are: `particle_pdgs`, `cut_id`, `graph_id`, `graph_group_id`, `orientation_id` ... and 2 others
61.08 s
>
61.08 s
> For more information about this error, try `rustc --explain E0560`.
61.08 s
> error : could not compile `gammaloop-integration-tests` (test "test_differential") due to 2 previous errors
61.08 s
> warning : build failed, waiting for other jobs to finish...
61.08 s
> error[E0609] : no field `lmb_channel_edge_ids` on type `CutInfo`
61.08 s
> --> tests/tests/test_evaluation_api.rs:1177:18
61.08 s
> |
61.08 s
> 1177 | .lmb_channel_edge_ids
61.08 s
> | ^^^^^^^^^^^^^^^^^^^^ unknown field
61.08 s
> |
61.08 s
> = note : available fields are: `particle_pdgs`, `cut_id`, `graph_id`, `graph_group_id`, `orientation_id` ... and 2 others
61.08 s
>
61.08 s
> error[E0609] : no field `lmb_channel_edge_ids` on type `CutInfo`
61.08 s
> --> tests/tests/test_evaluation_api.rs:1222:22
61.08 s
> |
61.08 s
> 1222 | .lmb_channel_edge_ids
61.08 s
> | ^^^^^^^^^^^^^^^^^^^^ unknown field
61.08 s
> |
61.08 s
> = note : available fields are: `particle_pdgs`, `cut_id`, `graph_id`, `graph_group_id`, `orientation_id` ... and 2 others
61.08 s
>
61.08 s
> error[E0609] : no field `lmb_channel_edge_ids` on type `CutInfo`
61.08 s
> --> tests/tests/test_evaluation_api.rs:1281:14
61.08 s
> |
61.08 s
> 1281 | .lmb_channel_edge_ids
61.08 s
> | ^^^^^^^^^^^^^^^^^^^^ unknown field
61.08 s
> |
61.08 s
> = note : available fields are: `particle_pdgs`, `cut_id`, `graph_id`, `graph_group_id`, `orientation_id` ... and 2 others
61.08 s
>
61.08 s
> error[E0609] : no field `lmb_channel_edge_ids` on type `CutInfo`
61.08 s
> --> tests/tests/test_evaluation_api.rs:1428:18
61.08 s
> |
61.08 s
> 1428 | .lmb_channel_edge_ids
61.08 s
> | ^^^^^^^^^^^^^^^^^^^^ unknown field
61.08 s
> |
61.08 s
> = note : available fields are: `particle_pdgs`, `cut_id`, `graph_id`, `graph_group_id`, `orientation_id` ... and 2 others
61.08 s
>
61.08 s
> For more information about this error, try `rustc --explain E0609`.
61.08 s
> error : could not compile `gammaloop-integration-tests` (test "test_evaluation_api") due to 6 previous errors
61.08 s
> error[E0609] : no field `lmb_channel_id` on type `CutInfo`
61.08 s
> --> tests/tests/test_runs/utils.rs:568:36
61.08 s
> |
61.08 s
> 568 | event.cut_info.lmb_channel_id,
61.08 s
> | ^^^^^^^^^^^^^^ unknown field
61.08 s
> |
61.08 s
> = note : available fields are: `particle_pdgs`, `cut_id`, `graph_id`, `graph_group_id`, `orientation_id` ... and 2 others
61.08 s
>
61.08 s
> error[E0609] : no field `lmb_channel_id` on type `CutInfo`
61.08 s
> --> tests/tests/test_runs/utils.rs:580:36
61.08 s
> |
61.08 s
> 580 | event.cut_info.lmb_channel_id,
61.08 s
> | ^^^^^^^^^^^^^^ unknown field
61.08 s
> |
61.08 s
> = note : available fields are: `particle_pdgs`, `cut_id`, `graph_id`, `graph_group_id`, `orientation_id` ... and 2 others
61.08 s
>
61.08 s
> error : could not compile `gammaloop-integration-tests` (test "test_runs") due to 2 previous errors
61.08 s
For full logs, run:
61.08 s
nix log /nix/store/zh33vvdkbhlrp41mhi2kklvb40mlk2lw-gammaloop-crate-test-binaries-gammaloop-integration-tests-b8cda0d438c96d4f-deps-0.1.0.drv
61.08 s
error: Cannot build '/nix/store/carn0p0z8gn4dah4yipq2b5626fi4887-nix-ci-artifact-barrier-crate-test-binaries-gammaloop-integration-tests.drv '.
61.08 s
Reason: 1 dependency failed .
61.08 s
Output paths:
61.08 s
/nix/store/shf9h8iafpj309z50m7r4s3ywf4c033q-nix-ci-artifact-barrier-crate-test-binaries-gammaloop-integration-tests
61.09 s
Build failed due to failed dependency
61.13 s
Build failed.