1. 0.00 s $ /nix/store/9ypz3flqsrl5xl495mm8h645gadjsxi1-coreutils-9.11/bin/timeout --kill-after=15s 7200s /nix/store/23zk8sgzamrbmj1fday15szf7f2279s8-nix-2.34.7/bin/nix --extra-experimental-features nix-command --extra-experimental-features flakes --log-format internal-json build --no-link --print-out-paths git+https://github.com/alphal00p/gammaloop?ref=advanced_sampling&rev=17cab6f72c1df1d8c1446d47281e0e8c60d52e8b&shallow=1#checks.x86_64-linux.gammaloop-check --print-build-logs
  2. 0.14 s
  3. 0.43 s Building /nix/store/ws66y79brahbksfmnksfcdd9g1qvcyzb-gammaloop-workspace-check-0.1.0.drv
  4. 0.54 s [gammaloop-workspace-check] Phase: unpackPhase
  5. 0.54 s [gammaloop-workspace-check] unpacking source archive /nix/store/ypmxspggpi4qfj1zy7ml6kwz1d0c3m10-source
  6. 0.99 s [gammaloop-workspace-check] source root is source
  7. 1.03 s [gammaloop-workspace-check] Phase: patchPhase
  8. 1.04 s [gammaloop-workspace-check] Executing configureCargoCommonVars
  9. 1.04 s [gammaloop-workspace-check] decompressing cargo artifacts from /nix/store/50vpxlcgfxf2d57i27v3d10zjwxxbm2r-gammaloop-workspace-deps-deps-0.1.0/target.tar.zst to target
  10. 2.45 s [gammaloop-workspace-check] Phase: updateAutotoolsGnuConfigScriptsPhase
  11. 2.50 s [gammaloop-workspace-check] Phase: configurePhase
  12. 2.50 s [gammaloop-workspace-check] will append /build/source/.cargo-home/config.toml with contents of /nix/store/5drf77x6km4ky7gwlrzdx9bbd6fz09g3-vendor-cargo-deps/config.toml
  13. 2.51 s [gammaloop-workspace-check] default configurePhase, nothing to do
  14. 2.51 s [gammaloop-workspace-check] Phase: buildPhase
  15. 2.52 s [gammaloop-workspace-check] +++ command cargo --version
  16. 2.52 s [gammaloop-workspace-check] cargo 1.97.0 (c980f4866 2026-06-30)
  17. 2.57 s [gammaloop-workspace-check] +++ command cargo check --profile ci-optim --locked --workspace --features gammaloop-tracing-filter/clap,gammaloop-tracing-filter/symbolica,idenso/bincode,idenso/reference-cases,linnet/bincode,linnet/drawing,linnet/rkyv,linnet/serde,linnet/symbolica,spenso-macros/shadowing,spenso/shadowing,symbolica/tracing_max_level_info,three-dimensional-reps/display,three-dimensional-reps/eval,three-dimensional-reps/serde --all-targets
  18. 3.17 s [gammaloop-workspace-check] Checking cfg-if v1.0.4
  19. 3.17 s [gammaloop-workspace-check] Checking memchr v2.8.0
  20. 3.17 s [gammaloop-workspace-check] Checking once_cell v1.21.4
  21. 3.19 s [gammaloop-workspace-check] Checking either v1.15.0
  22. 3.20 s [gammaloop-workspace-check] Checking serde_core v1.0.228
  23. 3.20 s [gammaloop-workspace-check] Checking libc v0.2.186
  24. 3.20 s [gammaloop-workspace-check] Checking libm v0.2.16
  25. 3.21 s [gammaloop-workspace-check] Checking itoa v1.0.18
  26. 3.23 s [gammaloop-workspace-check] Checking log v0.4.29
  27. 3.23 s [gammaloop-workspace-check] Checking regex-syntax v0.8.10
  28. 3.25 s [gammaloop-workspace-check] Checking zerocopy v0.8.48
  29. 3.25 s [gammaloop-workspace-check] Checking crossbeam-utils v0.8.21
  30. 3.27 s [gammaloop-workspace-check] Checking equivalent v1.0.2
  31. 3.28 s [gammaloop-workspace-check] Checking zmij v1.0.21
  32. 3.28 s [gammaloop-workspace-check] Checking bytemuck v1.25.0
  33. 3.29 s [gammaloop-workspace-check] Checking lazy_static v1.5.0
  34. 3.29 s [gammaloop-workspace-check] Compiling target-lexicon v0.13.5
  35. 3.33 s [gammaloop-workspace-check] Checking arrayvec v0.7.6
  36. 3.36 s [gammaloop-workspace-check] Checking powerfmt v0.2.0
  37. 3.37 s [gammaloop-workspace-check] Checking num-conv v0.2.1
  38. 3.37 s [gammaloop-workspace-check] Checking pin-project-lite v0.2.17
  39. 3.40 s [gammaloop-workspace-check] Checking itertools v0.14.0
  40. 3.43 s [gammaloop-workspace-check] Checking num_threads v0.1.7
  41. 3.44 s [gammaloop-workspace-check] Checking time-core v0.1.8
  42. 3.48 s [gammaloop-workspace-check] Checking tracing-core v0.1.36
  43. 3.49 s [gammaloop-workspace-check] Checking safe_arch v0.7.4
  44. 3.52 s [gammaloop-workspace-check] Checking foldhash v0.2.0
  45. 3.53 s [gammaloop-workspace-check] Checking deranged v0.5.8
  46. 3.54 s [gammaloop-workspace-check] Checking allocator-api2 v0.2.21
  47. 3.57 s [gammaloop-workspace-check] Checking const-random v0.1.18
  48. 3.60 s [gammaloop-workspace-check] Checking winnow v1.0.2
  49. 3.62 s [gammaloop-workspace-check] Checking nu-ansi-term v0.50.3
  50. 3.65 s [gammaloop-workspace-check] Checking static_assertions v1.1.0
  51. 3.70 s [gammaloop-workspace-check] Checking unty v0.0.4
  52. 3.74 s [gammaloop-workspace-check] Checking crossbeam-epoch v0.9.18
  53. 3.76 s [gammaloop-workspace-check] Checking aho-corasick v1.1.4
  54. 3.79 s [gammaloop-workspace-check] Checking safe_arch v1.0.0
  55. 3.85 s [gammaloop-workspace-check] Checking wide v0.7.33
  56. 3.90 s [gammaloop-workspace-check] Checking sharded-slab v0.1.7
  57. 3.93 s [gammaloop-workspace-check] Checking hashbrown v0.16.1
  58. 3.97 s [gammaloop-workspace-check] Checking tracing v0.1.44
  59. 4.02 s [gammaloop-workspace-check] Checking crossbeam-deque v0.8.6
  60. 4.18 s [gammaloop-workspace-check] Checking tracing-log v0.2.0
  61. 4.22 s [gammaloop-workspace-check] Checking rayon-core v1.13.0
  62. 4.23 s [gammaloop-workspace-check] Checking thread_local v1.1.9
  63. 4.33 s [gammaloop-workspace-check] Checking indenter v0.3.4
  64. 4.39 s [gammaloop-workspace-check] Checking az v1.3.0
  65. 4.42 s [gammaloop-workspace-check] Checking toml_writer v1.1.1+spec-1.1.0
  66. 4.43 s [gammaloop-workspace-check] Checking wide v1.3.0
  67. 4.54 s [gammaloop-workspace-check] Checking num-traits v0.2.19
  68. 4.57 s [gammaloop-workspace-check] Compiling phf_shared v0.11.3
  69. 4.60 s [gammaloop-workspace-check] Checking anyhow v1.0.102
  70. 4.65 s [gammaloop-workspace-check] Checking rayon v1.12.0
  71. 4.79 s [gammaloop-workspace-check] Checking utf8parse v0.2.2
  72. 4.87 s [gammaloop-workspace-check] Checking rawpointer v0.2.1
  73. 4.88 s [gammaloop-workspace-check] Checking alloc-no-stdlib v2.0.4
  74. 4.93 s [gammaloop-workspace-check] Checking toml_parser v1.1.2+spec-1.1.0
  75. 4.94 s [gammaloop-workspace-check] Checking dyn-clone v1.0.20
  76. 4.97 s [gammaloop-workspace-check] Checking alloc-stdlib v0.2.2
  77. 4.97 s [gammaloop-workspace-check] Checking matrixmultiply v0.3.10
  78. 4.97 s [gammaloop-workspace-check] Checking anstyle-parse v1.0.0
  79. 5.02 s [gammaloop-workspace-check] Checking colorchoice v1.0.5
  80. 5.04 s [gammaloop-workspace-check] Checking is_terminal_polyfill v1.70.2
  81. 5.08 s [gammaloop-workspace-check] Checking anstyle v1.0.14
  82. 5.11 s [gammaloop-workspace-check] Checking colored v3.1.1
  83. 5.13 s [gammaloop-workspace-check] Checking anstyle-query v1.1.5
  84. 5.15 s [gammaloop-workspace-check] Compiling phf_generator v0.11.3
  85. 5.17 s [gammaloop-workspace-check] Checking getrandom v0.3.4
  86. 5.22 s [gammaloop-workspace-check] Checking time v0.3.47
  87. 5.28 s [gammaloop-workspace-check] Compiling pyo3-build-config v0.28.3
  88. 5.30 s [gammaloop-workspace-check] Checking gmp-mpfr-sys v1.7.1
  89. 5.35 s [gammaloop-workspace-check] Checking rand_core v0.9.5
  90. 5.37 s [gammaloop-workspace-check] Checking regex-automata v0.4.14
  91. 5.40 s [gammaloop-workspace-check] Checking anstream v1.0.0
  92. 5.44 s [gammaloop-workspace-check] Checking approx v0.5.1
  93. 5.45 s [gammaloop-workspace-check] Checking num-integer v0.1.46
  94. 5.49 s [gammaloop-workspace-check] Checking eyre v0.6.12
  95. 5.55 s [gammaloop-workspace-check] Checking unicode-width v0.2.2
  96. 5.56 s [gammaloop-workspace-check] Checking bitflags v1.3.2
  97. 5.58 s [gammaloop-workspace-check] Checking serde v1.0.228
  98. 5.61 s [gammaloop-workspace-check] Checking serde_json v1.0.149
  99. 5.63 s [gammaloop-workspace-check] Checking bitflags v2.11.1
  100. 5.64 s [gammaloop-workspace-check] Checking serde_spanned v1.1.1
  101. 5.66 s [gammaloop-workspace-check] Checking toml_datetime v1.1.1+spec-1.1.0
  102. 5.67 s [gammaloop-workspace-check] Compiling phf_codegen v0.11.3
  103. 5.70 s [gammaloop-workspace-check] Checking region v3.0.2
  104. 5.72 s [gammaloop-workspace-check] Checking wasmtime-jit-icache-coherence v34.0.2
  105. 5.76 s [gammaloop-workspace-check] Checking hugepage-rs v0.1.1
  106. 5.77 s [gammaloop-workspace-check] Checking brotli-decompressor v5.0.0
  107. 5.80 s [gammaloop-workspace-check] Checking inventory v0.3.24
  108. 5.83 s [gammaloop-workspace-check] Checking spec_math v0.1.6
  109. 5.84 s [gammaloop-workspace-check] Checking thiserror v2.0.18
  110. 5.85 s [gammaloop-workspace-check] Compiling getopts v0.2.24
  111. 5.89 s [gammaloop-workspace-check] Checking libloading v0.9.0
  112. 5.90 s [gammaloop-workspace-check] Checking toml v1.1.2+spec-1.1.0
  113. 5.90 s [gammaloop-workspace-check] Checking bytes v1.11.1
  114. 5.92 s [gammaloop-workspace-check] Checking byteorder v1.5.0
  115. 5.98 s [gammaloop-workspace-check] Checking append-only-vec v0.1.8
  116. 6.07 s [gammaloop-workspace-check] Checking tinyjson v2.5.1
  117. 6.10 s [gammaloop-workspace-check] Checking self_cell v1.2.2
  118. 6.17 s [gammaloop-workspace-check] Compiling unicode_names2_generator v1.3.0
  119. 6.19 s [gammaloop-workspace-check] Compiling unic-common v0.9.0
  120. 6.21 s [gammaloop-workspace-check] Checking smallvec v1.15.1
  121. 6.32 s [gammaloop-workspace-check] Checking num-complex v0.4.6
  122. 6.34 s [gammaloop-workspace-check] Checking tracing-serde v0.2.0
  123. 6.36 s [gammaloop-workspace-check] Checking bincode v2.0.1
  124. 6.46 s [gammaloop-workspace-check] Checking smartstring v1.0.1
  125. 6.51 s [gammaloop-workspace-check] Checking linux-raw-sys v0.12.1
  126. 6.64 s [gammaloop-workspace-check] Compiling unic-char-range v0.9.0
  127. 6.73 s [gammaloop-workspace-check] Compiling unic-char-property v0.9.0
  128. 6.79 s [gammaloop-workspace-check] Compiling unic-ucd-version v0.9.0
  129. 6.81 s [gammaloop-workspace-check] Compiling is-macro v0.3.7
  130. 6.83 s [gammaloop-workspace-check] Checking simba v0.9.1
  131. 6.86 s [gammaloop-workspace-check] Compiling rustpython-parser-vendored v0.4.0
  132. 6.88 s [gammaloop-workspace-check] Checking brotli v8.0.2
  133. 6.89 s [gammaloop-workspace-check] Checking iana-time-zone v0.1.65
  134. 6.90 s [gammaloop-workspace-check] Compiling rustpython-parser v0.4.0
  135. 7.03 s [gammaloop-workspace-check] Checking chrono v0.4.44
  136. 7.04 s [gammaloop-workspace-check] Checking rustix v1.1.4
  137. 7.07 s [gammaloop-workspace-check] Compiling phf v0.11.3
  138. 7.14 s [gammaloop-workspace-check] Checking rustc-hash v2.1.2
  139. 7.17 s [gammaloop-workspace-check] Compiling unic-ucd-ident v0.9.0
  140. 7.27 s [gammaloop-workspace-check] Compiling unic-emoji-char v0.9.0
  141. 7.29 s [gammaloop-workspace-check] Checking ndarray v0.17.2
  142. 7.31 s [gammaloop-workspace-check] Compiling rustc-hash v1.1.0
  143. 7.33 s [gammaloop-workspace-check] Compiling lalrpop-util v0.20.2
  144. 7.38 s [gammaloop-workspace-check] Checking rug v1.30.0
  145. 7.46 s [gammaloop-workspace-check] Checking unicode-segmentation v1.13.2
  146. 7.48 s [gammaloop-workspace-check] Compiling symbolica v2.2.0 (https://github.com/alphal00p/symbolica?rev=a277a8dadbaae5a8d6605f2f381991a601e1f345#a277a8da)
  147. 7.65 s [gammaloop-workspace-check] Checking typenum v1.20.0
  148. 7.69 s [gammaloop-workspace-check] Checking getrandom v0.2.17
  149. 8.06 s [gammaloop-workspace-check] Checking scopeguard v1.2.0
  150. 8.09 s [gammaloop-workspace-check] Checking parking_lot_core v0.9.12
  151. 8.16 s [gammaloop-workspace-check] Checking unicode-ident v1.0.24
  152. 8.17 s [gammaloop-workspace-check] Checking lock_api v0.4.14
  153. 8.25 s [gammaloop-workspace-check] Checking hashbrown v0.17.0
  154. 8.30 s [gammaloop-workspace-check] Checking ppv-lite86 v0.2.21
  155. 8.40 s [gammaloop-workspace-check] Checking ahash v0.8.12
  156. 8.45 s [gammaloop-workspace-check] Checking parking_lot v0.12.5
  157. 8.58 s [gammaloop-workspace-check] Checking errno v0.3.14
  158. 8.67 s [gammaloop-workspace-check] Checking clap_lex v1.1.0
  159. 8.69 s [gammaloop-workspace-check] Checking generic-array v0.14.7
  160. 8.72 s [gammaloop-workspace-check] Checking rand_chacha v0.9.0
  161. 8.75 s [gammaloop-workspace-check] Checking unicase v2.9.0
  162. 8.85 s [gammaloop-workspace-check] Checking strsim v0.11.1
  163. 8.86 s [gammaloop-workspace-check] Checking signal-hook-registry v1.4.8
  164. 8.87 s [gammaloop-workspace-check] Checking vte v0.14.1
  165. 8.90 s [gammaloop-workspace-check] Checking same-file v1.0.6
  166. 8.98 s [gammaloop-workspace-check] Checking rand v0.9.4
  167. 9.05 s [gammaloop-workspace-check] Checking matchers v0.2.0
  168. 9.06 s [gammaloop-workspace-check] Checking regex v1.12.3
  169. 9.10 s [gammaloop-workspace-check] Checking signal-hook v0.3.18
  170. 9.10 s [gammaloop-workspace-check] Checking indexmap v2.14.0
  171. 9.14 s [gammaloop-workspace-check] Checking walkdir v2.5.0
  172. 9.18 s [gammaloop-workspace-check] Checking tracing-subscriber v0.3.23
  173. 9.29 s [gammaloop-workspace-check] Checking crypto-common v0.1.7
  174. 9.37 s [gammaloop-workspace-check] Checking block-buffer v0.10.4
  175. 9.38 s [gammaloop-workspace-check] Checking half v2.7.1
  176. 9.49 s [gammaloop-workspace-check] Checking mio v1.2.0
  177. 9.55 s [gammaloop-workspace-check] Checking terminal_size v0.4.4
  178. 9.55 s [gammaloop-workspace-check] Checking ciborium-io v0.2.2
  179. 9.58 s [gammaloop-workspace-check] Checking minimal-lexical v0.2.1
  180. 9.64 s [gammaloop-workspace-check] Checking digest v0.10.7
  181. 9.67 s [gammaloop-workspace-check] Checking symjit v2.21.0
  182. 9.71 s [gammaloop-workspace-check] Checking clap_builder v4.6.0
  183. 9.80 s [gammaloop-workspace-check] Checking ciborium-ll v0.2.2
  184. 9.82 s [gammaloop-workspace-check] Checking derive_more v2.1.1
  185. 9.86 s [gammaloop-workspace-check] Checking nom v7.1.3
  186. 9.91 s [gammaloop-workspace-check] Checking num-bigint v0.4.6
  187. 10.00 s [gammaloop-workspace-check] Checking signal-hook-mio v0.2.5
  188. 10.01 s [gammaloop-workspace-check] Checking console v0.16.3
  189. 10.04 s [gammaloop-workspace-check] Checking bstr v1.12.1
  190. 10.08 s [gammaloop-workspace-check] Checking winnow v0.7.15
  191. 10.46 s [gammaloop-workspace-check] Checking cpufeatures v0.2.17
  192. 10.53 s [gammaloop-workspace-check] Checking linux-raw-sys v0.4.15
  193. 10.55 s [gammaloop-workspace-check] Checking globset v0.4.18
  194. 10.78 s [gammaloop-workspace-check] Compiling unicode_names2 v1.3.0
  195. 10.91 s [gammaloop-workspace-check] Checking sha2 v0.10.9
  196. 10.99 s [gammaloop-workspace-check] Checking rustix v0.38.44
  197. 11.06 s [gammaloop-workspace-check] Checking ciborium v0.2.2
  198. 11.13 s [gammaloop-workspace-check] Checking getrandom v0.4.2
  199. 11.31 s [gammaloop-workspace-check] Checking rand_core v0.6.4
  200. 11.35 s [gammaloop-workspace-check] Checking fastrand v2.4.1
  201. 11.37 s [gammaloop-workspace-check] Checking plotters-backend v0.3.7
  202. 11.48 s [gammaloop-workspace-check] Checking fnv v1.0.7
  203. 11.51 s [gammaloop-workspace-check] Checking rust-embed-utils v8.11.0
  204. 11.56 s [gammaloop-workspace-check] Checking tempfile v3.27.0
  205. 11.56 s [gammaloop-workspace-check] Checking serde_spanned v0.6.9
  206. 11.65 s [gammaloop-workspace-check] Checking toml_datetime v0.6.11
  207. 11.68 s [gammaloop-workspace-check] Checking ansitok v0.3.0
  208. 11.72 s [gammaloop-workspace-check] Checking itertools v0.10.5
  209. 11.73 s [gammaloop-workspace-check] Checking toml_write v0.1.2
  210. 11.75 s [gammaloop-workspace-check] Checking plotters-svg v0.3.7
  211. 11.85 s [gammaloop-workspace-check] Checking tap v1.0.1
  212. 11.88 s [gammaloop-workspace-check] Checking crossterm v0.28.1
  213. 11.89 s [gammaloop-workspace-check] Checking cast v0.3.0
  214. 11.90 s [gammaloop-workspace-check] Checking plotters v0.3.7
  215. 11.92 s [gammaloop-workspace-check] Checking rand_chacha v0.3.1
  216. 11.93 s [gammaloop-workspace-check] Checking toml_edit v0.22.27
  217. 11.96 s [gammaloop-workspace-check] Checking wyz v0.5.1
  218. 11.98 s [gammaloop-workspace-check] Checking clap v4.6.1
  219. 12.06 s [gammaloop-workspace-check] Checking radium v0.7.0
  220. 12.06 s [gammaloop-workspace-check] Checking typeid v1.0.3
  221. 12.11 s [gammaloop-workspace-check] Checking ansi-str v0.9.0
  222. 12.13 s [gammaloop-workspace-check] Checking xprec v0.2.2
  223. 12.13 s [gammaloop-workspace-check] Checking similar v2.7.0
  224. 12.15 s [gammaloop-workspace-check] Checking tinytemplate v1.2.1
  225. 12.16 s [gammaloop-workspace-check] Checking is-terminal v0.4.17
  226. 12.25 s [gammaloop-workspace-check] Checking funty v2.0.0
  227. 12.28 s [gammaloop-workspace-check] Checking anes v0.1.6
  228. 12.43 s [gammaloop-workspace-check] Checking bytecount v0.6.9
  229. 12.46 s [gammaloop-workspace-check] Checking oorandom v11.1.5
  230. 12.48 s [gammaloop-workspace-check] Checking ron v0.12.1
  231. 12.52 s [gammaloop-workspace-check] Checking papergrid v0.17.0
  232. 12.53 s [gammaloop-workspace-check] Checking rand v0.8.6
  233. 12.59 s [gammaloop-workspace-check] Checking testing_table v0.3.0
  234. 12.68 s [gammaloop-workspace-check] Checking toml_edit v0.25.11+spec-1.1.0
  235. 12.74 s [gammaloop-workspace-check] Checking env_filter v1.0.1
  236. 12.84 s [gammaloop-workspace-check] Checking bitvec v1.0.1
  237. 12.91 s [gammaloop-workspace-check] Compiling pyo3-ffi v0.28.3
  238. 12.93 s [gammaloop-workspace-check] Compiling pyo3-macros-backend v0.28.3
  239. 13.10 s [gammaloop-workspace-check] Compiling pyo3 v0.28.3
  240. 13.12 s [gammaloop-workspace-check] Compiling numpy v0.28.0
  241. 13.16 s [gammaloop-workspace-check] Checking criterion-plot v0.5.0
  242. 13.28 s [gammaloop-workspace-check] Checking uncased v0.9.10
  243. 13.35 s [gammaloop-workspace-check] Checking jiff v0.2.24
  244. 13.42 s [gammaloop-workspace-check] Checking ptr_meta v0.1.4
  245. 13.51 s [gammaloop-workspace-check] Checking criterion v0.5.1
  246. 13.52 s [gammaloop-workspace-check] Checking simdutf8 v0.1.5
  247. 13.53 s [gammaloop-workspace-check] Checking ucd-trie v0.1.7
  248. 13.57 s [gammaloop-workspace-check] Checking ahash v0.7.8
  249. 13.69 s [gammaloop-workspace-check] Checking bytecheck v0.6.12
  250. 13.70 s [gammaloop-workspace-check] Checking pest v2.8.6
  251. 13.75 s [gammaloop-workspace-check] Checking approx v0.4.0
  252. 13.76 s [gammaloop-workspace-check] Checking tabled v0.20.0
  253. 13.78 s [gammaloop-workspace-check] Checking seahash v4.1.0
  254. 13.80 s [gammaloop-workspace-check] Checking hashbrown v0.12.3
  255. 13.87 s [gammaloop-workspace-check] Checking cgmath v0.18.0
  256. 13.90 s [gammaloop-workspace-check] Checking num-rational v0.4.2
  257. 13.93 s [gammaloop-workspace-check] Checking num-iter v0.1.45
  258. 13.96 s [gammaloop-workspace-check] Checking insta v1.47.2
  259. 14.01 s [gammaloop-workspace-check] Checking ref-ops v0.2.5
  260. 14.04 s [gammaloop-workspace-check] Checking toml v0.8.23
  261. 14.13 s [gammaloop-workspace-check] Checking rend v0.4.2
  262. 14.14 s [gammaloop-workspace-check] Checking rand_xoshiro v0.6.0
  263. 14.32 s [gammaloop-workspace-check] Checking num v0.4.3
  264. 14.37 s [gammaloop-workspace-check] Checking features v0.10.0
  265. 14.39 s [gammaloop-workspace-check] Checking constcat v0.5.1
  266. 14.43 s [gammaloop-workspace-check] Checking gat-lending-iterator v0.1.8
  267. 14.44 s [gammaloop-workspace-check] Checking colored v2.2.0
  268. 14.46 s [gammaloop-workspace-check] Checking constant_time_eq v0.4.2
  269. 14.56 s [gammaloop-workspace-check] Checking figment v0.10.19
  270. 14.59 s [gammaloop-workspace-check] Checking arrayref v0.3.9
  271. 14.67 s [gammaloop-workspace-check] Checking cpufeatures v0.3.0
  272. 14.69 s [gammaloop-workspace-check] Checking base64 v0.22.1
  273. 14.72 s [gammaloop-workspace-check] Checking joinery v2.1.0
  274. 14.73 s [gammaloop-workspace-check] Checking blake3 v1.8.5
  275. 14.88 s [gammaloop-workspace-check] Checking siphasher v1.0.2
  276. 15.00 s [gammaloop-workspace-check] Checking titlecase v2.2.1
  277. 15.14 s [gammaloop-workspace-check] Checking phf_shared v0.13.1
  278. 15.16 s [gammaloop-workspace-check] Checking subprocess v0.2.15
  279. 15.20 s [gammaloop-workspace-check] Checking dot-parser v0.5.1
  280. 15.22 s [gammaloop-workspace-check] Checking rust_lisp v0.18.0
  281. 15.23 s [gammaloop-workspace-check] Compiling vakint v0.1.2 (/build/source/crates/vakint)
  282. 15.26 s [gammaloop-workspace-check] Checking version-compare v0.2.1
  283. 15.37 s [gammaloop-workspace-check] Checking phf v0.13.1
  284. 15.45 s [gammaloop-workspace-check] Checking xpct v0.5.1
  285. 15.52 s [gammaloop-workspace-check] Checking ryu v1.0.23
  286. 15.57 s [gammaloop-workspace-check] Checking castaway v0.2.4
  287. 15.65 s [gammaloop-workspace-check] Checking toml_datetime v0.7.5+spec-1.1.0
  288. 15.66 s [gammaloop-workspace-check] Checking strum v0.27.2
  289. 15.68 s [gammaloop-workspace-check] Checking unicode-truncate v2.0.1
  290. 15.68 s [gammaloop-workspace-check] Checking compact_str v0.9.0
  291. 15.71 s [gammaloop-workspace-check] Checking kasuari v0.4.12
  292. 15.75 s [gammaloop-workspace-check] Checking lru v0.16.4
  293. 15.77 s [gammaloop-workspace-check] Checking string-template-plus v0.4.3
  294. 15.82 s [gammaloop-workspace-check] Checking vte v0.15.0
  295. 15.86 s [gammaloop-workspace-check] Checking toml v0.9.12+spec-1.1.0
  296. 15.86 s [gammaloop-workspace-check] Checking portable-atomic v1.13.1
  297. 15.91 s [gammaloop-workspace-check] Checking unit-prefix v0.5.2
  298. 15.95 s [gammaloop-workspace-check] Checking rand_distr v0.4.3
  299. 15.97 s [gammaloop-workspace-check] Checking simba v0.6.0
  300. 15.99 s [gammaloop-workspace-check] Checking vt100 v0.16.2
  301. 16.00 s [gammaloop-workspace-check] Checking line-clipping v0.3.7
  302. 16.02 s [gammaloop-workspace-check] Checking adler2 v2.0.1
  303. 16.12 s [gammaloop-workspace-check] Checking gimli v0.32.3
  304. 16.15 s [gammaloop-workspace-check] Compiling three-dimensional-reps v0.1.0 (/build/source/crates/three-dimensional-reps)
  305. 16.19 s [gammaloop-workspace-check] Checking miniz_oxide v0.8.9
  306. 16.23 s [gammaloop-workspace-check] Checking ratatui-core v0.1.0
  307. 16.28 s [gammaloop-workspace-check] Checking thiserror v1.0.69
  308. 16.34 s [gammaloop-workspace-check] Checking derive_builder v0.11.2
  309. 16.36 s [gammaloop-workspace-check] Checking object v0.37.3
  310. 16.37 s [gammaloop-workspace-check] Compiling rustpython-parser-core v0.4.0
  311. 16.37 s [gammaloop-workspace-check] Checking crossterm v0.29.0
  312. 16.42 s [gammaloop-workspace-check] Checking owo-colors v4.3.0
  313. 16.45 s [gammaloop-workspace-check] Checking tracing-error v0.2.1
  314. 16.48 s [gammaloop-workspace-check] Checking indicatif v0.18.4
  315. 16.49 s [gammaloop-workspace-check] Checking typed-index-collections v3.5.0
  316. 16.51 s [gammaloop-workspace-check] Checking serde-big-array v0.5.1
  317. 16.60 s [gammaloop-workspace-check] Compiling rustpython-ast v0.4.0
  318. 16.66 s [gammaloop-workspace-check] Checking amd v0.2.2
  319. 16.71 s [gammaloop-workspace-check] Checking itertools v0.11.0
  320. 16.90 s [gammaloop-workspace-check] Compiling gammaloop-tracing-filter-macros v0.1.0 (/build/source/crates/gammaloop-tracing-filter-macros)
  321. 16.90 s [gammaloop-workspace-check] Checking rustc-demangle v0.1.27
  322. 16.97 s [gammaloop-workspace-check] Checking option-ext v0.2.0
  323. 17.03 s [gammaloop-workspace-check] Checking dirs-sys v0.5.0
  324. 17.14 s [gammaloop-workspace-check] Checking env_logger v0.11.10
  325. 17.18 s [gammaloop-workspace-check] Checking ref-cast v1.0.25
  326. 17.20 s [gammaloop-workspace-check] Checking nix v0.31.2
  327. 17.23 s [gammaloop-workspace-check] Checking integer-sqrt v0.1.5
  328. 17.26 s [gammaloop-workspace-check] Checking brotli-decompressor v4.0.3
  329. 17.28 s [gammaloop-workspace-check] Checking crossbeam-channel v0.5.15
  330. 17.31 s [gammaloop-workspace-check] Checking itertools v0.12.1
  331. 17.33 s [gammaloop-workspace-check] Checking symlink v0.1.0
  332. 17.35 s [gammaloop-workspace-check] Checking color-spantrace v0.3.0
  333. 17.40 s [gammaloop-workspace-check] Compiling gammalooprs v0.3.4 (/build/source/crates/gammalooprs)
  334. 17.42 s [gammaloop-workspace-check] Checking unsafe-libyaml v0.2.11
  335. 17.47 s [gammaloop-workspace-check] Checking ratatui-widgets v0.3.0
  336. 17.52 s [gammaloop-workspace-check] Checking ratatui-crossterm v0.1.0
  337. 17.60 s [gammaloop-workspace-check] Checking rkyv v0.7.46
  338. 17.72 s [gammaloop-workspace-check] Checking include_dir v0.7.4
  339. 17.75 s [gammaloop-workspace-check] Checking tracing-appender v0.2.5
  340. 17.76 s [gammaloop-workspace-check] Checking pathfinding v4.15.0
  341. 17.83 s [gammaloop-workspace-check] Checking schemars v1.2.1
  342. 17.92 s [gammaloop-workspace-check] Checking ctrlc v3.5.2
  343. 18.00 s [gammaloop-workspace-check] Checking dirs v6.0.0
  344. 18.03 s [gammaloop-workspace-check] Checking clarabel v0.11.1
  345. 18.03 s [gammaloop-workspace-check] Checking slotmap v1.1.1
  346. 18.09 s [gammaloop-workspace-check] Checking tracing-indicatif v0.3.14
  347. 18.26 s [gammaloop-workspace-check] Checking brotli v7.0.0
  348. 18.33 s [gammaloop-workspace-check] Checking json5 v0.4.1
  349. 18.38 s [gammaloop-workspace-check] Checking serde_yaml v0.9.34+deprecated
  350. 18.40 s [gammaloop-workspace-check] Checking vectorize v0.2.0
  351. 18.55 s [gammaloop-workspace-check] Checking addr2line v0.25.1
  352. 18.73 s [gammaloop-workspace-check] Checking base62 v2.2.4
  353. 18.76 s [gammaloop-workspace-check] Checking ringbuffer v0.16.0
  354. 18.77 s [gammaloop-workspace-check] Checking ratatui-macros v0.7.0
  355. 18.79 s [gammaloop-workspace-check] Checking rust-embed v8.11.0
  356. 18.81 s [gammaloop-workspace-check] Checking clap_complete v4.6.3
  357. 18.85 s [gammaloop-workspace-check] Checking ratatui v0.30.0
  358. 18.87 s [gammaloop-workspace-check] Checking fd-lock v4.0.4
  359. 18.92 s [gammaloop-workspace-check] Checking strip-ansi-escapes v0.2.1
  360. 18.96 s [gammaloop-workspace-check] Compiling gammaloop-api v0.1.0 (/build/source/crates/gammaloop-api)
  361. 18.98 s [gammaloop-workspace-check] Checking itertools v0.13.0
  362. 19.01 s [gammaloop-workspace-check] Checking strum v0.26.3
  363. 19.03 s [gammaloop-workspace-check] Checking sysinfo v0.33.1
  364. 19.03 s [gammaloop-workspace-check] Checking shlex v1.3.0
  365. 19.12 s [gammaloop-workspace-check] Checking futures-task v0.3.32
  366. 19.19 s [gammaloop-workspace-check] Checking clap_complete_nushell v4.6.0
  367. 19.20 s [gammaloop-workspace-check] Checking slab v0.4.12
  368. 19.31 s [gammaloop-workspace-check] Checking futures-core v0.3.32
  369. 19.33 s [gammaloop-workspace-check] Checking sdd v3.0.10
  370. 19.42 s [gammaloop-workspace-check] Compiling gammaloop-integration-tests v0.1.0 (/build/source/tests)
  371. 19.49 s [gammaloop-workspace-check] Checking futures-util v0.3.32
  372. 19.52 s [gammaloop-workspace-check] Compiling test-log-core v0.2.20
  373. 19.62 s [gammaloop-workspace-check] Compiling numerica v2.2.0 (https://github.com/alphal00p/symbolica?rev=a277a8dadbaae5a8d6605f2f381991a601e1f345#a277a8da)
  374. 19.65 s [gammaloop-workspace-check] Checking scc v2.4.0
  375. 19.93 s [gammaloop-workspace-check] Compiling rustc_version v0.4.1
  376. 20.06 s [gammaloop-workspace-check] Checking which v8.0.2
  377. 20.07 s [gammaloop-workspace-check] Checking bincode v1.3.3
  378. 20.24 s [gammaloop-workspace-check] Checking backtrace v0.3.76
  379. 20.31 s [gammaloop-workspace-check] Compiling gungraun-runner v0.18.2
  380. 20.64 s [gammaloop-workspace-check] Checking reedline v0.42.0
  381. 20.69 s [gammaloop-workspace-check] Checking nalgebra v0.29.0
  382. 20.78 s [gammaloop-workspace-check] Checking color-eyre v0.6.5
  383. 20.88 s [gammaloop-workspace-check] Compiling gungraun-macros v0.8.0
  384. 21.01 s [gammaloop-workspace-check] Checking proc-macro2 v1.0.106
  385. 21.23 s [gammaloop-workspace-check] Checking base64 v0.21.7
  386. 21.26 s [gammaloop-workspace-check] Checking maplit v1.0.2
  387. 21.31 s [gammaloop-workspace-check] Compiling iai-callgrind-runner v0.14.2
  388. 21.51 s [gammaloop-workspace-check] Checking ron v0.8.1
  389. 21.52 s [gammaloop-workspace-check] Checking quote v1.0.45
  390. 21.62 s [gammaloop-workspace-check] Checking futures-executor v0.3.32
  391. 21.66 s [gammaloop-workspace-check] Checking kurbo v0.13.0
  392. 21.71 s [gammaloop-workspace-check] Checking wait-timeout v0.2.1
  393. 21.74 s [gammaloop-workspace-check] Checking serial_test v3.4.0
  394. 21.89 s [gammaloop-workspace-check] Checking quick-error v1.2.3
  395. 21.94 s [gammaloop-workspace-check] Checking bit-vec v0.8.0
  396. 22.00 s [gammaloop-workspace-check] Compiling iai-callgrind v0.14.2
  397. 22.01 s [gammaloop-workspace-check] Checking rusty-fork v0.3.1
  398. 22.02 s [gammaloop-workspace-check] Checking syn v2.0.117
  399. 22.19 s [gammaloop-workspace-check] Checking bit-set v0.8.0
  400. 22.30 s [gammaloop-workspace-check] Compiling test-log-macros v0.2.20
  401. 22.32 s [gammaloop-workspace-check] Compiling iai-callgrind-macros v0.5.1
  402. 22.33 s [gammaloop-workspace-check] Checking rand_xorshift v0.4.0
  403. 22.36 s [gammaloop-workspace-check] Checking console v0.15.11
  404. 22.43 s [gammaloop-workspace-check] Checking unarray v0.1.4
  405. 22.51 s [gammaloop-workspace-check] Checking pathdiff v0.2.3
  406. 22.58 s [gammaloop-workspace-check] Checking proptest v1.11.0
  407. 22.74 s [gammaloop-workspace-check] Checking similar-asserts v1.7.0
  408. 22.79 s [gammaloop-workspace-check] Checking kurvst v0.1.0 (/build/source/crates/kurvst)
  409. 23.25 s [gammaloop-workspace-check] Checking clinnet v0.1.8 (/build/source/crates/clinnet)
  410. 24.99 s [gammaloop-workspace-check] Compiling graphica v2.1.0 (https://github.com/alphal00p/symbolica?rev=a277a8dadbaae5a8d6605f2f381991a601e1f345#a277a8da)
  411. 25.23 s [gammaloop-workspace-check] Checking test-log v0.2.20
  412. 27.66 s [gammaloop-workspace-check] Checking statrs v0.16.1
  413. 28.37 s [gammaloop-workspace-check] Checking momtrop v0.3.0
  414. 28.88 s [gammaloop-workspace-check] Checking gungraun v0.18.2
  415. 31.53 s [gammaloop-workspace-check] Compiling pyo3-stub-gen-derive v0.17.2
  416. 31.76 s [gammaloop-workspace-check] Compiling pyo3-macros v0.28.3
  417. 37.82 s [gammaloop-workspace-check] Checking pyo3-stub-gen v0.17.2
  418. 46.01 s [gammaloop-workspace-check] Checking symbolica-utils v0.1.0 (/build/source/crates/symbolica-utils)
  419. 46.01 s [gammaloop-workspace-check] Checking spenso-macros v0.3.2 (/build/source/crates/spenso-macros)
  420. 217.38 s [gammaloop-workspace-check] Compiling gammaloop-workspace-hack v0.1.0 (/build/source/crates/gammaloop-workspace-hack)
  421. 217.59 s [gammaloop-workspace-check] Checking linnet v0.17.0 (/build/source/crates/linnet)
  422. 220.41 s [gammaloop-workspace-check] Checking spenso v0.6.0 (/build/source/crates/spenso)
  423. 220.56 s [gammaloop-workspace-check] Checking linnet-py v0.1.0 (/build/source/crates/linnet-py)
  424. 220.56 s [gammaloop-workspace-check] Checking linnest v0.1.0 (/build/source/crates/linnest)
  425. 225.78 s [gammaloop-workspace-check] Checking idenso v0.3.0 (/build/source/crates/idenso)
  426. 225.78 s [gammaloop-workspace-check] Checking gammaloop-tracing-filter v0.1.0 (/build/source/crates/gammaloop-tracing-filter)
  427. 227.38 s [gammaloop-workspace-check] Checking spenso-hep-lib v0.1.7 (/build/source/crates/spenso-hep-lib)
  428. 227.57 s [gammaloop-workspace-check] Checking spynso3 v0.1.2 (/build/source/crates/spynso3)
  429. 258.08 s [gammaloop-workspace-check] error[E0560]: struct `CutInfo` has no field named `lmb_channel_id`
  430. 258.08 s [gammaloop-workspace-check] --> tests/tests/test_differential.rs:86:13
  431. 258.08 s [gammaloop-workspace-check] |
  432. 258.08 s [gammaloop-workspace-check] 86 | lmb_channel_id: None,
  433. 258.08 s [gammaloop-workspace-check] | ^^^^^^^^^^^^^^ `CutInfo` does not have this field
  434. 258.08 s [gammaloop-workspace-check] |
  435. 258.08 s [gammaloop-workspace-check] = note: available fields are: `sampling_channel_id`, `sampling_channel_edge_ids`
  436. 258.08 s [gammaloop-workspace-check]
  437. 258.08 s [gammaloop-workspace-check] error[E0560]: struct `CutInfo` has no field named `lmb_channel_edge_ids`
  438. 258.08 s [gammaloop-workspace-check] --> tests/tests/test_differential.rs:87:13
  439. 258.08 s [gammaloop-workspace-check] |
  440. 258.08 s [gammaloop-workspace-check] 87 | lmb_channel_edge_ids: None,
  441. 258.08 s [gammaloop-workspace-check] | ^^^^^^^^^^^^^^^^^^^^ `CutInfo` does not have this field
  442. 258.08 s [gammaloop-workspace-check] |
  443. 258.08 s [gammaloop-workspace-check] = note: available fields are: `sampling_channel_id`, `sampling_channel_edge_ids`
  444. 258.08 s [gammaloop-workspace-check]
  445. 258.14 s [gammaloop-workspace-check] error[E0609]: no field `lmb_channel_edge_ids` on type `CutInfo`
  446. 258.14 s [gammaloop-workspace-check] --> tests/tests/test_evaluation_api.rs:311:10
  447. 258.14 s [gammaloop-workspace-check] |
  448. 258.14 s [gammaloop-workspace-check] 311 | .lmb_channel_edge_ids
  449. 258.14 s [gammaloop-workspace-check] | ^^^^^^^^^^^^^^^^^^^^ unknown field
  450. 258.14 s [gammaloop-workspace-check] |
  451. 258.14 s [gammaloop-workspace-check] = note: available fields are: `particle_pdgs`, `cut_id`, `graph_id`, `graph_group_id`, `orientation_id` ... and 2 others
  452. 258.14 s [gammaloop-workspace-check]
  453. 258.15 s [gammaloop-workspace-check] For more information about this error, try `rustc --explain E0560`.
  454. 258.16 s [gammaloop-workspace-check] error: could not compile `gammaloop-integration-tests` (test "test_differential") due to 2 previous errors
  455. 258.16 s [gammaloop-workspace-check] warning: build failed, waiting for other jobs to finish...
  456. 258.17 s [gammaloop-workspace-check] error[E0609]: no field `lmb_channel_edge_ids` on type `CutInfo`
  457. 258.17 s [gammaloop-workspace-check] --> tests/tests/test_evaluation_api.rs:591:26
  458. 258.17 s [gammaloop-workspace-check] |
  459. 258.17 s [gammaloop-workspace-check] 591 | .lmb_channel_edge_ids
  460. 258.17 s [gammaloop-workspace-check] | ^^^^^^^^^^^^^^^^^^^^ unknown field
  461. 258.17 s [gammaloop-workspace-check] |
  462. 258.17 s [gammaloop-workspace-check] = note: available fields are: `particle_pdgs`, `cut_id`, `graph_id`, `graph_group_id`, `orientation_id` ... and 2 others
  463. 258.17 s [gammaloop-workspace-check]
  464. 258.25 s [gammaloop-workspace-check] error[E0609]: no field `lmb_channel_edge_ids` on type `CutInfo`
  465. 258.25 s [gammaloop-workspace-check] --> tests/tests/test_evaluation_api.rs:1177:18
  466. 258.25 s [gammaloop-workspace-check] |
  467. 258.25 s [gammaloop-workspace-check] 1177 | .lmb_channel_edge_ids
  468. 258.25 s [gammaloop-workspace-check] | ^^^^^^^^^^^^^^^^^^^^ unknown field
  469. 258.25 s [gammaloop-workspace-check] |
  470. 258.25 s [gammaloop-workspace-check] = note: available fields are: `particle_pdgs`, `cut_id`, `graph_id`, `graph_group_id`, `orientation_id` ... and 2 others
  471. 258.25 s [gammaloop-workspace-check]
  472. 258.39 s [gammaloop-workspace-check] error[E0609]: no field `lmb_channel_edge_ids` on type `CutInfo`
  473. 258.39 s [gammaloop-workspace-check] --> tests/tests/test_evaluation_api.rs:1222:22
  474. 258.39 s [gammaloop-workspace-check] |
  475. 258.39 s [gammaloop-workspace-check] 1222 | .lmb_channel_edge_ids
  476. 258.39 s [gammaloop-workspace-check] | ^^^^^^^^^^^^^^^^^^^^ unknown field
  477. 258.39 s [gammaloop-workspace-check] |
  478. 258.39 s [gammaloop-workspace-check] = note: available fields are: `particle_pdgs`, `cut_id`, `graph_id`, `graph_group_id`, `orientation_id` ... and 2 others
  479. 258.39 s [gammaloop-workspace-check]
  480. 258.40 s [gammaloop-workspace-check] error[E0609]: no field `lmb_channel_edge_ids` on type `CutInfo`
  481. 258.40 s [gammaloop-workspace-check] --> tests/tests/test_evaluation_api.rs:1281:14
  482. 258.40 s [gammaloop-workspace-check] |
  483. 258.40 s [gammaloop-workspace-check] 1281 | .lmb_channel_edge_ids
  484. 258.40 s [gammaloop-workspace-check] | ^^^^^^^^^^^^^^^^^^^^ unknown field
  485. 258.40 s [gammaloop-workspace-check] |
  486. 258.40 s [gammaloop-workspace-check] = note: available fields are: `particle_pdgs`, `cut_id`, `graph_id`, `graph_group_id`, `orientation_id` ... and 2 others
  487. 258.40 s [gammaloop-workspace-check]
  488. 258.43 s [gammaloop-workspace-check] error[E0609]: no field `lmb_channel_edge_ids` on type `CutInfo`
  489. 258.43 s [gammaloop-workspace-check] --> tests/tests/test_evaluation_api.rs:1428:18
  490. 258.43 s [gammaloop-workspace-check] |
  491. 258.43 s [gammaloop-workspace-check] 1428 | .lmb_channel_edge_ids
  492. 258.43 s [gammaloop-workspace-check] | ^^^^^^^^^^^^^^^^^^^^ unknown field
  493. 258.43 s [gammaloop-workspace-check] |
  494. 258.43 s [gammaloop-workspace-check] = note: available fields are: `particle_pdgs`, `cut_id`, `graph_id`, `graph_group_id`, `orientation_id` ... and 2 others
  495. 258.43 s [gammaloop-workspace-check]
  496. 258.53 s [gammaloop-workspace-check] For more information about this error, try `rustc --explain E0609`.
  497. 258.55 s [gammaloop-workspace-check] error: could not compile `gammaloop-integration-tests` (test "test_evaluation_api") due to 6 previous errors
  498. 259.46 s [gammaloop-workspace-check] error[E0609]: no field `lmb_channel_id` on type `CutInfo`
  499. 259.46 s [gammaloop-workspace-check] --> tests/tests/test_runs/utils.rs:568:36
  500. 259.46 s [gammaloop-workspace-check] |
  501. 259.46 s [gammaloop-workspace-check] 568 | event.cut_info.lmb_channel_id,
  502. 259.46 s [gammaloop-workspace-check] | ^^^^^^^^^^^^^^ unknown field
  503. 259.46 s [gammaloop-workspace-check] |
  504. 259.46 s [gammaloop-workspace-check] = note: available fields are: `particle_pdgs`, `cut_id`, `graph_id`, `graph_group_id`, `orientation_id` ... and 2 others
  505. 259.46 s [gammaloop-workspace-check]
  506. 259.46 s [gammaloop-workspace-check] error[E0609]: no field `lmb_channel_id` on type `CutInfo`
  507. 259.46 s [gammaloop-workspace-check] --> tests/tests/test_runs/utils.rs:580:36
  508. 259.46 s [gammaloop-workspace-check] |
  509. 259.46 s [gammaloop-workspace-check] 580 | event.cut_info.lmb_channel_id,
  510. 259.46 s [gammaloop-workspace-check] | ^^^^^^^^^^^^^^ unknown field
  511. 259.46 s [gammaloop-workspace-check] |
  512. 259.46 s [gammaloop-workspace-check] = note: available fields are: `particle_pdgs`, `cut_id`, `graph_id`, `graph_group_id`, `orientation_id` ... and 2 others
  513. 259.46 s [gammaloop-workspace-check]
  514. 260.18 s [gammaloop-workspace-check] error: could not compile `gammaloop-integration-tests` (test "test_runs") due to 2 previous errors
  515. 260.84 s Progress: 0 of 1 built (1 failed)
  516. 260.84 s Failed to build gammaloop-workspace-check after 4m20s
  517. 260.85 s Cannot build '/nix/store/ws66y79brahbksfmnksfcdd9g1qvcyzb-gammaloop-workspace-check-0.1.0.drv'.
  518. 260.85 s Reason: builder failed with exit code 101.
  519. 260.85 s Output paths:
  520. 260.85 s /nix/store/d6pr1iwb3y055dnrdwwziahk8xn6ixw1-gammaloop-workspace-check-0.1.0
  521. 260.85 s Last 511 log lines:
  522. 260.85 s > Running phase: unpackPhase
  523. 260.85 s > unpacking source archive /nix/store/ypmxspggpi4qfj1zy7ml6kwz1d0c3m10-source
  524. 260.85 s > source root is source
  525. 260.85 s > Running phase: patchPhase
  526. 260.85 s > Executing configureCargoCommonVars
  527. 260.85 s > decompressing cargo artifacts from /nix/store/50vpxlcgfxf2d57i27v3d10zjwxxbm2r-gammaloop-workspace-deps-deps-0.1.0/target.tar.zst to target
  528. 260.85 s > Running phase: updateAutotoolsGnuConfigScriptsPhase
  529. 260.85 s > Running phase: configurePhase
  530. 260.85 s > will append /build/source/.cargo-home/config.toml with contents of /nix/store/5drf77x6km4ky7gwlrzdx9bbd6fz09g3-vendor-cargo-deps/config.toml
  531. 260.85 s > default configurePhase, nothing to do
  532. 260.85 s > Running phase: buildPhase
  533. 260.85 s > +++ command cargo --version
  534. 260.85 s > cargo 1.97.0 (c980f4866 2026-06-30)
  535. 260.85 s > +++ command cargo check --profile ci-optim --locked --workspace --features gammaloop-tracing-filter/clap,gammaloop-tracing-filter/symbolica,idenso/bincode,idenso/reference-cases,linnet/bincode,linnet/drawing,linnet/rkyv,linnet/serde,linnet/symbolica,spenso-macros/shadowing,spenso/shadowing,symbolica/tracing_max_level_info,three-dimensional-reps/display,three-dimensional-reps/eval,three-dimensional-reps/serde --all-targets
  536. 260.85 s > Checking cfg-if v1.0.4
  537. 260.85 s > Checking memchr v2.8.0
  538. 260.85 s > Checking once_cell v1.21.4
  539. 260.85 s > Checking either v1.15.0
  540. 260.85 s > Checking serde_core v1.0.228
  541. 260.85 s > Checking libc v0.2.186
  542. 260.85 s > Checking libm v0.2.16
  543. 260.85 s > Checking itoa v1.0.18
  544. 260.85 s > Checking log v0.4.29
  545. 260.85 s > Checking regex-syntax v0.8.10
  546. 260.85 s > Checking zerocopy v0.8.48
  547. 260.85 s > Checking crossbeam-utils v0.8.21
  548. 260.85 s > Checking equivalent v1.0.2
  549. 260.85 s > Checking zmij v1.0.21
  550. 260.85 s > Checking bytemuck v1.25.0
  551. 260.85 s > Checking lazy_static v1.5.0
  552. 260.85 s > Compiling target-lexicon v0.13.5
  553. 260.85 s > Checking arrayvec v0.7.6
  554. 260.85 s > Checking powerfmt v0.2.0
  555. 260.85 s > Checking num-conv v0.2.1
  556. 260.85 s > Checking pin-project-lite v0.2.17
  557. 260.85 s > Checking itertools v0.14.0
  558. 260.85 s > Checking num_threads v0.1.7
  559. 260.85 s > Checking time-core v0.1.8
  560. 260.85 s > Checking tracing-core v0.1.36
  561. 260.85 s > Checking safe_arch v0.7.4
  562. 260.85 s > Checking foldhash v0.2.0
  563. 260.85 s > Checking deranged v0.5.8
  564. 260.85 s > Checking allocator-api2 v0.2.21
  565. 260.85 s > Checking const-random v0.1.18
  566. 260.85 s > Checking winnow v1.0.2
  567. 260.85 s > Checking nu-ansi-term v0.50.3
  568. 260.85 s > Checking static_assertions v1.1.0
  569. 260.85 s > Checking unty v0.0.4
  570. 260.85 s > Checking crossbeam-epoch v0.9.18
  571. 260.85 s > Checking aho-corasick v1.1.4
  572. 260.85 s > Checking safe_arch v1.0.0
  573. 260.85 s > Checking wide v0.7.33
  574. 260.85 s > Checking sharded-slab v0.1.7
  575. 260.85 s > Checking hashbrown v0.16.1
  576. 260.85 s > Checking tracing v0.1.44
  577. 260.85 s > Checking crossbeam-deque v0.8.6
  578. 260.85 s > Checking tracing-log v0.2.0
  579. 260.85 s > Checking rayon-core v1.13.0
  580. 260.85 s > Checking thread_local v1.1.9
  581. 260.85 s > Checking indenter v0.3.4
  582. 260.85 s > Checking az v1.3.0
  583. 260.85 s > Checking toml_writer v1.1.1+spec-1.1.0
  584. 260.85 s > Checking wide v1.3.0
  585. 260.85 s > Checking num-traits v0.2.19
  586. 260.85 s > Compiling phf_shared v0.11.3
  587. 260.85 s > Checking anyhow v1.0.102
  588. 260.85 s > Checking rayon v1.12.0
  589. 260.85 s > Checking utf8parse v0.2.2
  590. 260.85 s > Checking rawpointer v0.2.1
  591. 260.85 s > Checking alloc-no-stdlib v2.0.4
  592. 260.85 s > Checking toml_parser v1.1.2+spec-1.1.0
  593. 260.85 s > Checking dyn-clone v1.0.20
  594. 260.85 s > Checking alloc-stdlib v0.2.2
  595. 260.85 s > Checking matrixmultiply v0.3.10
  596. 260.85 s > Checking anstyle-parse v1.0.0
  597. 260.85 s > Checking colorchoice v1.0.5
  598. 260.85 s > Checking is_terminal_polyfill v1.70.2
  599. 260.85 s > Checking anstyle v1.0.14
  600. 260.85 s > Checking colored v3.1.1
  601. 260.85 s > Checking anstyle-query v1.1.5
  602. 260.85 s > Compiling phf_generator v0.11.3
  603. 260.85 s > Checking getrandom v0.3.4
  604. 260.85 s > Checking time v0.3.47
  605. 260.85 s > Compiling pyo3-build-config v0.28.3
  606. 260.85 s > Checking gmp-mpfr-sys v1.7.1
  607. 260.85 s > Checking rand_core v0.9.5
  608. 260.85 s > Checking regex-automata v0.4.14
  609. 260.85 s > Checking anstream v1.0.0
  610. 260.85 s > Checking approx v0.5.1
  611. 260.85 s > Checking num-integer v0.1.46
  612. 260.85 s > Checking eyre v0.6.12
  613. 260.85 s > Checking unicode-width v0.2.2
  614. 260.85 s > Checking bitflags v1.3.2
  615. 260.85 s > Checking serde v1.0.228
  616. 260.85 s > Checking serde_json v1.0.149
  617. 260.85 s > Checking bitflags v2.11.1
  618. 260.85 s > Checking serde_spanned v1.1.1
  619. 260.85 s > Checking toml_datetime v1.1.1+spec-1.1.0
  620. 260.85 s > Compiling phf_codegen v0.11.3
  621. 260.85 s > Checking region v3.0.2
  622. 260.85 s > Checking wasmtime-jit-icache-coherence v34.0.2
  623. 260.85 s > Checking hugepage-rs v0.1.1
  624. 260.85 s > Checking brotli-decompressor v5.0.0
  625. 260.85 s > Checking inventory v0.3.24
  626. 260.85 s > Checking spec_math v0.1.6
  627. 260.85 s > Checking thiserror v2.0.18
  628. 260.85 s > Compiling getopts v0.2.24
  629. 260.85 s > Checking libloading v0.9.0
  630. 260.85 s > Checking toml v1.1.2+spec-1.1.0
  631. 260.85 s > Checking bytes v1.11.1
  632. 260.85 s > Checking byteorder v1.5.0
  633. 260.85 s > Checking append-only-vec v0.1.8
  634. 260.85 s > Checking tinyjson v2.5.1
  635. 260.85 s > Checking self_cell v1.2.2
  636. 260.85 s > Compiling unicode_names2_generator v1.3.0
  637. 260.85 s > Compiling unic-common v0.9.0
  638. 260.85 s > Checking smallvec v1.15.1
  639. 260.85 s > Checking num-complex v0.4.6
  640. 260.85 s > Checking tracing-serde v0.2.0
  641. 260.85 s > Checking bincode v2.0.1
  642. 260.85 s > Checking smartstring v1.0.1
  643. 260.85 s > Checking linux-raw-sys v0.12.1
  644. 260.85 s > Compiling unic-char-range v0.9.0
  645. 260.85 s > Compiling unic-char-property v0.9.0
  646. 260.85 s > Compiling unic-ucd-version v0.9.0
  647. 260.85 s > Compiling is-macro v0.3.7
  648. 260.85 s > Checking simba v0.9.1
  649. 260.85 s > Compiling rustpython-parser-vendored v0.4.0
  650. 260.85 s > Checking brotli v8.0.2
  651. 260.85 s > Checking iana-time-zone v0.1.65
  652. 260.85 s > Compiling rustpython-parser v0.4.0
  653. 260.85 s > Checking chrono v0.4.44
  654. 260.85 s > Checking rustix v1.1.4
  655. 260.85 s > Compiling phf v0.11.3
  656. 260.85 s > Checking rustc-hash v2.1.2
  657. 260.85 s > Compiling unic-ucd-ident v0.9.0
  658. 260.85 s > Compiling unic-emoji-char v0.9.0
  659. 260.85 s > Checking ndarray v0.17.2
  660. 260.85 s > Compiling rustc-hash v1.1.0
  661. 260.85 s > Compiling lalrpop-util v0.20.2
  662. 260.85 s > Checking rug v1.30.0
  663. 260.85 s > Checking unicode-segmentation v1.13.2
  664. 260.85 s > Compiling symbolica v2.2.0 (https://github.com/alphal00p/symbolica?rev=a277a8dadbaae5a8d6605f2f381991a601e1f345#a277a8da)
  665. 260.85 s > Checking typenum v1.20.0
  666. 260.85 s > Checking getrandom v0.2.17
  667. 260.85 s > Checking scopeguard v1.2.0
  668. 260.85 s > Checking parking_lot_core v0.9.12
  669. 260.85 s > Checking unicode-ident v1.0.24
  670. 260.85 s > Checking lock_api v0.4.14
  671. 260.85 s > Checking hashbrown v0.17.0
  672. 260.85 s > Checking ppv-lite86 v0.2.21
  673. 260.85 s > Checking ahash v0.8.12
  674. 260.85 s > Checking parking_lot v0.12.5
  675. 260.85 s > Checking errno v0.3.14
  676. 260.85 s > Checking clap_lex v1.1.0
  677. 260.85 s > Checking generic-array v0.14.7
  678. 260.85 s > Checking rand_chacha v0.9.0
  679. 260.85 s > Checking unicase v2.9.0
  680. 260.85 s > Checking strsim v0.11.1
  681. 260.85 s > Checking signal-hook-registry v1.4.8
  682. 260.85 s > Checking vte v0.14.1
  683. 260.85 s > Checking same-file v1.0.6
  684. 260.85 s > Checking rand v0.9.4
  685. 260.85 s > Checking matchers v0.2.0
  686. 260.85 s > Checking regex v1.12.3
  687. 260.85 s > Checking signal-hook v0.3.18
  688. 260.85 s > Checking indexmap v2.14.0
  689. 260.85 s > Checking walkdir v2.5.0
  690. 260.85 s > Checking tracing-subscriber v0.3.23
  691. 260.85 s > Checking crypto-common v0.1.7
  692. 260.85 s > Checking block-buffer v0.10.4
  693. 260.85 s > Checking half v2.7.1
  694. 260.85 s > Checking mio v1.2.0
  695. 260.85 s > Checking terminal_size v0.4.4
  696. 260.85 s > Checking ciborium-io v0.2.2
  697. 260.85 s > Checking minimal-lexical v0.2.1
  698. 260.85 s > Checking digest v0.10.7
  699. 260.85 s > Checking symjit v2.21.0
  700. 260.85 s > Checking clap_builder v4.6.0
  701. 260.85 s > Checking ciborium-ll v0.2.2
  702. 260.85 s > Checking derive_more v2.1.1
  703. 260.85 s > Checking nom v7.1.3
  704. 260.85 s > Checking num-bigint v0.4.6
  705. 260.85 s > Checking signal-hook-mio v0.2.5
  706. 260.85 s > Checking console v0.16.3
  707. 260.85 s > Checking bstr v1.12.1
  708. 260.85 s > Checking winnow v0.7.15
  709. 260.85 s > Checking cpufeatures v0.2.17
  710. 260.85 s > Checking linux-raw-sys v0.4.15
  711. 260.85 s > Checking globset v0.4.18
  712. 260.85 s > Compiling unicode_names2 v1.3.0
  713. 260.85 s > Checking sha2 v0.10.9
  714. 260.85 s > Checking rustix v0.38.44
  715. 260.85 s > Checking ciborium v0.2.2
  716. 260.85 s > Checking getrandom v0.4.2
  717. 260.85 s > Checking rand_core v0.6.4
  718. 260.85 s > Checking fastrand v2.4.1
  719. 260.85 s > Checking plotters-backend v0.3.7
  720. 260.85 s > Checking fnv v1.0.7
  721. 260.85 s > Checking rust-embed-utils v8.11.0
  722. 260.85 s > Checking tempfile v3.27.0
  723. 260.85 s > Checking serde_spanned v0.6.9
  724. 260.85 s > Checking toml_datetime v0.6.11
  725. 260.85 s > Checking ansitok v0.3.0
  726. 260.85 s > Checking itertools v0.10.5
  727. 260.85 s > Checking toml_write v0.1.2
  728. 260.85 s > Checking plotters-svg v0.3.7
  729. 260.85 s > Checking tap v1.0.1
  730. 260.85 s > Checking crossterm v0.28.1
  731. 260.85 s > Checking cast v0.3.0
  732. 260.85 s > Checking plotters v0.3.7
  733. 260.85 s > Checking rand_chacha v0.3.1
  734. 260.85 s > Checking toml_edit v0.22.27
  735. 260.85 s > Checking wyz v0.5.1
  736. 260.85 s > Checking clap v4.6.1
  737. 260.85 s > Checking radium v0.7.0
  738. 260.85 s > Checking typeid v1.0.3
  739. 260.85 s > Checking ansi-str v0.9.0
  740. 260.85 s > Checking xprec v0.2.2
  741. 260.85 s > Checking similar v2.7.0
  742. 260.85 s > Checking tinytemplate v1.2.1
  743. 260.85 s > Checking is-terminal v0.4.17
  744. 260.85 s > Checking funty v2.0.0
  745. 260.85 s > Checking anes v0.1.6
  746. 260.85 s > Checking bytecount v0.6.9
  747. 260.85 s > Checking oorandom v11.1.5
  748. 260.85 s > Checking ron v0.12.1
  749. 260.85 s > Checking papergrid v0.17.0
  750. 260.85 s > Checking rand v0.8.6
  751. 260.85 s > Checking testing_table v0.3.0
  752. 260.85 s > Checking toml_edit v0.25.11+spec-1.1.0
  753. 260.85 s > Checking env_filter v1.0.1
  754. 260.85 s > Checking bitvec v1.0.1
  755. 260.85 s > Compiling pyo3-ffi v0.28.3
  756. 260.85 s > Compiling pyo3-macros-backend v0.28.3
  757. 260.85 s > Compiling pyo3 v0.28.3
  758. 260.85 s > Compiling numpy v0.28.0
  759. 260.85 s > Checking criterion-plot v0.5.0
  760. 260.85 s > Checking uncased v0.9.10
  761. 260.85 s > Checking jiff v0.2.24
  762. 260.85 s > Checking ptr_meta v0.1.4
  763. 260.85 s > Checking criterion v0.5.1
  764. 260.85 s > Checking simdutf8 v0.1.5
  765. 260.85 s > Checking ucd-trie v0.1.7
  766. 260.85 s > Checking ahash v0.7.8
  767. 260.85 s > Checking bytecheck v0.6.12
  768. 260.85 s > Checking pest v2.8.6
  769. 260.85 s > Checking approx v0.4.0
  770. 260.85 s > Checking tabled v0.20.0
  771. 260.85 s > Checking seahash v4.1.0
  772. 260.85 s > Checking hashbrown v0.12.3
  773. 260.85 s > Checking cgmath v0.18.0
  774. 260.85 s > Checking num-rational v0.4.2
  775. 260.85 s > Checking num-iter v0.1.45
  776. 260.85 s > Checking insta v1.47.2
  777. 260.85 s > Checking ref-ops v0.2.5
  778. 260.85 s > Checking toml v0.8.23
  779. 260.85 s > Checking rend v0.4.2
  780. 260.85 s > Checking rand_xoshiro v0.6.0
  781. 260.85 s > Checking num v0.4.3
  782. 260.85 s > Checking features v0.10.0
  783. 260.85 s > Checking constcat v0.5.1
  784. 260.85 s > Checking gat-lending-iterator v0.1.8
  785. 260.85 s > Checking colored v2.2.0
  786. 260.85 s > Checking constant_time_eq v0.4.2
  787. 260.85 s > Checking figment v0.10.19
  788. 260.85 s > Checking arrayref v0.3.9
  789. 260.85 s > Checking cpufeatures v0.3.0
  790. 260.85 s > Checking base64 v0.22.1
  791. 260.85 s > Checking joinery v2.1.0
  792. 260.85 s > Checking blake3 v1.8.5
  793. 260.85 s > Checking siphasher v1.0.2
  794. 260.85 s > Checking titlecase v2.2.1
  795. 260.85 s > Checking phf_shared v0.13.1
  796. 260.85 s > Checking subprocess v0.2.15
  797. 260.85 s > Checking dot-parser v0.5.1
  798. 260.85 s > Checking rust_lisp v0.18.0
  799. 260.85 s > Compiling vakint v0.1.2 (/build/source/crates/vakint)
  800. 260.85 s > Checking version-compare v0.2.1
  801. 260.85 s > Checking phf v0.13.1
  802. 260.85 s > Checking xpct v0.5.1
  803. 260.85 s > Checking ryu v1.0.23
  804. 260.85 s > Checking castaway v0.2.4
  805. 260.85 s > Checking toml_datetime v0.7.5+spec-1.1.0
  806. 260.85 s > Checking strum v0.27.2
  807. 260.85 s > Checking unicode-truncate v2.0.1
  808. 260.85 s > Checking compact_str v0.9.0
  809. 260.85 s > Checking kasuari v0.4.12
  810. 260.85 s > Checking lru v0.16.4
  811. 260.85 s > Checking string-template-plus v0.4.3
  812. 260.85 s > Checking vte v0.15.0
  813. 260.85 s > Checking toml v0.9.12+spec-1.1.0
  814. 260.85 s > Checking portable-atomic v1.13.1
  815. 260.85 s > Checking unit-prefix v0.5.2
  816. 260.85 s > Checking rand_distr v0.4.3
  817. 260.85 s > Checking simba v0.6.0
  818. 260.85 s > Checking vt100 v0.16.2
  819. 260.85 s > Checking line-clipping v0.3.7
  820. 260.85 s > Checking adler2 v2.0.1
  821. 260.85 s > Checking gimli v0.32.3
  822. 260.85 s > Compiling three-dimensional-reps v0.1.0 (/build/source/crates/three-dimensional-reps)
  823. 260.85 s > Checking miniz_oxide v0.8.9
  824. 260.85 s > Checking ratatui-core v0.1.0
  825. 260.85 s > Checking thiserror v1.0.69
  826. 260.85 s > Checking derive_builder v0.11.2
  827. 260.85 s > Checking object v0.37.3
  828. 260.85 s > Compiling rustpython-parser-core v0.4.0
  829. 260.85 s > Checking crossterm v0.29.0
  830. 260.85 s > Checking owo-colors v4.3.0
  831. 260.85 s > Checking tracing-error v0.2.1
  832. 260.85 s > Checking indicatif v0.18.4
  833. 260.85 s > Checking typed-index-collections v3.5.0
  834. 260.85 s > Checking serde-big-array v0.5.1
  835. 260.85 s > Compiling rustpython-ast v0.4.0
  836. 260.85 s > Checking amd v0.2.2
  837. 260.85 s > Checking itertools v0.11.0
  838. 260.85 s > Compiling gammaloop-tracing-filter-macros v0.1.0 (/build/source/crates/gammaloop-tracing-filter-macros)
  839. 260.85 s > Checking rustc-demangle v0.1.27
  840. 260.85 s > Checking option-ext v0.2.0
  841. 260.85 s > Checking dirs-sys v0.5.0
  842. 260.85 s > Checking env_logger v0.11.10
  843. 260.85 s > Checking ref-cast v1.0.25
  844. 260.85 s > Checking nix v0.31.2
  845. 260.85 s > Checking integer-sqrt v0.1.5
  846. 260.85 s > Checking brotli-decompressor v4.0.3
  847. 260.85 s > Checking crossbeam-channel v0.5.15
  848. 260.85 s > Checking itertools v0.12.1
  849. 260.85 s > Checking symlink v0.1.0
  850. 260.85 s > Checking color-spantrace v0.3.0
  851. 260.85 s > Compiling gammalooprs v0.3.4 (/build/source/crates/gammalooprs)
  852. 260.85 s > Checking unsafe-libyaml v0.2.11
  853. 260.85 s > Checking ratatui-widgets v0.3.0
  854. 260.85 s > Checking ratatui-crossterm v0.1.0
  855. 260.85 s > Checking rkyv v0.7.46
  856. 260.85 s > Checking include_dir v0.7.4
  857. 260.85 s > Checking tracing-appender v0.2.5
  858. 260.85 s > Checking pathfinding v4.15.0
  859. 260.85 s > Checking schemars v1.2.1
  860. 260.85 s > Checking ctrlc v3.5.2
  861. 260.85 s > Checking dirs v6.0.0
  862. 260.85 s > Checking clarabel v0.11.1
  863. 260.85 s > Checking slotmap v1.1.1
  864. 260.85 s > Checking tracing-indicatif v0.3.14
  865. 260.85 s > Checking brotli v7.0.0
  866. 260.85 s > Checking json5 v0.4.1
  867. 260.85 s > Checking serde_yaml v0.9.34+deprecated
  868. 260.85 s > Checking vectorize v0.2.0
  869. 260.85 s > Checking addr2line v0.25.1
  870. 260.85 s > Checking base62 v2.2.4
  871. 260.85 s > Checking ringbuffer v0.16.0
  872. 260.85 s > Checking ratatui-macros v0.7.0
  873. 260.85 s > Checking rust-embed v8.11.0
  874. 260.85 s > Checking clap_complete v4.6.3
  875. 260.85 s > Checking ratatui v0.30.0
  876. 260.85 s > Checking fd-lock v4.0.4
  877. 260.85 s > Checking strip-ansi-escapes v0.2.1
  878. 260.85 s > Compiling gammaloop-api v0.1.0 (/build/source/crates/gammaloop-api)
  879. 260.85 s > Checking itertools v0.13.0
  880. 260.85 s > Checking strum v0.26.3
  881. 260.85 s > Checking sysinfo v0.33.1
  882. 260.85 s > Checking shlex v1.3.0
  883. 260.85 s > Checking futures-task v0.3.32
  884. 260.85 s > Checking clap_complete_nushell v4.6.0
  885. 260.85 s > Checking slab v0.4.12
  886. 260.85 s > Checking futures-core v0.3.32
  887. 260.85 s > Checking sdd v3.0.10
  888. 260.85 s > Compiling gammaloop-integration-tests v0.1.0 (/build/source/tests)
  889. 260.85 s > Checking futures-util v0.3.32
  890. 260.85 s > Compiling test-log-core v0.2.20
  891. 260.85 s > Compiling numerica v2.2.0 (https://github.com/alphal00p/symbolica?rev=a277a8dadbaae5a8d6605f2f381991a601e1f345#a277a8da)
  892. 260.85 s > Checking scc v2.4.0
  893. 260.85 s > Compiling rustc_version v0.4.1
  894. 260.85 s > Checking which v8.0.2
  895. 260.85 s > Checking bincode v1.3.3
  896. 260.85 s > Checking backtrace v0.3.76
  897. 260.85 s > Compiling gungraun-runner v0.18.2
  898. 260.85 s > Checking reedline v0.42.0
  899. 260.85 s > Checking nalgebra v0.29.0
  900. 260.85 s > Checking color-eyre v0.6.5
  901. 260.85 s > Compiling gungraun-macros v0.8.0
  902. 260.85 s > Checking proc-macro2 v1.0.106
  903. 260.85 s > Checking base64 v0.21.7
  904. 260.85 s > Checking maplit v1.0.2
  905. 260.85 s > Compiling iai-callgrind-runner v0.14.2
  906. 260.85 s > Checking ron v0.8.1
  907. 260.85 s > Checking quote v1.0.45
  908. 260.85 s > Checking futures-executor v0.3.32
  909. 260.85 s > Checking kurbo v0.13.0
  910. 260.85 s > Checking wait-timeout v0.2.1
  911. 260.85 s > Checking serial_test v3.4.0
  912. 260.85 s > Checking quick-error v1.2.3
  913. 260.85 s > Checking bit-vec v0.8.0
  914. 260.85 s > Compiling iai-callgrind v0.14.2
  915. 260.85 s > Checking rusty-fork v0.3.1
  916. 260.85 s > Checking syn v2.0.117
  917. 260.85 s > Checking bit-set v0.8.0
  918. 260.85 s > Compiling test-log-macros v0.2.20
  919. 260.85 s > Compiling iai-callgrind-macros v0.5.1
  920. 260.85 s > Checking rand_xorshift v0.4.0
  921. 260.85 s > Checking console v0.15.11
  922. 260.85 s > Checking unarray v0.1.4
  923. 260.85 s > Checking pathdiff v0.2.3
  924. 260.85 s > Checking proptest v1.11.0
  925. 260.85 s > Checking similar-asserts v1.7.0
  926. 260.85 s > Checking kurvst v0.1.0 (/build/source/crates/kurvst)
  927. 260.85 s > Checking clinnet v0.1.8 (/build/source/crates/clinnet)
  928. 260.85 s > Compiling graphica v2.1.0 (https://github.com/alphal00p/symbolica?rev=a277a8dadbaae5a8d6605f2f381991a601e1f345#a277a8da)
  929. 260.85 s > Checking test-log v0.2.20
  930. 260.85 s > Checking statrs v0.16.1
  931. 260.85 s > Checking momtrop v0.3.0
  932. 260.85 s > Checking gungraun v0.18.2
  933. 260.85 s > Compiling pyo3-stub-gen-derive v0.17.2
  934. 260.85 s > Compiling pyo3-macros v0.28.3
  935. 260.85 s > Checking pyo3-stub-gen v0.17.2
  936. 260.85 s > Checking symbolica-utils v0.1.0 (/build/source/crates/symbolica-utils)
  937. 260.85 s > Checking spenso-macros v0.3.2 (/build/source/crates/spenso-macros)
  938. 260.85 s > Compiling gammaloop-workspace-hack v0.1.0 (/build/source/crates/gammaloop-workspace-hack)
  939. 260.85 s > Checking linnet v0.17.0 (/build/source/crates/linnet)
  940. 260.85 s > Checking spenso v0.6.0 (/build/source/crates/spenso)
  941. 260.85 s > Checking linnet-py v0.1.0 (/build/source/crates/linnet-py)
  942. 260.85 s > Checking linnest v0.1.0 (/build/source/crates/linnest)
  943. 260.85 s > Checking idenso v0.3.0 (/build/source/crates/idenso)
  944. 260.85 s > Checking gammaloop-tracing-filter v0.1.0 (/build/source/crates/gammaloop-tracing-filter)
  945. 260.85 s > Checking spenso-hep-lib v0.1.7 (/build/source/crates/spenso-hep-lib)
  946. 260.85 s > Checking spynso3 v0.1.2 (/build/source/crates/spynso3)
  947. 260.85 s > error[E0560]: struct `CutInfo` has no field named `lmb_channel_id`
  948. 260.85 s > --> tests/tests/test_differential.rs:86:13
  949. 260.85 s > |
  950. 260.85 s > 86 | lmb_channel_id: None,
  951. 260.85 s > | ^^^^^^^^^^^^^^ `CutInfo` does not have this field
  952. 260.85 s > |
  953. 260.85 s > = note: available fields are: `sampling_channel_id`, `sampling_channel_edge_ids`
  954. 260.85 s >
  955. 260.85 s > error[E0560]: struct `CutInfo` has no field named `lmb_channel_edge_ids`
  956. 260.85 s > --> tests/tests/test_differential.rs:87:13
  957. 260.85 s > |
  958. 260.85 s > 87 | lmb_channel_edge_ids: None,
  959. 260.85 s > | ^^^^^^^^^^^^^^^^^^^^ `CutInfo` does not have this field
  960. 260.85 s > |
  961. 260.85 s > = note: available fields are: `sampling_channel_id`, `sampling_channel_edge_ids`
  962. 260.85 s >
  963. 260.85 s > error[E0609]: no field `lmb_channel_edge_ids` on type `CutInfo`
  964. 260.85 s > --> tests/tests/test_evaluation_api.rs:311:10
  965. 260.85 s > |
  966. 260.85 s > 311 | .lmb_channel_edge_ids
  967. 260.85 s > | ^^^^^^^^^^^^^^^^^^^^ unknown field
  968. 260.85 s > |
  969. 260.85 s > = note: available fields are: `particle_pdgs`, `cut_id`, `graph_id`, `graph_group_id`, `orientation_id` ... and 2 others
  970. 260.85 s >
  971. 260.85 s > For more information about this error, try `rustc --explain E0560`.
  972. 260.85 s > error: could not compile `gammaloop-integration-tests` (test "test_differential") due to 2 previous errors
  973. 260.85 s > warning: build failed, waiting for other jobs to finish...
  974. 260.85 s > error[E0609]: no field `lmb_channel_edge_ids` on type `CutInfo`
  975. 260.85 s > --> tests/tests/test_evaluation_api.rs:591:26
  976. 260.85 s > |
  977. 260.85 s > 591 | .lmb_channel_edge_ids
  978. 260.85 s > | ^^^^^^^^^^^^^^^^^^^^ unknown field
  979. 260.85 s > |
  980. 260.85 s > = note: available fields are: `particle_pdgs`, `cut_id`, `graph_id`, `graph_group_id`, `orientation_id` ... and 2 others
  981. 260.85 s >
  982. 260.85 s > error[E0609]: no field `lmb_channel_edge_ids` on type `CutInfo`
  983. 260.85 s > --> tests/tests/test_evaluation_api.rs:1177:18
  984. 260.85 s > |
  985. 260.85 s > 1177 | .lmb_channel_edge_ids
  986. 260.85 s > | ^^^^^^^^^^^^^^^^^^^^ unknown field
  987. 260.85 s > |
  988. 260.85 s > = note: available fields are: `particle_pdgs`, `cut_id`, `graph_id`, `graph_group_id`, `orientation_id` ... and 2 others
  989. 260.85 s >
  990. 260.85 s > error[E0609]: no field `lmb_channel_edge_ids` on type `CutInfo`
  991. 260.85 s > --> tests/tests/test_evaluation_api.rs:1222:22
  992. 260.85 s > |
  993. 260.85 s > 1222 | .lmb_channel_edge_ids
  994. 260.85 s > | ^^^^^^^^^^^^^^^^^^^^ unknown field
  995. 260.85 s > |
  996. 260.85 s > = note: available fields are: `particle_pdgs`, `cut_id`, `graph_id`, `graph_group_id`, `orientation_id` ... and 2 others
  997. 260.85 s >
  998. 260.85 s > error[E0609]: no field `lmb_channel_edge_ids` on type `CutInfo`
  999. 260.85 s > --> tests/tests/test_evaluation_api.rs:1281:14
  1000. 260.85 s > |
  1001. 260.85 s > 1281 | .lmb_channel_edge_ids
  1002. 260.85 s > | ^^^^^^^^^^^^^^^^^^^^ unknown field
  1003. 260.85 s > |
  1004. 260.85 s > = note: available fields are: `particle_pdgs`, `cut_id`, `graph_id`, `graph_group_id`, `orientation_id` ... and 2 others
  1005. 260.85 s >
  1006. 260.85 s > error[E0609]: no field `lmb_channel_edge_ids` on type `CutInfo`
  1007. 260.85 s > --> tests/tests/test_evaluation_api.rs:1428:18
  1008. 260.85 s > |
  1009. 260.85 s > 1428 | .lmb_channel_edge_ids
  1010. 260.85 s > | ^^^^^^^^^^^^^^^^^^^^ unknown field
  1011. 260.85 s > |
  1012. 260.85 s > = note: available fields are: `particle_pdgs`, `cut_id`, `graph_id`, `graph_group_id`, `orientation_id` ... and 2 others
  1013. 260.85 s >
  1014. 260.85 s > For more information about this error, try `rustc --explain E0609`.
  1015. 260.85 s > error: could not compile `gammaloop-integration-tests` (test "test_evaluation_api") due to 6 previous errors
  1016. 260.85 s > error[E0609]: no field `lmb_channel_id` on type `CutInfo`
  1017. 260.85 s > --> tests/tests/test_runs/utils.rs:568:36
  1018. 260.85 s > |
  1019. 260.85 s > 568 | event.cut_info.lmb_channel_id,
  1020. 260.85 s > | ^^^^^^^^^^^^^^ unknown field
  1021. 260.85 s > |
  1022. 260.85 s > = note: available fields are: `particle_pdgs`, `cut_id`, `graph_id`, `graph_group_id`, `orientation_id` ... and 2 others
  1023. 260.85 s >
  1024. 260.85 s > error[E0609]: no field `lmb_channel_id` on type `CutInfo`
  1025. 260.85 s > --> tests/tests/test_runs/utils.rs:580:36
  1026. 260.85 s > |
  1027. 260.85 s > 580 | event.cut_info.lmb_channel_id,
  1028. 260.85 s > | ^^^^^^^^^^^^^^ unknown field
  1029. 260.85 s > |
  1030. 260.85 s > = note: available fields are: `particle_pdgs`, `cut_id`, `graph_id`, `graph_group_id`, `orientation_id` ... and 2 others
  1031. 260.85 s >
  1032. 260.85 s > error: could not compile `gammaloop-integration-tests` (test "test_runs") due to 2 previous errors
  1033. 260.85 s For full logs, run:
  1034. 260.85 s nix log /nix/store/ws66y79brahbksfmnksfcdd9g1qvcyzb-gammaloop-workspace-check-0.1.0.drv
  1035. 260.86 s Build failed.