0.00 s
$ /nix/store/9ypz3flqsrl5xl495mm8h645gadjsxi1-coreutils-9.11/bin/timeout --kill-after=15s 7200s /nix/store/23zk8sgzamrbmj1fday15szf7f2279s8-nix-2.34.7/bin/nix --extra-experimental-features nix-command --extra-experimental-features flakes --log-format internal-json build --no-link --print-out-paths git+https://github.com/alphal00p/gammaloop?ref=advanced_sampling&rev=17cab6f72c1df1d8c1446d47281e0e8c60d52e8b&shallow=1#packages.x86_64-linux.crate-test-binaries-python-api-gammaloop-integration-tests --print-build-logs
0.08 s
fetching Git repository 'https://github.com/alphal00p/gammaloop'
0.77 s
remote: Enumerating objects: 2384, done.
0.89 s
remote: Counting objects: 0% (1/2384)
remote: Counting objects: 1% (24/2384)
remote: Counting objects: 2% (48/2384)
remote: Counting objects: 3% (72/2384)
remote: Counting objects: 4% (96/2384)
remote: Counting objects: 5% (120/2384)
remote: Counting objects: 6% (144/2384)
remote: Counting objects: 7% (167/2384)
remote: Counting objects: 8% (191/2384)
remote: Counting objects: 9% (215/2384)
remote: Counting objects: 10% (239/2384)
remote: Counting objects: 11% (263/2384)
remote: Counting objects: 12% (287/2384)
remote: Counting objects: 13% (310/2384)
remote: Counting objects: 14% (334/2384)
remote: Counting objects: 15% (358/2384)
remote: Counting objects: 16% (382/2384)
remote: Counting objects: 17% (406/2384)
remote: Counting objects: 18% (430/2384)
remote: Counting objects: 19% (453/2384)
remote: Counting objects: 20% (477/2384)
remote: Counting objects: 21% (501/2384)
remote: Counting objects: 22% (525/2384)
remote: Counting objects: 23% (549/2384)
remote: Counting objects: 24% (573/2384)
remote: Counting objects: 25% (596/2384)
remote: Counting objects: 26% (620/2384)
remote: Counting objects: 27% (644/2384)
remote: Counting objects: 28% (668/2384)
remote: Counting objects: 29% (692/2384)
remote: Counting objects: 30% (716/2384)
remote: Counting objects: 31% (740/2384)
remote: Counting objects: 32% (763/2384)
remote: Counting objects: 33% (787/2384)
remote: Counting objects: 34% (811/2384)
remote: Counting objects: 35% (835/2384)
remote: Counting objects: 36% (859/2384)
remote: Counting objects: 37% (883/2384)
remote: Counting objects: 38% (906/2384)
remote: Counting objects: 39% (930/2384)
remote: Counting objects: 40% (954/2384)
remote: Counting objects: 41% (978/2384)
remote: Counting objects: 42% (1002/2384)
remote: Counting objects: 43% (1026/2384)
remote: Counting objects: 44% (1049/2384)
remote: Counting objects: 45% (1073/2384)
remote: Counting objects: 46% (1097/2384)
remote: Counting objects: 47% (1121/2384)
remote: Counting objects: 48% (1145/2384)
remote: Counting objects: 49% (1169/2384)
remote: Counting objects: 50% (1192/2384)
remote: Counting objects: 51% (1216/2384)
remote: Counting objects: 52% (1240/2384)
remote: Counting objects: 53% (1264/2384)
remote: Counting objects: 54% (1288/2384)
remote: Counting objects: 55% (1312/2384)
remote: Counting objects: 56% (1336/2384)
remote: Counting objects: 57% (1359/2384)
remote: Counting objects: 58% (1383/2384)
remote: Counting objects: 59% (1407/2384)
remote: Counting objects: 60% (1431/2384)
remote: Counting objects: 61% (1455/2384)
remote: Counting objects: 62% (1479/2384)
remote: Counting objects: 63% (1502/2384)
remote: Counting objects: 64% (1526/2384)
remote: Counting objects: 65% (1550/2384)
remote: Counting objects: 66% (1574/2384)
remote: Counting objects: 67% (1598/2384)
remote: Counting objects: 68% (1622/2384)
remote: Counting objects: 69% (1645/2384)
remote: Counting objects: 70% (1669/2384)
remote: Counting objects: 71% (1693/2384)
remote: Counting objects: 72% (1717/2384)
remote: Counting objects: 73% (1741/2384)
remote: Counting objects: 74% (1765/2384)
remote: Counting objects: 75% (1788/2384)
remote: Counting objects: 76% (1812/2384)
remote: Counting objects: 77% (1836/2384)
remote: Counting objects: 78% (1860/2384)
remote: Counting objects: 79% (1884/2384)
remote: Counting objects: 80% (1908/2384)
remote: Counting objects: 81% (1932/2384)
remote: Counting objects: 82% (1955/2384)
remote: Counting objects: 83% (1979/2384)
remote: Counting objects: 84% (2003/2384)
remote: Counting objects: 85% (2027/2384)
remote: Counting objects: 86% (2051/2384)
remote: Counting objects: 87% (2075/2384)
remote: Counting objects: 88% (2098/2384)
remote: Counting objects: 89% (2122/2384)
remote: Counting objects: 90% (2146/2384)
remote: Counting objects: 91% (2170/2384)
remote: Counting objects: 92% (2194/2384)
remote: Counting objects: 93% (2218/2384)
remote: Counting objects: 94% (2241/2384)
remote: Counting objects: 95% (2265/2384)
remote: Counting objects: 96% (2289/2384)
remote: Counting objects: 97% (2313/2384)
remote: Counting objects: 98% (2337/2384)
remote: Counting objects: 99% (2361/2384)
remote: Counting objects: 100% (2384/2384)
remote: Counting objects: 100% (2384/2384), done.
1.64 s
remote: Compressing objects: 0% (1/1449)
remote: Compressing objects: 1% (15/1449)
remote: Compressing objects: 2% (29/1449)
remote: Compressing objects: 3% (44/1449)
remote: Compressing objects: 4% (58/1449)
remote: Compressing objects: 5% (73/1449)
remote: Compressing objects: 6% (87/1449)
remote: Compressing objects: 7% (102/1449)
remote: Compressing objects: 8% (116/1449)
remote: Compressing objects: 9% (131/1449)
remote: Compressing objects: 10% (145/1449)
remote: Compressing objects: 11% (160/1449)
remote: Compressing objects: 12% (174/1449)
remote: Compressing objects: 13% (189/1449)
remote: Compressing objects: 14% (203/1449)
remote: Compressing objects: 15% (218/1449)
remote: Compressing objects: 16% (232/1449)
remote: Compressing objects: 17% (247/1449)
remote: Compressing objects: 18% (261/1449)
remote: Compressing objects: 19% (276/1449)
remote: Compressing objects: 20% (290/1449)
remote: Compressing objects: 21% (305/1449)
remote: Compressing objects: 22% (319/1449)
remote: Compressing objects: 23% (334/1449)
remote: Compressing objects: 24% (348/1449)
remote: Compressing objects: 25% (363/1449)
remote: Compressing objects: 26% (377/1449)
remote: Compressing objects: 27% (392/1449)
remote: Compressing objects: 28% (406/1449)
remote: Compressing objects: 29% (421/1449)
remote: Compressing objects: 30% (435/1449)
remote: Compressing objects: 31% (450/1449)
remote: Compressing objects: 32% (464/1449)
remote: Compressing objects: 33% (479/1449)
remote: Compressing objects: 34% (493/1449)
remote: Compressing objects: 35% (508/1449)
remote: Compressing objects: 36% (522/1449)
remote: Compressing objects: 37% (537/1449)
remote: Compressing objects: 38% (551/1449)
remote: Compressing objects: 39% (566/1449)
remote: Compressing objects: 40% (580/1449)
remote: Compressing objects: 41% (595/1449)
remote: Compressing objects: 42% (609/1449)
remote: Compressing objects: 43% (624/1449)
remote: Compressing objects: 44% (638/1449)
remote: Compressing objects: 45% (653/1449)
remote: Compressing objects: 46% (667/1449)
remote: Compressing objects: 47% (682/1449)
remote: Compressing objects: 48% (696/1449)
remote: Compressing objects: 49% (711/1449)
remote: Compressing objects: 50% (725/1449)
remote: Compressing objects: 51% (739/1449)
remote: Compressing objects: 52% (754/1449)
remote: Compressing objects: 53% (768/1449)
remote: Compressing objects: 54% (783/1449)
remote: Compressing objects: 55% (797/1449)
remote: Compressing objects: 56% (812/1449)
remote: Compressing objects: 57% (826/1449)
remote: Compressing objects: 58% (841/1449)
remote: Compressing objects: 59% (855/1449)
remote: Compressing objects: 60% (870/1449)
remote: Compressing objects: 61% (884/1449)
remote: Compressing objects: 62% (899/1449)
remote: Compressing objects: 63% (913/1449)
remote: Compressing objects: 64% (928/1449)
remote: Compressing objects: 65% (942/1449)
remote: Compressing objects: 66% (957/1449)
remote: Compressing objects: 67% (971/1449)
remote: Compressing objects: 68% (986/1449)
remote: Compressing objects: 69% (1000/1449)
remote: Compressing objects: 70% (1015/1449)
remote: Compressing objects: 71% (1029/1449)
remote: Compressing objects: 72% (1044/1449)
remote: Compressing objects: 73% (1058/1449)
remote: Compressing objects: 74% (1073/1449)
remote: Compressing objects: 75% (1087/1449)
remote: Compressing objects: 76% (1102/1449)
remote: Compressing objects: 77% (1116/1449)
remote: Compressing objects: 78% (1131/1449)
remote: Compressing objects: 79% (1145/1449)
remote: Compressing objects: 80% (1160/1449)
remote: Compressing objects: 81% (1174/1449)
remote: Compressing objects: 82% (1189/1449)
remote: Compressing objects: 83% (1203/1449)
remote: Compressing objects: 84% (1218/1449)
remote: Compressing objects: 85% (1232/1449)
remote: Compressing objects: 86% (1247/1449)
remote: Compressing objects: 87% (1261/1449)
remote: Compressing objects: 88% (1276/1449)
remote: Compressing objects: 89% (1290/1449)
remote: Compressing objects: 90% (1305/1449)
remote: Compressing objects: 91% (1319/1449)
remote: Compressing objects: 92% (1334/1449)
remote: Compressing objects: 93% (1348/1449)
remote: Compressing objects: 94% (1363/1449)
remote: Compressing objects: 95% (1377/1449)
remote: Compressing objects: 96% (1392/1449)
remote: Compressing objects: 97% (1406/1449)
remote: Compressing objects: 98% (1421/1449)
remote: Compressing objects: 99% (1435/1449)
remote: Compressing objects: 100% (1449/1449)
remote: Compressing objects: 100% (1449/1449), done.
2.31 s
Receiving objects: 0% (1/2384)
Receiving objects: 1% (24/2384)
Receiving objects: 2% (48/2384)
Receiving objects: 3% (72/2384)
Receiving objects: 4% (96/2384)
Receiving objects: 5% (120/2384)
Receiving objects: 6% (144/2384)
Receiving objects: 7% (167/2384)
Receiving objects: 8% (191/2384)
Receiving objects: 9% (215/2384)
Receiving objects: 10% (239/2384)
Receiving objects: 11% (263/2384)
Receiving objects: 12% (287/2384)
Receiving objects: 13% (310/2384)
Receiving objects: 14% (334/2384)
Receiving objects: 15% (358/2384)
Receiving objects: 16% (382/2384)
Receiving objects: 17% (406/2384)
Receiving objects: 18% (430/2384)
Receiving objects: 19% (453/2384)
Receiving objects: 20% (477/2384)
Receiving objects: 21% (501/2384)
Receiving objects: 22% (525/2384)
Receiving objects: 23% (549/2384)
Receiving objects: 24% (573/2384)
Receiving objects: 25% (596/2384)
Receiving objects: 26% (620/2384)
Receiving objects: 27% (644/2384)
Receiving objects: 28% (668/2384)
Receiving objects: 29% (692/2384)
Receiving objects: 30% (716/2384)
Receiving objects: 31% (740/2384)
Receiving objects: 32% (763/2384)
Receiving objects: 33% (787/2384)
Receiving objects: 34% (811/2384)
Receiving objects: 35% (835/2384)
Receiving objects: 36% (859/2384)
Receiving objects: 37% (883/2384)
Receiving objects: 38% (906/2384)
Receiving objects: 39% (930/2384)
Receiving objects: 40% (954/2384)
Receiving objects: 41% (978/2384), 9.97 MiB | 19.93 MiB/s
Receiving objects: 42% (1002/2384), 9.97 MiB | 19.93 MiB/s
Receiving objects: 43% (1026/2384), 9.97 MiB | 19.93 MiB/s
Receiving objects: 44% (1049/2384), 9.97 MiB | 19.93 MiB/s
Receiving objects: 45% (1073/2384), 9.97 MiB | 19.93 MiB/s
Receiving objects: 46% (1097/2384), 9.97 MiB | 19.93 MiB/s
Receiving objects: 47% (1121/2384), 9.97 MiB | 19.93 MiB/s
Receiving objects: 48% (1145/2384), 9.97 MiB | 19.93 MiB/s
Receiving objects: 49% (1169/2384), 9.97 MiB | 19.93 MiB/s
Receiving objects: 50% (1192/2384), 9.97 MiB | 19.93 MiB/s
Receiving objects: 51% (1216/2384), 9.97 MiB | 19.93 MiB/s
Receiving objects: 52% (1240/2384), 9.97 MiB | 19.93 MiB/s
Receiving objects: 53% (1264/2384), 9.97 MiB | 19.93 MiB/s
Receiving objects: 54% (1288/2384), 9.97 MiB | 19.93 MiB/s
Receiving objects: 55% (1312/2384), 9.97 MiB | 19.93 MiB/s
Receiving objects: 56% (1336/2384), 9.97 MiB | 19.93 MiB/s
Receiving objects: 57% (1359/2384), 9.97 MiB | 19.93 MiB/s
Receiving objects: 58% (1383/2384), 9.97 MiB | 19.93 MiB/s
Receiving objects: 59% (1407/2384), 9.97 MiB | 19.93 MiB/s
Receiving objects: 60% (1431/2384), 9.97 MiB | 19.93 MiB/s
Receiving objects: 61% (1455/2384), 9.97 MiB | 19.93 MiB/s
Receiving objects: 62% (1479/2384), 9.97 MiB | 19.93 MiB/s
Receiving objects: 63% (1502/2384), 9.97 MiB | 19.93 MiB/s
Receiving objects: 64% (1526/2384), 9.97 MiB | 19.93 MiB/s
Receiving objects: 65% (1550/2384), 9.97 MiB | 19.93 MiB/s
Receiving objects: 66% (1574/2384), 9.97 MiB | 19.93 MiB/s
Receiving objects: 67% (1598/2384), 9.97 MiB | 19.93 MiB/s
Receiving objects: 68% (1622/2384), 9.97 MiB | 19.93 MiB/s
Receiving objects: 69% (1645/2384), 9.97 MiB | 19.93 MiB/s
Receiving objects: 70% (1669/2384), 9.97 MiB | 19.93 MiB/s
Receiving objects: 71% (1693/2384), 9.97 MiB | 19.93 MiB/s
Receiving objects: 72% (1717/2384), 9.97 MiB | 19.93 MiB/s
Receiving objects: 73% (1741/2384), 9.97 MiB | 19.93 MiB/s
Receiving objects: 74% (1765/2384), 9.97 MiB | 19.93 MiB/s
Receiving objects: 75% (1788/2384), 9.97 MiB | 19.93 MiB/s
Receiving objects: 76% (1812/2384), 9.97 MiB | 19.93 MiB/s
Receiving objects: 77% (1836/2384), 9.97 MiB | 19.93 MiB/s
Receiving objects: 78% (1860/2384), 9.97 MiB | 19.93 MiB/s
Receiving objects: 79% (1884/2384), 9.97 MiB | 19.93 MiB/s
Receiving objects: 80% (1908/2384), 9.97 MiB | 19.93 MiB/s
Receiving objects: 81% (1932/2384), 9.97 MiB | 19.93 MiB/s
Receiving objects: 82% (1955/2384), 9.97 MiB | 19.93 MiB/s
Receiving objects: 83% (1979/2384), 9.97 MiB | 19.93 MiB/s
Receiving objects: 84% (2003/2384), 9.97 MiB | 19.93 MiB/s
Receiving objects: 85% (2027/2384), 9.97 MiB | 19.93 MiB/s
Receiving objects: 86% (2051/2384), 9.97 MiB | 19.93 MiB/s
Receiving objects: 87% (2075/2384), 9.97 MiB | 19.93 MiB/s
Receiving objects: 88% (2098/2384), 9.97 MiB | 19.93 MiB/s
Receiving objects: 89% (2122/2384), 9.97 MiB | 19.93 MiB/s
Receiving objects: 90% (2146/2384), 9.97 MiB | 19.93 MiB/s
Receiving objects: 91% (2170/2384), 9.97 MiB | 19.93 MiB/s
Receiving objects: 92% (2194/2384), 9.97 MiB | 19.93 MiB/s
Receiving objects: 93% (2218/2384), 9.97 MiB | 19.93 MiB/s
Receiving objects: 94% (2241/2384), 9.97 MiB | 19.93 MiB/s
Receiving objects: 95% (2265/2384), 9.97 MiB | 19.93 MiB/s
Receiving objects: 96% (2289/2384), 9.97 MiB | 19.93 MiB/s
Receiving objects: 97% (2313/2384), 9.97 MiB | 19.93 MiB/s
Receiving objects: 98% (2337/2384), 9.97 MiB | 19.93 MiB/s
Receiving objects: 99% (2361/2384), 9.97 MiB | 19.93 MiB/s
remote: Total 2384 (delta 1015), reused 1619 (delta 863), pack-reused 0 (from 0)
2.31 s
Receiving objects: 100% (2384/2384), 9.97 MiB | 19.93 MiB/s
Receiving objects: 100% (2384/2384), 16.04 MiB | 24.02 MiB/s, done.
2.32 s
Resolving deltas: 0% (0/1015)
Resolving deltas: 1% (12/1015)
Resolving deltas: 2% (22/1015)
Resolving deltas: 3% (31/1015)
Resolving deltas: 4% (41/1015)
Resolving deltas: 5% (51/1015)
Resolving deltas: 6% (61/1015)
Resolving deltas: 7% (72/1015)
Resolving deltas: 8% (86/1015)
Resolving deltas: 9% (92/1015)
Resolving deltas: 10% (102/1015)
Resolving deltas: 11% (112/1015)
Resolving deltas: 12% (122/1015)
Resolving deltas: 13% (132/1015)
Resolving deltas: 14% (143/1015)
Resolving deltas: 15% (153/1015)
Resolving deltas: 16% (163/1015)
Resolving deltas: 17% (173/1015)
Resolving deltas: 18% (183/1015)
Resolving deltas: 19% (193/1015)
Resolving deltas: 20% (203/1015)
Resolving deltas: 21% (214/1015)
Resolving deltas: 22% (224/1015)
Resolving deltas: 23% (234/1015)
Resolving deltas: 24% (244/1015)
Resolving deltas: 25% (254/1015)
Resolving deltas: 26% (264/1015)
Resolving deltas: 27% (275/1015)
Resolving deltas: 28% (285/1015)
Resolving deltas: 29% (295/1015)
Resolving deltas: 30% (305/1015)
Resolving deltas: 31% (315/1015)
Resolving deltas: 32% (325/1015)
Resolving deltas: 33% (335/1015)
Resolving deltas: 34% (346/1015)
Resolving deltas: 35% (356/1015)
Resolving deltas: 36% (366/1015)
Resolving deltas: 37% (376/1015)
Resolving deltas: 38% (386/1015)
Resolving deltas: 39% (396/1015)
Resolving deltas: 40% (406/1015)
Resolving deltas: 41% (417/1015)
Resolving deltas: 42% (427/1015)
Resolving deltas: 43% (437/1015)
Resolving deltas: 44% (447/1015)
Resolving deltas: 45% (457/1015)
Resolving deltas: 46% (467/1015)
Resolving deltas: 47% (478/1015)
Resolving deltas: 48% (488/1015)
Resolving deltas: 49% (498/1015)
Resolving deltas: 50% (508/1015)
Resolving deltas: 51% (518/1015)
Resolving deltas: 52% (528/1015)
Resolving deltas: 53% (538/1015)
Resolving deltas: 54% (549/1015)
Resolving deltas: 55% (559/1015)
Resolving deltas: 56% (569/1015)
Resolving deltas: 57% (579/1015)
Resolving deltas: 58% (590/1015)
Resolving deltas: 59% (599/1015)
Resolving deltas: 60% (609/1015)
Resolving deltas: 61% (620/1015)
Resolving deltas: 62% (630/1015)
Resolving deltas: 63% (640/1015)
Resolving deltas: 64% (650/1015)
Resolving deltas: 65% (660/1015)
Resolving deltas: 66% (670/1015)
Resolving deltas: 67% (681/1015)
Resolving deltas: 68% (691/1015)
Resolving deltas: 69% (701/1015)
Resolving deltas: 70% (711/1015)
Resolving deltas: 71% (721/1015)
Resolving deltas: 72% (731/1015)
Resolving deltas: 73% (741/1015)
Resolving deltas: 74% (752/1015)
Resolving deltas: 75% (762/1015)
Resolving deltas: 76% (772/1015)
Resolving deltas: 77% (782/1015)
Resolving deltas: 78% (792/1015)
Resolving deltas: 79% (803/1015)
Resolving deltas: 80% (812/1015)
Resolving deltas: 81% (823/1015)
Resolving deltas: 82% (833/1015)
Resolving deltas: 83% (843/1015)
Resolving deltas: 84% (853/1015)
Resolving deltas: 85% (863/1015)
Resolving deltas: 86% (873/1015)
Resolving deltas: 87% (884/1015)
Resolving deltas: 88% (894/1015)
Resolving deltas: 89% (904/1015)
Resolving deltas: 90% (914/1015)
Resolving deltas: 91% (924/1015)
Resolving deltas: 92% (934/1015)
Resolving deltas: 93% (944/1015)
Resolving deltas: 94% (955/1015)
Resolving deltas: 95% (965/1015)
Resolving deltas: 96% (975/1015)
Resolving deltas: 97% (985/1015)
Resolving deltas: 98% (995/1015)
Resolving deltas: 99% (1005/1015)
Resolving deltas: 100% (1015/1015)
Resolving deltas: 100% (1015/1015), done.
2.35 s
From https://github.com/alphal00p/gammaloop
2.35 s
* branch 17cab6f72c1df1d8c1446d47281e0e8c60d52e8b -> FETCH_HEAD
10.96 s
11.77 s
Downloading cached gammaloop-python-module from https://cache.nix-ci.com
11.80 s
Downloading cached gammaloop-crate-test-dependencies-6e86b9f305aafb81-inputs from https://cache.nix-ci.com
13.12 s
Downloaded cached gammaloop-python-module (146.2 MiB) in 1.3s
13.12 s
Progress: 0 of 5 built, 1 of 5 downloaded from cache (1 downloading)
35.57 s
Downloaded cached gammaloop-crate-test-dependencies-6e86b9f305aafb81-inputs (2.4 GiB) in 23.7s
35.57 s
Progress: 0 of 4 built, 2 of 5 downloaded from cache
35.57 s
Downloading cached gammaloop-crate-test-dependencies-6e86b9f305aafb81-deps from https://cache.nix-ci.com
35.57 s
Downloaded cached gammaloop-crate-test-dependencies-6e86b9f305aafb81-deps in 0ms
35.57 s
Progress: 0 of 4 built, 3 of 5 downloaded from cache
35.57 s
Downloading cached gammaloop-crate-test-dependencies-d6e55b48f8214f9c-inputs from https://cache.nix-ci.com
56.27 s
Downloaded cached gammaloop-crate-test-dependencies-d6e55b48f8214f9c-inputs (3.1 GiB) in 20.6s
56.27 s
Progress: 0 of 4 built, 4 of 5 downloaded from cache
56.27 s
Downloading cached gammaloop-crate-test-dependencies-d6e55b48f8214f9c-deps from https://cache.nix-ci.com
56.53 s
Downloaded cached gammaloop-crate-test-dependencies-d6e55b48f8214f9c-deps (30 MiB) in 265ms
56.53 s
Progress: 0 of 4 built, 5 of 5 downloaded from cache
56.93 s
Building /nix/store/hb7x0463d6dcc0wc3si0q2qcxyznppbi-gammaloop-crate-test-binaries-gammaloop-integration-tests-d6e55b48f8214f9c-inputs.drv
68.14 s
[gammaloop-crate-test-binaries-gammaloop-integration-tests-d6e55b48f8214f9c-inputs:post-build] Uploading to the NixCI cache: /nix/store/9jjn08k46n5wvkcyymcnbaqw3xywg4z7-gammaloop-crate-test-binaries-gammaloop-integration-tests-d6e55b48f8214f9c-inputs
68.46 s
[gammaloop-crate-test-binaries-gammaloop-integration-tests-d6e55b48f8214f9c-inputs:post-build] warning: 'warn-short-path-literals' is deprecated, use 'lint-short-path-literals = ignore' instead
68.58 s
[gammaloop-crate-test-binaries-gammaloop-integration-tests-d6e55b48f8214f9c-inputs:post-build] copying 1 paths...
68.58 s
[gammaloop-crate-test-binaries-gammaloop-integration-tests-d6e55b48f8214f9c-inputs:post-build] copying path '/nix/store/9jjn08k46n5wvkcyymcnbaqw3xywg4z7-gammaloop-crate-test-binaries-gammaloop-integration-tests-d6e55b48f8214f9c-inputs' to 'https://cache.nix-ci.com'...
198.13 s
[gammaloop-crate-test-binaries-gammaloop-integration-tests-d6e55b48f8214f9c-inputs:post-build] warning: 'warn-short-path-literals' is deprecated, use 'lint-short-path-literals = ignore' instead
198.41 s
[gammaloop-crate-test-binaries-gammaloop-integration-tests-d6e55b48f8214f9c-inputs:post-build] copying 1 paths...
198.41 s
[gammaloop-crate-test-binaries-gammaloop-integration-tests-d6e55b48f8214f9c-inputs:post-build] copying path '/nix/store/hb7x0463d6dcc0wc3si0q2qcxyznppbi-gammaloop-crate-test-binaries-gammaloop-integration-tests-d6e55b48f8214f9c-inputs.drv' to 'https://cache.nix-ci.com'...
198.73 s
Uploaded gammaloop-crate-test-binaries-gammaloop-integration-tests-d6e55b48f8214f9c-inputs in 2m10s
198.73 s
Progress: 1 of 4 built, 5 of 5 downloaded from cache
198.73 s
Built gammaloop-crate-test-binaries-gammaloop-integration-tests-d6e55b48f8214f9c-inputs in 2m21s
198.84 s
Building /nix/store/id05n9ldlsz3iwbdiqvlzf69f1zh838x-gammaloop-crate-test-binaries-gammaloop-integration-tests-d6e55b48f8214f9c-deps-0.1.0.drv
199.00 s
[gammaloop-crate-test-binaries-gammaloop-integration-tests-d6e55b48f8214f9c-deps] Phase: unpackPhase
199.01 s
[gammaloop-crate-test-binaries-gammaloop-integration-tests-d6e55b48f8214f9c-deps] unpacking source archive /nix/store/psvpmn2b6k8zcmqkjki4va0q3z3cd12j-source
199.07 s
[gammaloop-crate-test-binaries-gammaloop-integration-tests-d6e55b48f8214f9c-deps] source root is source
199.09 s
[gammaloop-crate-test-binaries-gammaloop-integration-tests-d6e55b48f8214f9c-deps] Phase: patchPhase
199.18 s
[gammaloop-crate-test-binaries-gammaloop-integration-tests-d6e55b48f8214f9c-deps] Executing configureCargoCommonVars
199.18 s
[gammaloop-crate-test-binaries-gammaloop-integration-tests-d6e55b48f8214f9c-deps] copying cargo artifacts from /nix/store/9jjn08k46n5wvkcyymcnbaqw3xywg4z7-gammaloop-crate-test-binaries-gammaloop-integration-tests-d6e55b48f8214f9c-inputs/target to target
199.18 s
[gammaloop-crate-test-binaries-gammaloop-integration-tests-d6e55b48f8214f9c-deps] will deep copy artifacts (instead of symlinking) as requested
202.00 s
[gammaloop-crate-test-binaries-gammaloop-integration-tests-d6e55b48f8214f9c-deps] Phase: updateAutotoolsGnuConfigScriptsPhase
202.05 s
[gammaloop-crate-test-binaries-gammaloop-integration-tests-d6e55b48f8214f9c-deps] Phase: configurePhase
202.07 s
[gammaloop-crate-test-binaries-gammaloop-integration-tests-d6e55b48f8214f9c-deps] will append /build/source/.cargo-home/config.toml with contents of /nix/store/5drf77x6km4ky7gwlrzdx9bbd6fz09g3-vendor-cargo-deps/config.toml
202.07 s
[gammaloop-crate-test-binaries-gammaloop-integration-tests-d6e55b48f8214f9c-deps] default configurePhase, nothing to do
202.08 s
[gammaloop-crate-test-binaries-gammaloop-integration-tests-d6e55b48f8214f9c-deps] Phase: buildPhase
202.11 s
[gammaloop-crate-test-binaries-gammaloop-integration-tests-d6e55b48f8214f9c-deps] +++ command cargo --version
202.12 s
[gammaloop-crate-test-binaries-gammaloop-integration-tests-d6e55b48f8214f9c-deps] cargo 1.97.0 (c980f4866 2026-06-30)
202.12 s
[gammaloop-crate-test-binaries-gammaloop-integration-tests-d6e55b48f8214f9c-deps] +++ command cargo test --profile ci-optim --no-run --offline -p gammaloop-integration-tests --features gammaloop-integration-tests/python-api-tests
204.27 s
[gammaloop-crate-test-binaries-gammaloop-integration-tests-d6e55b48f8214f9c-deps] Compiling gammaloop-integration-tests v0.1.0 (/build/source/tests)
204.40 s
[gammaloop-crate-test-binaries-gammaloop-integration-tests-d6e55b48f8214f9c-deps] error[E0560] : struct `CutInfo` has no field named `lmb_channel_id`
204.40 s
[gammaloop-crate-test-binaries-gammaloop-integration-tests-d6e55b48f8214f9c-deps] --> tests/tests/test_differential.rs:86:13
204.40 s
[gammaloop-crate-test-binaries-gammaloop-integration-tests-d6e55b48f8214f9c-deps] |
204.40 s
[gammaloop-crate-test-binaries-gammaloop-integration-tests-d6e55b48f8214f9c-deps] 86 | lmb_channel_id: None,
204.40 s
[gammaloop-crate-test-binaries-gammaloop-integration-tests-d6e55b48f8214f9c-deps] | ^^^^^^^^^^^^^^ `CutInfo` does not have this field
204.40 s
[gammaloop-crate-test-binaries-gammaloop-integration-tests-d6e55b48f8214f9c-deps] |
204.40 s
[gammaloop-crate-test-binaries-gammaloop-integration-tests-d6e55b48f8214f9c-deps] = note : available fields are: `sampling_channel_id`, `sampling_channel_edge_ids`
204.40 s
[gammaloop-crate-test-binaries-gammaloop-integration-tests-d6e55b48f8214f9c-deps]
204.40 s
[gammaloop-crate-test-binaries-gammaloop-integration-tests-d6e55b48f8214f9c-deps] error[E0560] : struct `CutInfo` has no field named `lmb_channel_edge_ids`
204.40 s
[gammaloop-crate-test-binaries-gammaloop-integration-tests-d6e55b48f8214f9c-deps] --> tests/tests/test_differential.rs:87:13
204.40 s
[gammaloop-crate-test-binaries-gammaloop-integration-tests-d6e55b48f8214f9c-deps] |
204.40 s
[gammaloop-crate-test-binaries-gammaloop-integration-tests-d6e55b48f8214f9c-deps] 87 | lmb_channel_edge_ids: None,
204.40 s
[gammaloop-crate-test-binaries-gammaloop-integration-tests-d6e55b48f8214f9c-deps] | ^^^^^^^^^^^^^^^^^^^^ `CutInfo` does not have this field
204.40 s
[gammaloop-crate-test-binaries-gammaloop-integration-tests-d6e55b48f8214f9c-deps] |
204.40 s
[gammaloop-crate-test-binaries-gammaloop-integration-tests-d6e55b48f8214f9c-deps] = note : available fields are: `sampling_channel_id`, `sampling_channel_edge_ids`
204.40 s
[gammaloop-crate-test-binaries-gammaloop-integration-tests-d6e55b48f8214f9c-deps]
204.47 s
[gammaloop-crate-test-binaries-gammaloop-integration-tests-d6e55b48f8214f9c-deps] For more information about this error, try `rustc --explain E0560`.
204.48 s
[gammaloop-crate-test-binaries-gammaloop-integration-tests-d6e55b48f8214f9c-deps] error : could not compile `gammaloop-integration-tests` (test "test_differential") due to 2 previous errors
204.48 s
[gammaloop-crate-test-binaries-gammaloop-integration-tests-d6e55b48f8214f9c-deps] warning : build failed, waiting for other jobs to finish...
204.61 s
[gammaloop-crate-test-binaries-gammaloop-integration-tests-d6e55b48f8214f9c-deps] error[E0609] : no field `lmb_channel_edge_ids` on type `CutInfo`
204.61 s
[gammaloop-crate-test-binaries-gammaloop-integration-tests-d6e55b48f8214f9c-deps] --> tests/tests/test_evaluation_api.rs:311:10
204.61 s
[gammaloop-crate-test-binaries-gammaloop-integration-tests-d6e55b48f8214f9c-deps] |
204.61 s
[gammaloop-crate-test-binaries-gammaloop-integration-tests-d6e55b48f8214f9c-deps] 311 | .lmb_channel_edge_ids
204.61 s
[gammaloop-crate-test-binaries-gammaloop-integration-tests-d6e55b48f8214f9c-deps] | ^^^^^^^^^^^^^^^^^^^^ unknown field
204.61 s
[gammaloop-crate-test-binaries-gammaloop-integration-tests-d6e55b48f8214f9c-deps] |
204.61 s
[gammaloop-crate-test-binaries-gammaloop-integration-tests-d6e55b48f8214f9c-deps] = note : available fields are: `particle_pdgs`, `cut_id`, `graph_id`, `graph_group_id`, `orientation_id` ... and 2 others
204.61 s
[gammaloop-crate-test-binaries-gammaloop-integration-tests-d6e55b48f8214f9c-deps]
204.66 s
[gammaloop-crate-test-binaries-gammaloop-integration-tests-d6e55b48f8214f9c-deps] error[E0609] : no field `lmb_channel_edge_ids` on type `CutInfo`
204.66 s
[gammaloop-crate-test-binaries-gammaloop-integration-tests-d6e55b48f8214f9c-deps] --> tests/tests/test_evaluation_api.rs:591:26
204.66 s
[gammaloop-crate-test-binaries-gammaloop-integration-tests-d6e55b48f8214f9c-deps] |
204.66 s
[gammaloop-crate-test-binaries-gammaloop-integration-tests-d6e55b48f8214f9c-deps] 591 | .lmb_channel_edge_ids
204.66 s
[gammaloop-crate-test-binaries-gammaloop-integration-tests-d6e55b48f8214f9c-deps] | ^^^^^^^^^^^^^^^^^^^^ unknown field
204.66 s
[gammaloop-crate-test-binaries-gammaloop-integration-tests-d6e55b48f8214f9c-deps] |
204.66 s
[gammaloop-crate-test-binaries-gammaloop-integration-tests-d6e55b48f8214f9c-deps] = note : available fields are: `particle_pdgs`, `cut_id`, `graph_id`, `graph_group_id`, `orientation_id` ... and 2 others
204.66 s
[gammaloop-crate-test-binaries-gammaloop-integration-tests-d6e55b48f8214f9c-deps]
204.74 s
[gammaloop-crate-test-binaries-gammaloop-integration-tests-d6e55b48f8214f9c-deps] error[E0609] : no field `lmb_channel_edge_ids` on type `CutInfo`
204.74 s
[gammaloop-crate-test-binaries-gammaloop-integration-tests-d6e55b48f8214f9c-deps] --> tests/tests/test_evaluation_api.rs:1177:18
204.74 s
[gammaloop-crate-test-binaries-gammaloop-integration-tests-d6e55b48f8214f9c-deps] |
204.74 s
[gammaloop-crate-test-binaries-gammaloop-integration-tests-d6e55b48f8214f9c-deps] 1177 | .lmb_channel_edge_ids
204.74 s
[gammaloop-crate-test-binaries-gammaloop-integration-tests-d6e55b48f8214f9c-deps] | ^^^^^^^^^^^^^^^^^^^^ unknown field
204.74 s
[gammaloop-crate-test-binaries-gammaloop-integration-tests-d6e55b48f8214f9c-deps] |
204.74 s
[gammaloop-crate-test-binaries-gammaloop-integration-tests-d6e55b48f8214f9c-deps] = note : available fields are: `particle_pdgs`, `cut_id`, `graph_id`, `graph_group_id`, `orientation_id` ... and 2 others
204.74 s
[gammaloop-crate-test-binaries-gammaloop-integration-tests-d6e55b48f8214f9c-deps]
204.93 s
[gammaloop-crate-test-binaries-gammaloop-integration-tests-d6e55b48f8214f9c-deps] error[E0609] : no field `lmb_channel_edge_ids` on type `CutInfo`
204.93 s
[gammaloop-crate-test-binaries-gammaloop-integration-tests-d6e55b48f8214f9c-deps] --> tests/tests/test_evaluation_api.rs:1222:22
204.93 s
[gammaloop-crate-test-binaries-gammaloop-integration-tests-d6e55b48f8214f9c-deps] |
204.93 s
[gammaloop-crate-test-binaries-gammaloop-integration-tests-d6e55b48f8214f9c-deps] 1222 | .lmb_channel_edge_ids
204.93 s
[gammaloop-crate-test-binaries-gammaloop-integration-tests-d6e55b48f8214f9c-deps] | ^^^^^^^^^^^^^^^^^^^^ unknown field
204.93 s
[gammaloop-crate-test-binaries-gammaloop-integration-tests-d6e55b48f8214f9c-deps] |
204.93 s
[gammaloop-crate-test-binaries-gammaloop-integration-tests-d6e55b48f8214f9c-deps] = note : available fields are: `particle_pdgs`, `cut_id`, `graph_id`, `graph_group_id`, `orientation_id` ... and 2 others
204.93 s
[gammaloop-crate-test-binaries-gammaloop-integration-tests-d6e55b48f8214f9c-deps]
204.94 s
[gammaloop-crate-test-binaries-gammaloop-integration-tests-d6e55b48f8214f9c-deps] error[E0609] : no field `lmb_channel_edge_ids` on type `CutInfo`
204.94 s
[gammaloop-crate-test-binaries-gammaloop-integration-tests-d6e55b48f8214f9c-deps] --> tests/tests/test_evaluation_api.rs:1281:14
204.94 s
[gammaloop-crate-test-binaries-gammaloop-integration-tests-d6e55b48f8214f9c-deps] |
204.94 s
[gammaloop-crate-test-binaries-gammaloop-integration-tests-d6e55b48f8214f9c-deps] 1281 | .lmb_channel_edge_ids
204.94 s
[gammaloop-crate-test-binaries-gammaloop-integration-tests-d6e55b48f8214f9c-deps] | ^^^^^^^^^^^^^^^^^^^^ unknown field
204.94 s
[gammaloop-crate-test-binaries-gammaloop-integration-tests-d6e55b48f8214f9c-deps] |
204.94 s
[gammaloop-crate-test-binaries-gammaloop-integration-tests-d6e55b48f8214f9c-deps] = note : available fields are: `particle_pdgs`, `cut_id`, `graph_id`, `graph_group_id`, `orientation_id` ... and 2 others
204.94 s
[gammaloop-crate-test-binaries-gammaloop-integration-tests-d6e55b48f8214f9c-deps]
205.06 s
[gammaloop-crate-test-binaries-gammaloop-integration-tests-d6e55b48f8214f9c-deps] error[E0609] : no field `lmb_channel_edge_ids` on type `CutInfo`
205.06 s
[gammaloop-crate-test-binaries-gammaloop-integration-tests-d6e55b48f8214f9c-deps] --> tests/tests/test_evaluation_api.rs:1428:18
205.06 s
[gammaloop-crate-test-binaries-gammaloop-integration-tests-d6e55b48f8214f9c-deps] |
205.06 s
[gammaloop-crate-test-binaries-gammaloop-integration-tests-d6e55b48f8214f9c-deps] 1428 | .lmb_channel_edge_ids
205.06 s
[gammaloop-crate-test-binaries-gammaloop-integration-tests-d6e55b48f8214f9c-deps] | ^^^^^^^^^^^^^^^^^^^^ unknown field
205.06 s
[gammaloop-crate-test-binaries-gammaloop-integration-tests-d6e55b48f8214f9c-deps] |
205.06 s
[gammaloop-crate-test-binaries-gammaloop-integration-tests-d6e55b48f8214f9c-deps] = note : available fields are: `particle_pdgs`, `cut_id`, `graph_id`, `graph_group_id`, `orientation_id` ... and 2 others
205.06 s
[gammaloop-crate-test-binaries-gammaloop-integration-tests-d6e55b48f8214f9c-deps]
205.38 s
[gammaloop-crate-test-binaries-gammaloop-integration-tests-d6e55b48f8214f9c-deps] For more information about this error, try `rustc --explain E0609`.
205.41 s
[gammaloop-crate-test-binaries-gammaloop-integration-tests-d6e55b48f8214f9c-deps] error : could not compile `gammaloop-integration-tests` (test "test_evaluation_api") due to 6 previous errors
206.88 s
[gammaloop-crate-test-binaries-gammaloop-integration-tests-d6e55b48f8214f9c-deps] error[E0609] : no field `lmb_channel_id` on type `CutInfo`
206.88 s
[gammaloop-crate-test-binaries-gammaloop-integration-tests-d6e55b48f8214f9c-deps] --> tests/tests/test_runs/utils.rs:568:36
206.88 s
[gammaloop-crate-test-binaries-gammaloop-integration-tests-d6e55b48f8214f9c-deps] |
206.88 s
[gammaloop-crate-test-binaries-gammaloop-integration-tests-d6e55b48f8214f9c-deps] 568 | event.cut_info.lmb_channel_id,
206.88 s
[gammaloop-crate-test-binaries-gammaloop-integration-tests-d6e55b48f8214f9c-deps] | ^^^^^^^^^^^^^^ unknown field
206.88 s
[gammaloop-crate-test-binaries-gammaloop-integration-tests-d6e55b48f8214f9c-deps] |
206.88 s
[gammaloop-crate-test-binaries-gammaloop-integration-tests-d6e55b48f8214f9c-deps] = note : available fields are: `particle_pdgs`, `cut_id`, `graph_id`, `graph_group_id`, `orientation_id` ... and 2 others
206.88 s
[gammaloop-crate-test-binaries-gammaloop-integration-tests-d6e55b48f8214f9c-deps]
206.88 s
[gammaloop-crate-test-binaries-gammaloop-integration-tests-d6e55b48f8214f9c-deps] error[E0609] : no field `lmb_channel_id` on type `CutInfo`
206.88 s
[gammaloop-crate-test-binaries-gammaloop-integration-tests-d6e55b48f8214f9c-deps] --> tests/tests/test_runs/utils.rs:580:36
206.88 s
[gammaloop-crate-test-binaries-gammaloop-integration-tests-d6e55b48f8214f9c-deps] |
206.88 s
[gammaloop-crate-test-binaries-gammaloop-integration-tests-d6e55b48f8214f9c-deps] 580 | event.cut_info.lmb_channel_id,
206.88 s
[gammaloop-crate-test-binaries-gammaloop-integration-tests-d6e55b48f8214f9c-deps] | ^^^^^^^^^^^^^^ unknown field
206.88 s
[gammaloop-crate-test-binaries-gammaloop-integration-tests-d6e55b48f8214f9c-deps] |
206.88 s
[gammaloop-crate-test-binaries-gammaloop-integration-tests-d6e55b48f8214f9c-deps] = note : available fields are: `particle_pdgs`, `cut_id`, `graph_id`, `graph_group_id`, `orientation_id` ... and 2 others
206.88 s
[gammaloop-crate-test-binaries-gammaloop-integration-tests-d6e55b48f8214f9c-deps]
208.38 s
[gammaloop-crate-test-binaries-gammaloop-integration-tests-d6e55b48f8214f9c-deps] error : could not compile `gammaloop-integration-tests` (test "test_runs") due to 2 previous errors
279.68 s
Progress: 1 of 3 built (1 failed), 5 of 5 downloaded from cache
279.68 s
Failed to build gammaloop-crate-test-binaries-gammaloop-integration-tests-d6e55b48f8214f9c-deps after 1m20s
279.68 s
error: Cannot build '/nix/store/id05n9ldlsz3iwbdiqvlzf69f1zh838x-gammaloop-crate-test-binaries-gammaloop-integration-tests-d6e55b48f8214f9c-deps-0.1.0.drv '.
279.68 s
Reason: builder failed with exit code 101 .
279.68 s
Output paths:
279.68 s
/nix/store/m2x6qq8c5j6rjga09gbywjp2qbvmg7jp-gammaloop-crate-test-binaries-gammaloop-integration-tests-d6e55b48f8214f9c-deps-0.1.0
279.68 s
Last 102 log lines:
279.68 s
> Running phase: unpackPhase
279.68 s
> unpacking source archive /nix/store/psvpmn2b6k8zcmqkjki4va0q3z3cd12j-source
279.68 s
> source root is source
279.68 s
> Running phase: patchPhase
279.68 s
> Executing configureCargoCommonVars
279.68 s
> copying cargo artifacts from /nix/store/9jjn08k46n5wvkcyymcnbaqw3xywg4z7-gammaloop-crate-test-binaries-gammaloop-integration-tests-d6e55b48f8214f9c-inputs/target to target
279.68 s
> will deep copy artifacts (instead of symlinking) as requested
279.68 s
> Running phase: updateAutotoolsGnuConfigScriptsPhase
279.68 s
> Running phase: configurePhase
279.68 s
> will append /build/source/.cargo-home/config.toml with contents of /nix/store/5drf77x6km4ky7gwlrzdx9bbd6fz09g3-vendor-cargo-deps/config.toml
279.68 s
> default configurePhase, nothing to do
279.68 s
> Running phase: buildPhase
279.68 s
> +++ command cargo --version
279.68 s
> cargo 1.97.0 (c980f4866 2026-06-30)
279.68 s
> +++ command cargo test --profile ci-optim --no-run --offline -p gammaloop-integration-tests --features gammaloop-integration-tests/python-api-tests
279.68 s
> Compiling gammaloop-integration-tests v0.1.0 (/build/source/tests)
279.68 s
> error[E0560] : struct `CutInfo` has no field named `lmb_channel_id`
279.68 s
> --> tests/tests/test_differential.rs:86:13
279.68 s
> |
279.68 s
> 86 | lmb_channel_id: None,
279.68 s
> | ^^^^^^^^^^^^^^ `CutInfo` does not have this field
279.68 s
> |
279.68 s
> = note : available fields are: `sampling_channel_id`, `sampling_channel_edge_ids`
279.68 s
>
279.68 s
> error[E0560] : struct `CutInfo` has no field named `lmb_channel_edge_ids`
279.68 s
> --> tests/tests/test_differential.rs:87:13
279.68 s
> |
279.68 s
> 87 | lmb_channel_edge_ids: None,
279.68 s
> | ^^^^^^^^^^^^^^^^^^^^ `CutInfo` does not have this field
279.68 s
> |
279.68 s
> = note : available fields are: `sampling_channel_id`, `sampling_channel_edge_ids`
279.68 s
>
279.68 s
> For more information about this error, try `rustc --explain E0560`.
279.68 s
> error : could not compile `gammaloop-integration-tests` (test "test_differential") due to 2 previous errors
279.68 s
> warning : build failed, waiting for other jobs to finish...
279.68 s
> error[E0609] : no field `lmb_channel_edge_ids` on type `CutInfo`
279.68 s
> --> tests/tests/test_evaluation_api.rs:311:10
279.68 s
> |
279.68 s
> 311 | .lmb_channel_edge_ids
279.68 s
> | ^^^^^^^^^^^^^^^^^^^^ unknown field
279.68 s
> |
279.68 s
> = note : available fields are: `particle_pdgs`, `cut_id`, `graph_id`, `graph_group_id`, `orientation_id` ... and 2 others
279.68 s
>
279.68 s
> error[E0609] : no field `lmb_channel_edge_ids` on type `CutInfo`
279.68 s
> --> tests/tests/test_evaluation_api.rs:591:26
279.68 s
> |
279.68 s
> 591 | .lmb_channel_edge_ids
279.68 s
> | ^^^^^^^^^^^^^^^^^^^^ unknown field
279.68 s
> |
279.68 s
> = note : available fields are: `particle_pdgs`, `cut_id`, `graph_id`, `graph_group_id`, `orientation_id` ... and 2 others
279.68 s
>
279.68 s
> error[E0609] : no field `lmb_channel_edge_ids` on type `CutInfo`
279.68 s
> --> tests/tests/test_evaluation_api.rs:1177:18
279.68 s
> |
279.68 s
> 1177 | .lmb_channel_edge_ids
279.68 s
> | ^^^^^^^^^^^^^^^^^^^^ unknown field
279.68 s
> |
279.68 s
> = note : available fields are: `particle_pdgs`, `cut_id`, `graph_id`, `graph_group_id`, `orientation_id` ... and 2 others
279.68 s
>
279.68 s
> error[E0609] : no field `lmb_channel_edge_ids` on type `CutInfo`
279.68 s
> --> tests/tests/test_evaluation_api.rs:1222:22
279.68 s
> |
279.68 s
> 1222 | .lmb_channel_edge_ids
279.68 s
> | ^^^^^^^^^^^^^^^^^^^^ unknown field
279.68 s
> |
279.68 s
> = note : available fields are: `particle_pdgs`, `cut_id`, `graph_id`, `graph_group_id`, `orientation_id` ... and 2 others
279.68 s
>
279.68 s
> error[E0609] : no field `lmb_channel_edge_ids` on type `CutInfo`
279.68 s
> --> tests/tests/test_evaluation_api.rs:1281:14
279.68 s
> |
279.68 s
> 1281 | .lmb_channel_edge_ids
279.68 s
> | ^^^^^^^^^^^^^^^^^^^^ unknown field
279.68 s
> |
279.68 s
> = note : available fields are: `particle_pdgs`, `cut_id`, `graph_id`, `graph_group_id`, `orientation_id` ... and 2 others
279.68 s
>
279.68 s
> error[E0609] : no field `lmb_channel_edge_ids` on type `CutInfo`
279.68 s
> --> tests/tests/test_evaluation_api.rs:1428:18
279.68 s
> |
279.68 s
> 1428 | .lmb_channel_edge_ids
279.68 s
> | ^^^^^^^^^^^^^^^^^^^^ unknown field
279.68 s
> |
279.68 s
> = note : available fields are: `particle_pdgs`, `cut_id`, `graph_id`, `graph_group_id`, `orientation_id` ... and 2 others
279.68 s
>
279.68 s
> For more information about this error, try `rustc --explain E0609`.
279.68 s
> error : could not compile `gammaloop-integration-tests` (test "test_evaluation_api") due to 6 previous errors
279.68 s
> error[E0609] : no field `lmb_channel_id` on type `CutInfo`
279.68 s
> --> tests/tests/test_runs/utils.rs:568:36
279.68 s
> |
279.68 s
> 568 | event.cut_info.lmb_channel_id,
279.68 s
> | ^^^^^^^^^^^^^^ unknown field
279.68 s
> |
279.68 s
> = note : available fields are: `particle_pdgs`, `cut_id`, `graph_id`, `graph_group_id`, `orientation_id` ... and 2 others
279.68 s
>
279.68 s
> error[E0609] : no field `lmb_channel_id` on type `CutInfo`
279.68 s
> --> tests/tests/test_runs/utils.rs:580:36
279.68 s
> |
279.68 s
> 580 | event.cut_info.lmb_channel_id,
279.68 s
> | ^^^^^^^^^^^^^^ unknown field
279.68 s
> |
279.68 s
> = note : available fields are: `particle_pdgs`, `cut_id`, `graph_id`, `graph_group_id`, `orientation_id` ... and 2 others
279.68 s
>
279.68 s
> error : could not compile `gammaloop-integration-tests` (test "test_runs") due to 2 previous errors
279.68 s
For full logs, run:
279.68 s
nix log /nix/store/id05n9ldlsz3iwbdiqvlzf69f1zh838x-gammaloop-crate-test-binaries-gammaloop-integration-tests-d6e55b48f8214f9c-deps-0.1.0.drv
279.68 s
error: Cannot build '/nix/store/x3c5ksmwa58whva0zl75f0j87pxlnqd2-nix-ci-artifact-barrier-crate-test-binaries-python-api-gammaloop-integration-tests.drv '.
279.68 s
Reason: 1 dependency failed .
279.68 s
Output paths:
279.68 s
/nix/store/5fny7vb1bqf4vms4r263sk9jwa2l9aas-nix-ci-artifact-barrier-crate-test-binaries-python-api-gammaloop-integration-tests
279.68 s
Build failed due to failed dependency
279.76 s
Build failed.