1. 0.00 s $ /nix/store/9ypz3flqsrl5xl495mm8h645gadjsxi1-coreutils-9.11/bin/timeout --kill-after=15s 7200s /nix/store/23zk8sgzamrbmj1fday15szf7f2279s8-nix-2.34.7/bin/nix --extra-experimental-features nix-command --extra-experimental-features flakes --log-format internal-json build --no-link --print-out-paths git+https://github.com/alphal00p/gammaloop?ref=advanced_sampling&rev=2ca19f40f736965c54ac582014fbcfa827cf7c6f&shallow=1#packages.x86_64-linux.crate-test-binaries-gammaloop-integration-tests --print-build-logs
  2. 0.71 s error (ignored): SQLite database '/var/cache/nix-ci-worker/eval-cache-v6/854e49c50ea44ef72bd6818a273a9742ab4c976c3390ebc05e3b6fbda314a964.sqlite' is busy
  3. 6.40 s
  4. 7.24 s Downloading cached gammaloop-crate-test-dependencies-b8cda0d438c96d4f-inputs from https://cache.nix-ci.com
  5. 34.48 s Downloaded cached gammaloop-crate-test-dependencies-b8cda0d438c96d4f-inputs (3.1 GiB) in 27.2s
  6. 34.48 s Progress: 0 of 3 built, 1 of 3 downloaded from cache
  7. 34.48 s Downloading cached gammaloop-crate-test-dependencies-b8cda0d438c96d4f-deps from https://cache.nix-ci.com
  8. 35.13 s Downloaded cached gammaloop-crate-test-dependencies-b8cda0d438c96d4f-deps (30 MiB) in 647ms
  9. 35.13 s Progress: 0 of 3 built, 2 of 3 downloaded from cache
  10. 35.13 s Downloading cached gammaloop-crate-test-binaries-gammaloop-integration-tests-b8cda0d438c96d4f-inputs from https://cache.nix-ci.com
  11. 65.04 s Downloaded cached gammaloop-crate-test-binaries-gammaloop-integration-tests-b8cda0d438c96d4f-inputs (3.2 GiB) in 29.9s
  12. 65.04 s Progress: 0 of 3 built, 3 of 3 downloaded from cache
  13. 66.09 s Building /nix/store/xsr6c9d999ifn1xyb49xfldq5dlmbrvs-gammaloop-crate-test-binaries-gammaloop-integration-tests-b8cda0d438c96d4f-deps-0.1.0.drv
  14. 66.25 s [gammaloop-crate-test-binaries-gammaloop-integration-tests-b8cda0d438c96d4f-deps] Phase: unpackPhase
  15. 66.27 s [gammaloop-crate-test-binaries-gammaloop-integration-tests-b8cda0d438c96d4f-deps] unpacking source archive /nix/store/a8nx1wypjvxw84bsqigc8dbv41rngy1k-source
  16. 66.37 s [gammaloop-crate-test-binaries-gammaloop-integration-tests-b8cda0d438c96d4f-deps] source root is source
  17. 66.41 s [gammaloop-crate-test-binaries-gammaloop-integration-tests-b8cda0d438c96d4f-deps] Phase: patchPhase
  18. 66.59 s [gammaloop-crate-test-binaries-gammaloop-integration-tests-b8cda0d438c96d4f-deps] Executing configureCargoCommonVars
  19. 66.59 s [gammaloop-crate-test-binaries-gammaloop-integration-tests-b8cda0d438c96d4f-deps] copying cargo artifacts from /nix/store/7c1b8s6dsidphc8xng5yp9ghs6gsj2dr-gammaloop-crate-test-binaries-gammaloop-integration-tests-b8cda0d438c96d4f-inputs/target to target
  20. 66.59 s [gammaloop-crate-test-binaries-gammaloop-integration-tests-b8cda0d438c96d4f-deps] will deep copy artifacts (instead of symlinking) as requested
  21. 70.31 s [gammaloop-crate-test-binaries-gammaloop-integration-tests-b8cda0d438c96d4f-deps] Phase: updateAutotoolsGnuConfigScriptsPhase
  22. 70.58 s [gammaloop-crate-test-binaries-gammaloop-integration-tests-b8cda0d438c96d4f-deps] Phase: configurePhase
  23. 70.58 s [gammaloop-crate-test-binaries-gammaloop-integration-tests-b8cda0d438c96d4f-deps] will append /build/source/.cargo-home/config.toml with contents of /nix/store/5drf77x6km4ky7gwlrzdx9bbd6fz09g3-vendor-cargo-deps/config.toml
  24. 70.59 s [gammaloop-crate-test-binaries-gammaloop-integration-tests-b8cda0d438c96d4f-deps] default configurePhase, nothing to do
  25. 70.59 s [gammaloop-crate-test-binaries-gammaloop-integration-tests-b8cda0d438c96d4f-deps] Phase: buildPhase
  26. 70.65 s [gammaloop-crate-test-binaries-gammaloop-integration-tests-b8cda0d438c96d4f-deps] +++ command cargo --version
  27. 70.66 s [gammaloop-crate-test-binaries-gammaloop-integration-tests-b8cda0d438c96d4f-deps] cargo 1.97.0 (c980f4866 2026-06-30)
  28. 70.66 s [gammaloop-crate-test-binaries-gammaloop-integration-tests-b8cda0d438c96d4f-deps] +++ command cargo test --profile ci-optim --no-run --offline -p gammaloop-integration-tests
  29. 71.81 s [gammaloop-crate-test-binaries-gammaloop-integration-tests-b8cda0d438c96d4f-deps] warning: unused import: `GaussianReferenceFunction`
  30. 71.81 s [gammaloop-crate-test-binaries-gammaloop-integration-tests-b8cda0d438c96d4f-deps] --> crates/gammaloop-api/src/state.rs:38:27
  31. 71.81 s [gammaloop-crate-test-binaries-gammaloop-integration-tests-b8cda0d438c96d4f-deps] |
  32. 71.81 s [gammaloop-crate-test-binaries-gammaloop-integration-tests-b8cda0d438c96d4f-deps] 38 | integrands::process::{GaussianReferenceFunction, ProcessIntegrand},
  33. 71.81 s [gammaloop-crate-test-binaries-gammaloop-integration-tests-b8cda0d438c96d4f-deps] | ^^^^^^^^^^^^^^^^^^^^^^^^^
  34. 71.81 s [gammaloop-crate-test-binaries-gammaloop-integration-tests-b8cda0d438c96d4f-deps] |
  35. 71.81 s [gammaloop-crate-test-binaries-gammaloop-integration-tests-b8cda0d438c96d4f-deps] = note: `#[warn(unused_imports)]` (part of `#[warn(unused)]`) on by default
  36. 71.81 s [gammaloop-crate-test-binaries-gammaloop-integration-tests-b8cda0d438c96d4f-deps]
  37. 71.81 s [gammaloop-crate-test-binaries-gammaloop-integration-tests-b8cda0d438c96d4f-deps] warning: `gammaloop-api` (lib) generated 1 warning (run `cargo fix --lib -p gammaloop-api` to apply 1 suggestion)
  38. 71.81 s [gammaloop-crate-test-binaries-gammaloop-integration-tests-b8cda0d438c96d4f-deps] Compiling gammaloop-integration-tests v0.1.0 (/build/source/tests)
  39. 72.22 s [gammaloop-crate-test-binaries-gammaloop-integration-tests-b8cda0d438c96d4f-deps] error[E0609]: no field `lmb_channel_edge_ids` on type `CutInfo`
  40. 72.22 s [gammaloop-crate-test-binaries-gammaloop-integration-tests-b8cda0d438c96d4f-deps] --> tests/tests/test_evaluation_api.rs:311:10
  41. 72.22 s [gammaloop-crate-test-binaries-gammaloop-integration-tests-b8cda0d438c96d4f-deps] |
  42. 72.22 s [gammaloop-crate-test-binaries-gammaloop-integration-tests-b8cda0d438c96d4f-deps] 311 | .lmb_channel_edge_ids
  43. 72.22 s [gammaloop-crate-test-binaries-gammaloop-integration-tests-b8cda0d438c96d4f-deps] | ^^^^^^^^^^^^^^^^^^^^ unknown field
  44. 72.22 s [gammaloop-crate-test-binaries-gammaloop-integration-tests-b8cda0d438c96d4f-deps] |
  45. 72.22 s [gammaloop-crate-test-binaries-gammaloop-integration-tests-b8cda0d438c96d4f-deps] = note: available fields are: `particle_pdgs`, `cut_id`, `graph_id`, `graph_group_id`, `orientation_id` ... and 2 others
  46. 72.22 s [gammaloop-crate-test-binaries-gammaloop-integration-tests-b8cda0d438c96d4f-deps]
  47. 72.27 s [gammaloop-crate-test-binaries-gammaloop-integration-tests-b8cda0d438c96d4f-deps] error[E0560]: struct `CutInfo` has no field named `lmb_channel_id`
  48. 72.27 s [gammaloop-crate-test-binaries-gammaloop-integration-tests-b8cda0d438c96d4f-deps] --> tests/tests/test_differential.rs:86:13
  49. 72.27 s [gammaloop-crate-test-binaries-gammaloop-integration-tests-b8cda0d438c96d4f-deps] |
  50. 72.27 s [gammaloop-crate-test-binaries-gammaloop-integration-tests-b8cda0d438c96d4f-deps] 86 | lmb_channel_id: None,
  51. 72.27 s [gammaloop-crate-test-binaries-gammaloop-integration-tests-b8cda0d438c96d4f-deps] | ^^^^^^^^^^^^^^ `CutInfo` does not have this field
  52. 72.27 s [gammaloop-crate-test-binaries-gammaloop-integration-tests-b8cda0d438c96d4f-deps] |
  53. 72.27 s [gammaloop-crate-test-binaries-gammaloop-integration-tests-b8cda0d438c96d4f-deps] = note: available fields are: `sampling_channel_id`, `sampling_channel_edge_ids`
  54. 72.27 s [gammaloop-crate-test-binaries-gammaloop-integration-tests-b8cda0d438c96d4f-deps]
  55. 72.27 s [gammaloop-crate-test-binaries-gammaloop-integration-tests-b8cda0d438c96d4f-deps] error[E0560]: struct `CutInfo` has no field named `lmb_channel_edge_ids`
  56. 72.27 s [gammaloop-crate-test-binaries-gammaloop-integration-tests-b8cda0d438c96d4f-deps] --> tests/tests/test_differential.rs:87:13
  57. 72.27 s [gammaloop-crate-test-binaries-gammaloop-integration-tests-b8cda0d438c96d4f-deps] |
  58. 72.27 s [gammaloop-crate-test-binaries-gammaloop-integration-tests-b8cda0d438c96d4f-deps] 87 | lmb_channel_edge_ids: None,
  59. 72.27 s [gammaloop-crate-test-binaries-gammaloop-integration-tests-b8cda0d438c96d4f-deps] | ^^^^^^^^^^^^^^^^^^^^ `CutInfo` does not have this field
  60. 72.27 s [gammaloop-crate-test-binaries-gammaloop-integration-tests-b8cda0d438c96d4f-deps] |
  61. 72.27 s [gammaloop-crate-test-binaries-gammaloop-integration-tests-b8cda0d438c96d4f-deps] = note: available fields are: `sampling_channel_id`, `sampling_channel_edge_ids`
  62. 72.27 s [gammaloop-crate-test-binaries-gammaloop-integration-tests-b8cda0d438c96d4f-deps]
  63. 72.30 s [gammaloop-crate-test-binaries-gammaloop-integration-tests-b8cda0d438c96d4f-deps] error[E0609]: no field `lmb_channel_edge_ids` on type `CutInfo`
  64. 72.30 s [gammaloop-crate-test-binaries-gammaloop-integration-tests-b8cda0d438c96d4f-deps] --> tests/tests/test_evaluation_api.rs:591:26
  65. 72.30 s [gammaloop-crate-test-binaries-gammaloop-integration-tests-b8cda0d438c96d4f-deps] |
  66. 72.30 s [gammaloop-crate-test-binaries-gammaloop-integration-tests-b8cda0d438c96d4f-deps] 591 | .lmb_channel_edge_ids
  67. 72.30 s [gammaloop-crate-test-binaries-gammaloop-integration-tests-b8cda0d438c96d4f-deps] | ^^^^^^^^^^^^^^^^^^^^ unknown field
  68. 72.30 s [gammaloop-crate-test-binaries-gammaloop-integration-tests-b8cda0d438c96d4f-deps] |
  69. 72.30 s [gammaloop-crate-test-binaries-gammaloop-integration-tests-b8cda0d438c96d4f-deps] = note: available fields are: `particle_pdgs`, `cut_id`, `graph_id`, `graph_group_id`, `orientation_id` ... and 2 others
  70. 72.30 s [gammaloop-crate-test-binaries-gammaloop-integration-tests-b8cda0d438c96d4f-deps]
  71. 72.46 s [gammaloop-crate-test-binaries-gammaloop-integration-tests-b8cda0d438c96d4f-deps] error[E0609]: no field `lmb_channel_edge_ids` on type `CutInfo`
  72. 72.46 s [gammaloop-crate-test-binaries-gammaloop-integration-tests-b8cda0d438c96d4f-deps] --> tests/tests/test_evaluation_api.rs:1177:18
  73. 72.46 s [gammaloop-crate-test-binaries-gammaloop-integration-tests-b8cda0d438c96d4f-deps] |
  74. 72.46 s [gammaloop-crate-test-binaries-gammaloop-integration-tests-b8cda0d438c96d4f-deps] 1177 | .lmb_channel_edge_ids
  75. 72.46 s [gammaloop-crate-test-binaries-gammaloop-integration-tests-b8cda0d438c96d4f-deps] | ^^^^^^^^^^^^^^^^^^^^ unknown field
  76. 72.46 s [gammaloop-crate-test-binaries-gammaloop-integration-tests-b8cda0d438c96d4f-deps] |
  77. 72.46 s [gammaloop-crate-test-binaries-gammaloop-integration-tests-b8cda0d438c96d4f-deps] = note: available fields are: `particle_pdgs`, `cut_id`, `graph_id`, `graph_group_id`, `orientation_id` ... and 2 others
  78. 72.46 s [gammaloop-crate-test-binaries-gammaloop-integration-tests-b8cda0d438c96d4f-deps]
  79. 72.58 s [gammaloop-crate-test-binaries-gammaloop-integration-tests-b8cda0d438c96d4f-deps] For more information about this error, try `rustc --explain E0560`.
  80. 72.61 s [gammaloop-crate-test-binaries-gammaloop-integration-tests-b8cda0d438c96d4f-deps] error: could not compile `gammaloop-integration-tests` (test "test_differential") due to 2 previous errors
  81. 72.61 s [gammaloop-crate-test-binaries-gammaloop-integration-tests-b8cda0d438c96d4f-deps] warning: build failed, waiting for other jobs to finish...
  82. 72.84 s [gammaloop-crate-test-binaries-gammaloop-integration-tests-b8cda0d438c96d4f-deps] error[E0609]: no field `lmb_channel_edge_ids` on type `CutInfo`
  83. 72.84 s [gammaloop-crate-test-binaries-gammaloop-integration-tests-b8cda0d438c96d4f-deps] --> tests/tests/test_evaluation_api.rs:1222:22
  84. 72.84 s [gammaloop-crate-test-binaries-gammaloop-integration-tests-b8cda0d438c96d4f-deps] |
  85. 72.84 s [gammaloop-crate-test-binaries-gammaloop-integration-tests-b8cda0d438c96d4f-deps] 1222 | .lmb_channel_edge_ids
  86. 72.84 s [gammaloop-crate-test-binaries-gammaloop-integration-tests-b8cda0d438c96d4f-deps] | ^^^^^^^^^^^^^^^^^^^^ unknown field
  87. 72.84 s [gammaloop-crate-test-binaries-gammaloop-integration-tests-b8cda0d438c96d4f-deps] |
  88. 72.84 s [gammaloop-crate-test-binaries-gammaloop-integration-tests-b8cda0d438c96d4f-deps] = note: available fields are: `particle_pdgs`, `cut_id`, `graph_id`, `graph_group_id`, `orientation_id` ... and 2 others
  89. 72.84 s [gammaloop-crate-test-binaries-gammaloop-integration-tests-b8cda0d438c96d4f-deps]
  90. 72.84 s [gammaloop-crate-test-binaries-gammaloop-integration-tests-b8cda0d438c96d4f-deps] error[E0609]: no field `lmb_channel_edge_ids` on type `CutInfo`
  91. 72.84 s [gammaloop-crate-test-binaries-gammaloop-integration-tests-b8cda0d438c96d4f-deps] --> tests/tests/test_evaluation_api.rs:1281:14
  92. 72.84 s [gammaloop-crate-test-binaries-gammaloop-integration-tests-b8cda0d438c96d4f-deps] |
  93. 72.84 s [gammaloop-crate-test-binaries-gammaloop-integration-tests-b8cda0d438c96d4f-deps] 1281 | .lmb_channel_edge_ids
  94. 72.84 s [gammaloop-crate-test-binaries-gammaloop-integration-tests-b8cda0d438c96d4f-deps] | ^^^^^^^^^^^^^^^^^^^^ unknown field
  95. 72.84 s [gammaloop-crate-test-binaries-gammaloop-integration-tests-b8cda0d438c96d4f-deps] |
  96. 72.84 s [gammaloop-crate-test-binaries-gammaloop-integration-tests-b8cda0d438c96d4f-deps] = note: available fields are: `particle_pdgs`, `cut_id`, `graph_id`, `graph_group_id`, `orientation_id` ... and 2 others
  97. 72.84 s [gammaloop-crate-test-binaries-gammaloop-integration-tests-b8cda0d438c96d4f-deps]
  98. 73.05 s [gammaloop-crate-test-binaries-gammaloop-integration-tests-b8cda0d438c96d4f-deps] error[E0609]: no field `lmb_channel_edge_ids` on type `CutInfo`
  99. 73.05 s [gammaloop-crate-test-binaries-gammaloop-integration-tests-b8cda0d438c96d4f-deps] --> tests/tests/test_evaluation_api.rs:1428:18
  100. 73.05 s [gammaloop-crate-test-binaries-gammaloop-integration-tests-b8cda0d438c96d4f-deps] |
  101. 73.05 s [gammaloop-crate-test-binaries-gammaloop-integration-tests-b8cda0d438c96d4f-deps] 1428 | .lmb_channel_edge_ids
  102. 73.05 s [gammaloop-crate-test-binaries-gammaloop-integration-tests-b8cda0d438c96d4f-deps] | ^^^^^^^^^^^^^^^^^^^^ unknown field
  103. 73.05 s [gammaloop-crate-test-binaries-gammaloop-integration-tests-b8cda0d438c96d4f-deps] |
  104. 73.05 s [gammaloop-crate-test-binaries-gammaloop-integration-tests-b8cda0d438c96d4f-deps] = note: available fields are: `particle_pdgs`, `cut_id`, `graph_id`, `graph_group_id`, `orientation_id` ... and 2 others
  105. 73.05 s [gammaloop-crate-test-binaries-gammaloop-integration-tests-b8cda0d438c96d4f-deps]
  106. 73.33 s [gammaloop-crate-test-binaries-gammaloop-integration-tests-b8cda0d438c96d4f-deps] For more information about this error, try `rustc --explain E0609`.
  107. 73.35 s [gammaloop-crate-test-binaries-gammaloop-integration-tests-b8cda0d438c96d4f-deps] error: could not compile `gammaloop-integration-tests` (test "test_evaluation_api") due to 6 previous errors
  108. 75.45 s [gammaloop-crate-test-binaries-gammaloop-integration-tests-b8cda0d438c96d4f-deps] error[E0609]: no field `lmb_channel_id` on type `CutInfo`
  109. 75.45 s [gammaloop-crate-test-binaries-gammaloop-integration-tests-b8cda0d438c96d4f-deps] --> tests/tests/test_runs/utils.rs:568:36
  110. 75.45 s [gammaloop-crate-test-binaries-gammaloop-integration-tests-b8cda0d438c96d4f-deps] |
  111. 75.45 s [gammaloop-crate-test-binaries-gammaloop-integration-tests-b8cda0d438c96d4f-deps] 568 | event.cut_info.lmb_channel_id,
  112. 75.45 s [gammaloop-crate-test-binaries-gammaloop-integration-tests-b8cda0d438c96d4f-deps] | ^^^^^^^^^^^^^^ unknown field
  113. 75.45 s [gammaloop-crate-test-binaries-gammaloop-integration-tests-b8cda0d438c96d4f-deps] |
  114. 75.45 s [gammaloop-crate-test-binaries-gammaloop-integration-tests-b8cda0d438c96d4f-deps] = note: available fields are: `particle_pdgs`, `cut_id`, `graph_id`, `graph_group_id`, `orientation_id` ... and 2 others
  115. 75.45 s [gammaloop-crate-test-binaries-gammaloop-integration-tests-b8cda0d438c96d4f-deps]
  116. 75.45 s [gammaloop-crate-test-binaries-gammaloop-integration-tests-b8cda0d438c96d4f-deps] error[E0609]: no field `lmb_channel_id` on type `CutInfo`
  117. 75.45 s [gammaloop-crate-test-binaries-gammaloop-integration-tests-b8cda0d438c96d4f-deps] --> tests/tests/test_runs/utils.rs:580:36
  118. 75.45 s [gammaloop-crate-test-binaries-gammaloop-integration-tests-b8cda0d438c96d4f-deps] |
  119. 75.45 s [gammaloop-crate-test-binaries-gammaloop-integration-tests-b8cda0d438c96d4f-deps] 580 | event.cut_info.lmb_channel_id,
  120. 75.45 s [gammaloop-crate-test-binaries-gammaloop-integration-tests-b8cda0d438c96d4f-deps] | ^^^^^^^^^^^^^^ unknown field
  121. 75.45 s [gammaloop-crate-test-binaries-gammaloop-integration-tests-b8cda0d438c96d4f-deps] |
  122. 75.45 s [gammaloop-crate-test-binaries-gammaloop-integration-tests-b8cda0d438c96d4f-deps] = note: available fields are: `particle_pdgs`, `cut_id`, `graph_id`, `graph_group_id`, `orientation_id` ... and 2 others
  123. 75.45 s [gammaloop-crate-test-binaries-gammaloop-integration-tests-b8cda0d438c96d4f-deps]
  124. 78.32 s [gammaloop-crate-test-binaries-gammaloop-integration-tests-b8cda0d438c96d4f-deps] error: could not compile `gammaloop-integration-tests` (test "test_runs") due to 2 previous errors
  125. 231.68 s Progress: 0 of 2 built (1 failed), 3 of 3 downloaded from cache
  126. 231.68 s Failed to build gammaloop-crate-test-binaries-gammaloop-integration-tests-b8cda0d438c96d4f-deps after 2m45s
  127. 231.68 s error: Cannot build '/nix/store/xsr6c9d999ifn1xyb49xfldq5dlmbrvs-gammaloop-crate-test-binaries-gammaloop-integration-tests-b8cda0d438c96d4f-deps-0.1.0.drv'.
  128. 231.68 s Reason: builder failed with exit code 101.
  129. 231.68 s Output paths:
  130. 231.68 s /nix/store/lmzshga7ykxvnwbmvidz56wr6p558p4a-gammaloop-crate-test-binaries-gammaloop-integration-tests-b8cda0d438c96d4f-deps-0.1.0
  131. 231.68 s Last 111 log lines:
  132. 231.68 s > Running phase: unpackPhase
  133. 231.68 s > unpacking source archive /nix/store/a8nx1wypjvxw84bsqigc8dbv41rngy1k-source
  134. 231.68 s > source root is source
  135. 231.68 s > Running phase: patchPhase
  136. 231.68 s > Executing configureCargoCommonVars
  137. 231.68 s > copying cargo artifacts from /nix/store/7c1b8s6dsidphc8xng5yp9ghs6gsj2dr-gammaloop-crate-test-binaries-gammaloop-integration-tests-b8cda0d438c96d4f-inputs/target to target
  138. 231.68 s > will deep copy artifacts (instead of symlinking) as requested
  139. 231.68 s > Running phase: updateAutotoolsGnuConfigScriptsPhase
  140. 231.68 s > Running phase: configurePhase
  141. 231.68 s > will append /build/source/.cargo-home/config.toml with contents of /nix/store/5drf77x6km4ky7gwlrzdx9bbd6fz09g3-vendor-cargo-deps/config.toml
  142. 231.68 s > default configurePhase, nothing to do
  143. 231.68 s > Running phase: buildPhase
  144. 231.68 s > +++ command cargo --version
  145. 231.68 s > cargo 1.97.0 (c980f4866 2026-06-30)
  146. 231.68 s > +++ command cargo test --profile ci-optim --no-run --offline -p gammaloop-integration-tests
  147. 231.68 s > warning: unused import: `GaussianReferenceFunction`
  148. 231.68 s > --> crates/gammaloop-api/src/state.rs:38:27
  149. 231.68 s > |
  150. 231.68 s > 38 | integrands::process::{GaussianReferenceFunction, ProcessIntegrand},
  151. 231.68 s > | ^^^^^^^^^^^^^^^^^^^^^^^^^
  152. 231.68 s > |
  153. 231.68 s > = note: `#[warn(unused_imports)]` (part of `#[warn(unused)]`) on by default
  154. 231.68 s >
  155. 231.68 s > warning: `gammaloop-api` (lib) generated 1 warning (run `cargo fix --lib -p gammaloop-api` to apply 1 suggestion)
  156. 231.68 s > Compiling gammaloop-integration-tests v0.1.0 (/build/source/tests)
  157. 231.68 s > error[E0609]: no field `lmb_channel_edge_ids` on type `CutInfo`
  158. 231.68 s > --> tests/tests/test_evaluation_api.rs:311:10
  159. 231.68 s > |
  160. 231.68 s > 311 | .lmb_channel_edge_ids
  161. 231.68 s > | ^^^^^^^^^^^^^^^^^^^^ unknown field
  162. 231.68 s > |
  163. 231.68 s > = note: available fields are: `particle_pdgs`, `cut_id`, `graph_id`, `graph_group_id`, `orientation_id` ... and 2 others
  164. 231.68 s >
  165. 231.68 s > error[E0560]: struct `CutInfo` has no field named `lmb_channel_id`
  166. 231.68 s > --> tests/tests/test_differential.rs:86:13
  167. 231.68 s > |
  168. 231.68 s > 86 | lmb_channel_id: None,
  169. 231.68 s > | ^^^^^^^^^^^^^^ `CutInfo` does not have this field
  170. 231.68 s > |
  171. 231.68 s > = note: available fields are: `sampling_channel_id`, `sampling_channel_edge_ids`
  172. 231.68 s >
  173. 231.68 s > error[E0560]: struct `CutInfo` has no field named `lmb_channel_edge_ids`
  174. 231.68 s > --> tests/tests/test_differential.rs:87:13
  175. 231.68 s > |
  176. 231.68 s > 87 | lmb_channel_edge_ids: None,
  177. 231.68 s > | ^^^^^^^^^^^^^^^^^^^^ `CutInfo` does not have this field
  178. 231.68 s > |
  179. 231.68 s > = note: available fields are: `sampling_channel_id`, `sampling_channel_edge_ids`
  180. 231.68 s >
  181. 231.68 s > error[E0609]: no field `lmb_channel_edge_ids` on type `CutInfo`
  182. 231.68 s > --> tests/tests/test_evaluation_api.rs:591:26
  183. 231.68 s > |
  184. 231.68 s > 591 | .lmb_channel_edge_ids
  185. 231.68 s > | ^^^^^^^^^^^^^^^^^^^^ unknown field
  186. 231.68 s > |
  187. 231.68 s > = note: available fields are: `particle_pdgs`, `cut_id`, `graph_id`, `graph_group_id`, `orientation_id` ... and 2 others
  188. 231.68 s >
  189. 231.68 s > error[E0609]: no field `lmb_channel_edge_ids` on type `CutInfo`
  190. 231.68 s > --> tests/tests/test_evaluation_api.rs:1177:18
  191. 231.68 s > |
  192. 231.68 s > 1177 | .lmb_channel_edge_ids
  193. 231.68 s > | ^^^^^^^^^^^^^^^^^^^^ unknown field
  194. 231.68 s > |
  195. 231.68 s > = note: available fields are: `particle_pdgs`, `cut_id`, `graph_id`, `graph_group_id`, `orientation_id` ... and 2 others
  196. 231.68 s >
  197. 231.68 s > For more information about this error, try `rustc --explain E0560`.
  198. 231.68 s > error: could not compile `gammaloop-integration-tests` (test "test_differential") due to 2 previous errors
  199. 231.68 s > warning: build failed, waiting for other jobs to finish...
  200. 231.68 s > error[E0609]: no field `lmb_channel_edge_ids` on type `CutInfo`
  201. 231.68 s > --> tests/tests/test_evaluation_api.rs:1222:22
  202. 231.68 s > |
  203. 231.68 s > 1222 | .lmb_channel_edge_ids
  204. 231.68 s > | ^^^^^^^^^^^^^^^^^^^^ unknown field
  205. 231.68 s > |
  206. 231.68 s > = note: available fields are: `particle_pdgs`, `cut_id`, `graph_id`, `graph_group_id`, `orientation_id` ... and 2 others
  207. 231.68 s >
  208. 231.68 s > error[E0609]: no field `lmb_channel_edge_ids` on type `CutInfo`
  209. 231.68 s > --> tests/tests/test_evaluation_api.rs:1281:14
  210. 231.68 s > |
  211. 231.68 s > 1281 | .lmb_channel_edge_ids
  212. 231.68 s > | ^^^^^^^^^^^^^^^^^^^^ unknown field
  213. 231.68 s > |
  214. 231.68 s > = note: available fields are: `particle_pdgs`, `cut_id`, `graph_id`, `graph_group_id`, `orientation_id` ... and 2 others
  215. 231.68 s >
  216. 231.68 s > error[E0609]: no field `lmb_channel_edge_ids` on type `CutInfo`
  217. 231.68 s > --> tests/tests/test_evaluation_api.rs:1428:18
  218. 231.68 s > |
  219. 231.68 s > 1428 | .lmb_channel_edge_ids
  220. 231.68 s > | ^^^^^^^^^^^^^^^^^^^^ unknown field
  221. 231.68 s > |
  222. 231.68 s > = note: available fields are: `particle_pdgs`, `cut_id`, `graph_id`, `graph_group_id`, `orientation_id` ... and 2 others
  223. 231.68 s >
  224. 231.68 s > For more information about this error, try `rustc --explain E0609`.
  225. 231.68 s > error: could not compile `gammaloop-integration-tests` (test "test_evaluation_api") due to 6 previous errors
  226. 231.68 s > error[E0609]: no field `lmb_channel_id` on type `CutInfo`
  227. 231.68 s > --> tests/tests/test_runs/utils.rs:568:36
  228. 231.68 s > |
  229. 231.68 s > 568 | event.cut_info.lmb_channel_id,
  230. 231.68 s > | ^^^^^^^^^^^^^^ unknown field
  231. 231.68 s > |
  232. 231.68 s > = note: available fields are: `particle_pdgs`, `cut_id`, `graph_id`, `graph_group_id`, `orientation_id` ... and 2 others
  233. 231.68 s >
  234. 231.68 s > error[E0609]: no field `lmb_channel_id` on type `CutInfo`
  235. 231.68 s > --> tests/tests/test_runs/utils.rs:580:36
  236. 231.68 s > |
  237. 231.68 s > 580 | event.cut_info.lmb_channel_id,
  238. 231.68 s > | ^^^^^^^^^^^^^^ unknown field
  239. 231.68 s > |
  240. 231.68 s > = note: available fields are: `particle_pdgs`, `cut_id`, `graph_id`, `graph_group_id`, `orientation_id` ... and 2 others
  241. 231.68 s >
  242. 231.68 s > error: could not compile `gammaloop-integration-tests` (test "test_runs") due to 2 previous errors
  243. 231.68 s For full logs, run:
  244. 231.68 s nix log /nix/store/xsr6c9d999ifn1xyb49xfldq5dlmbrvs-gammaloop-crate-test-binaries-gammaloop-integration-tests-b8cda0d438c96d4f-deps-0.1.0.drv
  245. 231.68 s error: Cannot build '/nix/store/57g3amzd59a7z4dk2xjr69nddnhdfy5x-nix-ci-artifact-barrier-crate-test-binaries-gammaloop-integration-tests.drv'.
  246. 231.68 s Reason: 1 dependency failed.
  247. 231.68 s Output paths:
  248. 231.68 s /nix/store/x49zmky6np6w1rvajyrqcli3vz5krp3d-nix-ci-artifact-barrier-crate-test-binaries-gammaloop-integration-tests
  249. 231.68 s Build failed due to failed dependency
  250. 231.75 s Build failed.