1. 0.01 s $ /nix/store/9ypz3flqsrl5xl495mm8h645gadjsxi1-coreutils-9.11/bin/timeout --kill-after=15s 7200s /nix/store/23zk8sgzamrbmj1fday15szf7f2279s8-nix-2.34.7/bin/nix --extra-experimental-features nix-command --extra-experimental-features flakes --log-format internal-json build --no-link --print-out-paths git+https://github.com/alphal00p/gammaloop?ref=advanced_sampling&rev=3c57c6e57cfd328facf59884de227d955ed520f5&shallow=1#checks.x86_64-linux.gammaloop-check --print-build-logs
  2. 6.11 s
  3. 7.61 s Building /nix/store/b3fn5kzh9il8jkvkrrf819y71fyy0pgd-gammaloop-workspace-check-0.1.0.drv
  4. 7.79 s [gammaloop-workspace-check] Phase: unpackPhase
  5. 7.79 s [gammaloop-workspace-check] unpacking source archive /nix/store/ckhl73i8snhkklg8cnciy20qmwag9b2k-source
  6. 8.19 s [gammaloop-workspace-check] source root is source
  7. 8.25 s [gammaloop-workspace-check] Phase: patchPhase
  8. 8.26 s [gammaloop-workspace-check] Executing configureCargoCommonVars
  9. 8.26 s [gammaloop-workspace-check] decompressing cargo artifacts from /nix/store/50vpxlcgfxf2d57i27v3d10zjwxxbm2r-gammaloop-workspace-deps-deps-0.1.0/target.tar.zst to target
  10. 13.11 s [gammaloop-workspace-check] Phase: updateAutotoolsGnuConfigScriptsPhase
  11. 13.18 s [gammaloop-workspace-check] Phase: configurePhase
  12. 13.19 s [gammaloop-workspace-check] will append /build/source/.cargo-home/config.toml with contents of /nix/store/5drf77x6km4ky7gwlrzdx9bbd6fz09g3-vendor-cargo-deps/config.toml
  13. 13.19 s [gammaloop-workspace-check] default configurePhase, nothing to do
  14. 13.19 s [gammaloop-workspace-check] Phase: buildPhase
  15. 13.20 s [gammaloop-workspace-check] +++ command cargo --version
  16. 13.21 s [gammaloop-workspace-check] cargo 1.97.0 (c980f4866 2026-06-30)
  17. 13.26 s [gammaloop-workspace-check] +++ command cargo check --profile ci-optim --locked --workspace --features gammaloop-tracing-filter/clap,gammaloop-tracing-filter/symbolica,idenso/bincode,idenso/reference-cases,linnet/bincode,linnet/drawing,linnet/rkyv,linnet/serde,linnet/symbolica,spenso-macros/shadowing,spenso/shadowing,symbolica/tracing_max_level_info,three-dimensional-reps/display,three-dimensional-reps/eval,three-dimensional-reps/serde --all-targets
  18. 14.40 s [gammaloop-workspace-check] Checking cfg-if v1.0.4
  19. 14.40 s [gammaloop-workspace-check] Checking memchr v2.8.0
  20. 14.40 s [gammaloop-workspace-check] Checking once_cell v1.21.4
  21. 14.43 s [gammaloop-workspace-check] Checking either v1.15.0
  22. 14.43 s [gammaloop-workspace-check] Checking serde_core v1.0.228
  23. 14.43 s [gammaloop-workspace-check] Checking libc v0.2.186
  24. 14.43 s [gammaloop-workspace-check] Checking libm v0.2.16
  25. 14.44 s [gammaloop-workspace-check] Checking itoa v1.0.18
  26. 14.45 s [gammaloop-workspace-check] Checking log v0.4.29
  27. 14.46 s [gammaloop-workspace-check] Checking regex-syntax v0.8.10
  28. 14.47 s [gammaloop-workspace-check] Checking zerocopy v0.8.48
  29. 14.49 s [gammaloop-workspace-check] Checking crossbeam-utils v0.8.21
  30. 14.49 s [gammaloop-workspace-check] Checking equivalent v1.0.2
  31. 14.53 s [gammaloop-workspace-check] Checking zmij v1.0.21
  32. 14.53 s [gammaloop-workspace-check] Checking bytemuck v1.25.0
  33. 14.53 s [gammaloop-workspace-check] Checking lazy_static v1.5.0
  34. 14.55 s [gammaloop-workspace-check] Compiling target-lexicon v0.13.5
  35. 14.62 s [gammaloop-workspace-check] Checking arrayvec v0.7.6
  36. 14.71 s [gammaloop-workspace-check] Checking powerfmt v0.2.0
  37. 14.75 s [gammaloop-workspace-check] Checking pin-project-lite v0.2.17
  38. 14.77 s [gammaloop-workspace-check] Checking num-conv v0.2.1
  39. 14.91 s [gammaloop-workspace-check] Checking time-core v0.1.8
  40. 14.93 s [gammaloop-workspace-check] Checking deranged v0.5.8
  41. 15.06 s [gammaloop-workspace-check] Checking num_threads v0.1.7
  42. 15.06 s [gammaloop-workspace-check] Checking tracing-core v0.1.36
  43. 15.09 s [gammaloop-workspace-check] Checking foldhash v0.2.0
  44. 15.17 s [gammaloop-workspace-check] Checking allocator-api2 v0.2.21
  45. 15.17 s [gammaloop-workspace-check] Checking const-random v0.1.18
  46. 15.22 s [gammaloop-workspace-check] Checking itertools v0.14.0
  47. 15.36 s [gammaloop-workspace-check] Checking unty v0.0.4
  48. 15.44 s [gammaloop-workspace-check] Checking winnow v1.0.2
  49. 15.49 s [gammaloop-workspace-check] Checking nu-ansi-term v0.50.3
  50. 15.51 s [gammaloop-workspace-check] Checking safe_arch v0.7.4
  51. 15.51 s [gammaloop-workspace-check] Checking static_assertions v1.1.0
  52. 15.61 s [gammaloop-workspace-check] Checking safe_arch v1.0.0
  53. 16.05 s [gammaloop-workspace-check] Checking sharded-slab v0.1.7
  54. 16.08 s [gammaloop-workspace-check] Checking aho-corasick v1.1.4
  55. 16.19 s [gammaloop-workspace-check] Checking hashbrown v0.16.1
  56. 16.20 s [gammaloop-workspace-check] Checking crossbeam-epoch v0.9.18
  57. 16.47 s [gammaloop-workspace-check] Checking wide v0.7.33
  58. 16.62 s [gammaloop-workspace-check] Checking tracing-log v0.2.0
  59. 16.88 s [gammaloop-workspace-check] Checking crossbeam-deque v0.8.6
  60. 16.94 s [gammaloop-workspace-check] Checking tracing v0.1.44
  61. 17.35 s [gammaloop-workspace-check] Checking rayon-core v1.13.0
  62. 17.54 s [gammaloop-workspace-check] Checking thread_local v1.1.9
  63. 17.80 s [gammaloop-workspace-check] Checking az v1.3.0
  64. 17.90 s [gammaloop-workspace-check] Checking indenter v0.3.4
  65. 17.97 s [gammaloop-workspace-check] Checking toml_writer v1.1.1+spec-1.1.0
  66. 18.00 s [gammaloop-workspace-check] Checking wide v1.3.0
  67. 18.12 s [gammaloop-workspace-check] Compiling phf_shared v0.11.3
  68. 18.19 s [gammaloop-workspace-check] Checking anyhow v1.0.102
  69. 18.39 s [gammaloop-workspace-check] Checking utf8parse v0.2.2
  70. 18.65 s [gammaloop-workspace-check] Checking dyn-clone v1.0.20
  71. 18.71 s [gammaloop-workspace-check] Compiling pyo3-build-config v0.28.3
  72. 18.83 s [gammaloop-workspace-check] Checking rawpointer v0.2.1
  73. 18.98 s [gammaloop-workspace-check] Checking alloc-no-stdlib v2.0.4
  74. 19.12 s [gammaloop-workspace-check] Checking anstyle-parse v1.0.0
  75. 19.20 s [gammaloop-workspace-check] Checking matrixmultiply v0.3.10
  76. 19.29 s [gammaloop-workspace-check] Checking alloc-stdlib v0.2.2
  77. 19.37 s [gammaloop-workspace-check] Checking rayon v1.12.0
  78. 19.51 s [gammaloop-workspace-check] Checking toml_parser v1.1.2+spec-1.1.0
  79. 19.52 s [gammaloop-workspace-check] Checking anstyle v1.0.14
  80. 19.64 s [gammaloop-workspace-check] Checking anstyle-query v1.1.5
  81. 19.73 s [gammaloop-workspace-check] Checking num-traits v0.2.19
  82. 19.86 s [gammaloop-workspace-check] Checking colored v3.1.1
  83. 19.92 s [gammaloop-workspace-check] Checking colorchoice v1.0.5
  84. 20.19 s [gammaloop-workspace-check] Checking is_terminal_polyfill v1.70.2
  85. 20.29 s [gammaloop-workspace-check] Compiling phf_generator v0.11.3
  86. 20.35 s [gammaloop-workspace-check] Checking anstream v1.0.0
  87. 20.42 s [gammaloop-workspace-check] Checking eyre v0.6.12
  88. 20.70 s [gammaloop-workspace-check] Checking unicode-width v0.2.2
  89. 20.76 s [gammaloop-workspace-check] Checking bitflags v1.3.2
  90. 20.83 s [gammaloop-workspace-check] Compiling phf_codegen v0.11.3
  91. 21.03 s [gammaloop-workspace-check] Checking brotli-decompressor v5.0.0
  92. 21.18 s [gammaloop-workspace-check] Checking inventory v0.3.24
  93. 21.22 s [gammaloop-workspace-check] Checking spec_math v0.1.6
  94. 21.31 s [gammaloop-workspace-check] Checking thiserror v2.0.18
  95. 21.34 s [gammaloop-workspace-check] Compiling getopts v0.2.24
  96. 21.35 s [gammaloop-workspace-check] Checking libloading v0.9.0
  97. 21.36 s [gammaloop-workspace-check] Checking byteorder v1.5.0
  98. 21.52 s [gammaloop-workspace-check] Checking append-only-vec v0.1.8
  99. 21.75 s [gammaloop-workspace-check] Checking regex-automata v0.4.14
  100. 21.79 s [gammaloop-workspace-check] Checking getrandom v0.3.4
  101. 21.83 s [gammaloop-workspace-check] Checking time v0.3.47
  102. 21.92 s [gammaloop-workspace-check] Checking gmp-mpfr-sys v1.7.1
  103. 21.98 s [gammaloop-workspace-check] Checking region v3.0.2
  104. 22.17 s [gammaloop-workspace-check] Checking hugepage-rs v0.1.1
  105. 22.52 s [gammaloop-workspace-check] Checking wasmtime-jit-icache-coherence v34.0.2
  106. 22.56 s [gammaloop-workspace-check] Checking tinyjson v2.5.1
  107. 22.66 s [gammaloop-workspace-check] Checking rand_core v0.9.5
  108. 22.68 s [gammaloop-workspace-check] Checking bytes v1.11.1
  109. 22.71 s [gammaloop-workspace-check] Checking self_cell v1.2.2
  110. 22.75 s [gammaloop-workspace-check] Compiling unicode_names2_generator v1.3.0
  111. 22.91 s [gammaloop-workspace-check] Checking linux-raw-sys v0.12.1
  112. 22.92 s [gammaloop-workspace-check] Checking serde v1.0.228
  113. 22.96 s [gammaloop-workspace-check] Checking serde_json v1.0.149
  114. 23.27 s [gammaloop-workspace-check] Checking approx v0.5.1
  115. 23.33 s [gammaloop-workspace-check] Checking bitflags v2.11.1
  116. 23.45 s [gammaloop-workspace-check] Checking num-integer v0.1.46
  117. 23.63 s [gammaloop-workspace-check] Checking serde_spanned v1.1.1
  118. 23.77 s [gammaloop-workspace-check] Checking toml_datetime v1.1.1+spec-1.1.0
  119. 23.94 s [gammaloop-workspace-check] Compiling unic-common v0.9.0
  120. 24.07 s [gammaloop-workspace-check] Checking toml v1.1.2+spec-1.1.0
  121. 24.16 s [gammaloop-workspace-check] Compiling unic-char-range v0.9.0
  122. 24.41 s [gammaloop-workspace-check] Compiling unic-char-property v0.9.0
  123. 24.46 s [gammaloop-workspace-check] Checking rustix v1.1.4
  124. 24.51 s [gammaloop-workspace-check] Compiling unic-ucd-version v0.9.0
  125. 24.69 s [gammaloop-workspace-check] Compiling is-macro v0.3.7
  126. 24.79 s [gammaloop-workspace-check] Compiling rustpython-parser-vendored v0.4.0
  127. 25.25 s [gammaloop-workspace-check] Checking iana-time-zone v0.1.65
  128. 25.33 s [gammaloop-workspace-check] Checking brotli v8.0.2
  129. 25.50 s [gammaloop-workspace-check] Checking smallvec v1.15.1
  130. 25.52 s [gammaloop-workspace-check] Checking num-complex v0.4.6
  131. 26.21 s [gammaloop-workspace-check] Checking bincode v2.0.1
  132. 26.61 s [gammaloop-workspace-check] Checking tracing-serde v0.2.0
  133. 26.67 s [gammaloop-workspace-check] Checking smartstring v1.0.1
  134. 26.75 s [gammaloop-workspace-check] Checking chrono v0.4.44
  135. 26.80 s [gammaloop-workspace-check] Compiling rustpython-parser v0.4.0
  136. 26.82 s [gammaloop-workspace-check] Compiling phf v0.11.3
  137. 26.98 s [gammaloop-workspace-check] Checking rustc-hash v2.1.2
  138. 27.11 s [gammaloop-workspace-check] Compiling unic-ucd-ident v0.9.0
  139. 27.14 s [gammaloop-workspace-check] Compiling unic-emoji-char v0.9.0
  140. 27.19 s [gammaloop-workspace-check] Compiling lalrpop-util v0.20.2
  141. 27.30 s [gammaloop-workspace-check] Compiling rustc-hash v1.1.0
  142. 27.42 s [gammaloop-workspace-check] Checking rug v1.30.0
  143. 27.45 s [gammaloop-workspace-check] Compiling symbolica v2.2.0 (https://github.com/alphal00p/symbolica?rev=a277a8dadbaae5a8d6605f2f381991a601e1f345#a277a8da)
  144. 27.47 s [gammaloop-workspace-check] Checking unicode-segmentation v1.13.2
  145. 27.70 s [gammaloop-workspace-check] Checking typenum v1.20.0
  146. 27.78 s [gammaloop-workspace-check] Checking getrandom v0.2.17
  147. 28.21 s [gammaloop-workspace-check] Checking scopeguard v1.2.0
  148. 28.29 s [gammaloop-workspace-check] Checking simba v0.9.1
  149. 28.36 s [gammaloop-workspace-check] Checking ndarray v0.17.2
  150. 29.20 s [gammaloop-workspace-check] Checking lock_api v0.4.14
  151. 29.58 s [gammaloop-workspace-check] Checking ppv-lite86 v0.2.21
  152. 29.84 s [gammaloop-workspace-check] Checking ahash v0.8.12
  153. 30.05 s [gammaloop-workspace-check] Checking parking_lot_core v0.9.12
  154. 30.47 s [gammaloop-workspace-check] Checking unicode-ident v1.0.24
  155. 30.51 s [gammaloop-workspace-check] Checking hashbrown v0.17.0
  156. 30.64 s [gammaloop-workspace-check] Checking errno v0.3.14
  157. 30.66 s [gammaloop-workspace-check] Checking strsim v0.11.1
  158. 30.76 s [gammaloop-workspace-check] Checking parking_lot v0.12.5
  159. 30.83 s [gammaloop-workspace-check] Checking generic-array v0.14.7
  160. 30.86 s [gammaloop-workspace-check] Checking rand_chacha v0.9.0
  161. 30.96 s [gammaloop-workspace-check] Checking unicase v2.9.0
  162. 31.64 s [gammaloop-workspace-check] Checking clap_lex v1.1.0
  163. 31.77 s [gammaloop-workspace-check] Checking vte v0.14.1
  164. 31.79 s [gammaloop-workspace-check] Checking signal-hook-registry v1.4.8
  165. 31.91 s [gammaloop-workspace-check] Checking same-file v1.0.6
  166. 32.05 s [gammaloop-workspace-check] Checking walkdir v2.5.0
  167. 32.21 s [gammaloop-workspace-check] Checking signal-hook v0.3.18
  168. 32.26 s [gammaloop-workspace-check] Checking rand v0.9.4
  169. 32.45 s [gammaloop-workspace-check] Checking half v2.7.1
  170. 32.56 s [gammaloop-workspace-check] Checking mio v1.2.0
  171. 32.80 s [gammaloop-workspace-check] Checking terminal_size v0.4.4
  172. 32.83 s [gammaloop-workspace-check] Checking indexmap v2.14.0
  173. 32.90 s [gammaloop-workspace-check] Checking block-buffer v0.10.4
  174. 33.05 s [gammaloop-workspace-check] Checking clap_builder v4.6.0
  175. 33.07 s [gammaloop-workspace-check] Checking crypto-common v0.1.7
  176. 33.11 s [gammaloop-workspace-check] Checking matchers v0.2.0
  177. 33.31 s [gammaloop-workspace-check] Checking regex v1.12.3
  178. 33.38 s [gammaloop-workspace-check] Checking tracing-subscriber v0.3.23
  179. 33.42 s [gammaloop-workspace-check] Checking ciborium-io v0.2.2
  180. 33.46 s [gammaloop-workspace-check] Checking minimal-lexical v0.2.1
  181. 33.55 s [gammaloop-workspace-check] Checking ciborium-ll v0.2.2
  182. 33.73 s [gammaloop-workspace-check] Checking digest v0.10.7
  183. 33.90 s [gammaloop-workspace-check] Checking nom v7.1.3
  184. 34.09 s [gammaloop-workspace-check] Checking signal-hook-mio v0.2.5
  185. 34.12 s [gammaloop-workspace-check] Compiling unicode_names2 v1.3.0
  186. 34.20 s [gammaloop-workspace-check] Checking derive_more v2.1.1
  187. 34.26 s [gammaloop-workspace-check] Checking num-bigint v0.4.6
  188. 34.26 s [gammaloop-workspace-check] Checking console v0.16.3
  189. 34.31 s [gammaloop-workspace-check] Checking bstr v1.12.1
  190. 34.97 s [gammaloop-workspace-check] Checking cpufeatures v0.2.17
  191. 35.11 s [gammaloop-workspace-check] Checking linux-raw-sys v0.4.15
  192. 35.16 s [gammaloop-workspace-check] Checking symjit v2.21.0
  193. 35.97 s [gammaloop-workspace-check] Checking winnow v0.7.15
  194. 36.10 s [gammaloop-workspace-check] Checking rustix v0.38.44
  195. 36.19 s [gammaloop-workspace-check] Checking globset v0.4.18
  196. 37.56 s [gammaloop-workspace-check] Checking sha2 v0.10.9
  197. 38.28 s [gammaloop-workspace-check] Checking clap v4.6.1
  198. 38.37 s [gammaloop-workspace-check] Checking ciborium v0.2.2
  199. 38.47 s [gammaloop-workspace-check] Checking getrandom v0.4.2
  200. 38.76 s [gammaloop-workspace-check] Checking rand_core v0.6.4
  201. 38.81 s [gammaloop-workspace-check] Checking fnv v1.0.7
  202. 38.84 s [gammaloop-workspace-check] Checking plotters-backend v0.3.7
  203. 38.93 s [gammaloop-workspace-check] Checking fastrand v2.4.1
  204. 39.00 s [gammaloop-workspace-check] Checking rust-embed-utils v8.11.0
  205. 39.17 s [gammaloop-workspace-check] Compiling pyo3-macros-backend v0.28.3
  206. 39.20 s [gammaloop-workspace-check] Compiling pyo3-ffi v0.28.3
  207. 39.23 s [gammaloop-workspace-check] Compiling pyo3 v0.28.3
  208. 39.38 s [gammaloop-workspace-check] Compiling numpy v0.28.0
  209. 39.51 s [gammaloop-workspace-check] Checking tempfile v3.27.0
  210. 39.55 s [gammaloop-workspace-check] Checking plotters-svg v0.3.7
  211. 39.94 s [gammaloop-workspace-check] Checking crossterm v0.28.1
  212. 39.96 s [gammaloop-workspace-check] Checking serde_spanned v0.6.9
  213. 40.05 s [gammaloop-workspace-check] Checking toml_datetime v0.6.11
  214. 40.09 s [gammaloop-workspace-check] Checking itertools v0.10.5
  215. 40.16 s [gammaloop-workspace-check] Checking cast v0.3.0
  216. 40.18 s [gammaloop-workspace-check] Checking toml_write v0.1.2
  217. 40.20 s [gammaloop-workspace-check] Checking tap v1.0.1
  218. 40.25 s [gammaloop-workspace-check] Checking ansitok v0.3.0
  219. 40.40 s [gammaloop-workspace-check] Checking wyz v0.5.1
  220. 40.42 s [gammaloop-workspace-check] Checking plotters v0.3.7
  221. 40.58 s [gammaloop-workspace-check] Checking rand_chacha v0.3.1
  222. 40.63 s [gammaloop-workspace-check] Checking radium v0.7.0
  223. 40.86 s [gammaloop-workspace-check] Checking typeid v1.0.3
  224. 41.01 s [gammaloop-workspace-check] Checking similar v2.7.0
  225. 41.09 s [gammaloop-workspace-check] Checking tinytemplate v1.2.1
  226. 41.11 s [gammaloop-workspace-check] Checking ansi-str v0.9.0
  227. 41.16 s [gammaloop-workspace-check] Checking is-terminal v0.4.17
  228. 41.43 s [gammaloop-workspace-check] Checking funty v2.0.0
  229. 41.83 s [gammaloop-workspace-check] Checking anes v0.1.6
  230. 41.88 s [gammaloop-workspace-check] Checking oorandom v11.1.5
  231. 41.91 s [gammaloop-workspace-check] Checking toml_edit v0.22.27
  232. 41.98 s [gammaloop-workspace-check] Checking bytecount v0.6.9
  233. 42.04 s [gammaloop-workspace-check] Checking rand v0.8.6
  234. 42.22 s [gammaloop-workspace-check] Checking testing_table v0.3.0
  235. 42.22 s [gammaloop-workspace-check] Checking papergrid v0.17.0
  236. 42.22 s [gammaloop-workspace-check] Checking ron v0.12.1
  237. 42.27 s [gammaloop-workspace-check] Checking toml_edit v0.25.11+spec-1.1.0
  238. 42.33 s [gammaloop-workspace-check] Checking env_filter v1.0.1
  239. 42.35 s [gammaloop-workspace-check] Checking xprec v0.2.2
  240. 42.42 s [gammaloop-workspace-check] Checking uncased v0.9.10
  241. 42.52 s [gammaloop-workspace-check] Checking jiff v0.2.24
  242. 42.63 s [gammaloop-workspace-check] Checking criterion-plot v0.5.0
  243. 42.68 s [gammaloop-workspace-check] Checking ptr_meta v0.1.4
  244. 42.71 s [gammaloop-workspace-check] Checking ucd-trie v0.1.7
  245. 42.82 s [gammaloop-workspace-check] Checking bitvec v1.0.1
  246. 42.88 s [gammaloop-workspace-check] Checking simdutf8 v0.1.5
  247. 42.89 s [gammaloop-workspace-check] Checking ahash v0.7.8
  248. 42.96 s [gammaloop-workspace-check] Checking approx v0.4.0
  249. 43.04 s [gammaloop-workspace-check] Checking pest v2.8.6
  250. 43.14 s [gammaloop-workspace-check] Checking bytecheck v0.6.12
  251. 43.19 s [gammaloop-workspace-check] Checking seahash v4.1.0
  252. 43.20 s [gammaloop-workspace-check] Checking hashbrown v0.12.3
  253. 43.21 s [gammaloop-workspace-check] Checking cgmath v0.18.0
  254. 43.37 s [gammaloop-workspace-check] Checking criterion v0.5.1
  255. 43.45 s [gammaloop-workspace-check] Checking num-rational v0.4.2
  256. 43.84 s [gammaloop-workspace-check] Checking tabled v0.20.0
  257. 43.95 s [gammaloop-workspace-check] Checking rend v0.4.2
  258. 44.07 s [gammaloop-workspace-check] Checking num-iter v0.1.45
  259. 44.19 s [gammaloop-workspace-check] Checking ref-ops v0.2.5
  260. 44.26 s [gammaloop-workspace-check] Checking num v0.4.3
  261. 44.30 s [gammaloop-workspace-check] Checking insta v1.47.2
  262. 44.34 s [gammaloop-workspace-check] Checking rand_xoshiro v0.6.0
  263. 44.37 s [gammaloop-workspace-check] Checking features v0.10.0
  264. 44.42 s [gammaloop-workspace-check] Checking constcat v0.5.1
  265. 44.48 s [gammaloop-workspace-check] Checking gat-lending-iterator v0.1.8
  266. 44.51 s [gammaloop-workspace-check] Checking colored v2.2.0
  267. 44.80 s [gammaloop-workspace-check] Checking arrayref v0.3.9
  268. 44.86 s [gammaloop-workspace-check] Checking cpufeatures v0.3.0
  269. 44.89 s [gammaloop-workspace-check] Checking constant_time_eq v0.4.2
  270. 44.98 s [gammaloop-workspace-check] Checking base64 v0.22.1
  271. 45.01 s [gammaloop-workspace-check] Checking joinery v2.1.0
  272. 45.08 s [gammaloop-workspace-check] Checking blake3 v1.8.5
  273. 45.12 s [gammaloop-workspace-check] Checking dot-parser v0.5.1
  274. 45.17 s [gammaloop-workspace-check] Checking siphasher v1.0.2
  275. 45.39 s [gammaloop-workspace-check] Checking toml v0.8.23
  276. 45.55 s [gammaloop-workspace-check] Checking phf_shared v0.13.1
  277. 45.63 s [gammaloop-workspace-check] Checking titlecase v2.2.1
  278. 45.83 s [gammaloop-workspace-check] Checking subprocess v0.2.15
  279. 45.84 s [gammaloop-workspace-check] Compiling rustpython-parser-core v0.4.0
  280. 45.89 s [gammaloop-workspace-check] Checking rust_lisp v0.18.0
  281. 45.95 s [gammaloop-workspace-check] Compiling vakint v0.1.2 (/build/source/crates/vakint)
  282. 45.95 s [gammaloop-workspace-check] Checking phf v0.13.1
  283. 46.28 s [gammaloop-workspace-check] Compiling rustpython-ast v0.4.0
  284. 46.28 s [gammaloop-workspace-check] Checking figment v0.10.19
  285. 46.32 s [gammaloop-workspace-check] Checking version-compare v0.2.1
  286. 46.49 s [gammaloop-workspace-check] Checking xpct v0.5.1
  287. 46.56 s [gammaloop-workspace-check] Checking ryu v1.0.23
  288. 46.59 s [gammaloop-workspace-check] Checking castaway v0.2.4
  289. 46.59 s [gammaloop-workspace-check] Checking string-template-plus v0.4.3
  290. 46.64 s [gammaloop-workspace-check] Checking toml_datetime v0.7.5+spec-1.1.0
  291. 46.66 s [gammaloop-workspace-check] Checking strum v0.27.2
  292. 46.79 s [gammaloop-workspace-check] Checking unicode-truncate v2.0.1
  293. 46.81 s [gammaloop-workspace-check] Checking compact_str v0.9.0
  294. 46.85 s [gammaloop-workspace-check] Checking kasuari v0.4.12
  295. 46.91 s [gammaloop-workspace-check] Checking lru v0.16.4
  296. 47.02 s [gammaloop-workspace-check] Checking toml v0.9.12+spec-1.1.0
  297. 47.10 s [gammaloop-workspace-check] Checking vte v0.15.0
  298. 47.14 s [gammaloop-workspace-check] Checking portable-atomic v1.13.1
  299. 47.18 s [gammaloop-workspace-check] Checking unit-prefix v0.5.2
  300. 47.31 s [gammaloop-workspace-check] Checking rand_distr v0.4.3
  301. 47.51 s [gammaloop-workspace-check] Checking vt100 v0.16.2
  302. 47.65 s [gammaloop-workspace-check] Checking simba v0.6.0
  303. 47.75 s [gammaloop-workspace-check] Checking line-clipping v0.3.7
  304. 47.81 s [gammaloop-workspace-check] Compiling three-dimensional-reps v0.1.0 (/build/source/crates/three-dimensional-reps)
  305. 47.87 s [gammaloop-workspace-check] Checking adler2 v2.0.1
  306. 47.94 s [gammaloop-workspace-check] Checking ratatui-core v0.1.0
  307. 47.96 s [gammaloop-workspace-check] Checking gimli v0.32.3
  308. 47.99 s [gammaloop-workspace-check] Checking thiserror v1.0.69
  309. 48.02 s [gammaloop-workspace-check] Checking derive_builder v0.11.2
  310. 48.05 s [gammaloop-workspace-check] Checking miniz_oxide v0.8.9
  311. 48.13 s [gammaloop-workspace-check] Checking crossterm v0.29.0
  312. 48.18 s [gammaloop-workspace-check] Checking object v0.37.3
  313. 48.21 s [gammaloop-workspace-check] Checking indicatif v0.18.4
  314. 48.26 s [gammaloop-workspace-check] Checking owo-colors v4.3.0
  315. 48.39 s [gammaloop-workspace-check] Checking tracing-error v0.2.1
  316. 48.54 s [gammaloop-workspace-check] Checking typed-index-collections v3.5.0
  317. 48.66 s [gammaloop-workspace-check] Checking serde-big-array v0.5.1
  318. 48.79 s [gammaloop-workspace-check] Checking amd v0.2.2
  319. 48.85 s [gammaloop-workspace-check] Checking itertools v0.11.0
  320. 49.00 s [gammaloop-workspace-check] Compiling gammaloop-tracing-filter-macros v0.1.0 (/build/source/crates/gammaloop-tracing-filter-macros)
  321. 49.18 s [gammaloop-workspace-check] Checking rustc-demangle v0.1.27
  322. 49.32 s [gammaloop-workspace-check] Checking option-ext v0.2.0
  323. 49.47 s [gammaloop-workspace-check] Checking dirs-sys v0.5.0
  324. 49.48 s [gammaloop-workspace-check] Checking env_logger v0.11.10
  325. 49.57 s [gammaloop-workspace-check] Checking ref-cast v1.0.25
  326. 49.62 s [gammaloop-workspace-check] Checking nix v0.31.2
  327. 49.65 s [gammaloop-workspace-check] Checking rkyv v0.7.46
  328. 49.71 s [gammaloop-workspace-check] Checking integer-sqrt v0.1.5
  329. 49.75 s [gammaloop-workspace-check] Checking brotli-decompressor v4.0.3
  330. 49.79 s [gammaloop-workspace-check] Checking crossbeam-channel v0.5.15
  331. 49.83 s [gammaloop-workspace-check] Checking itertools v0.12.1
  332. 49.96 s [gammaloop-workspace-check] Checking symlink v0.1.0
  333. 50.04 s [gammaloop-workspace-check] Checking ratatui-widgets v0.3.0
  334. 50.06 s [gammaloop-workspace-check] Checking ratatui-crossterm v0.1.0
  335. 50.12 s [gammaloop-workspace-check] Checking color-spantrace v0.3.0
  336. 50.32 s [gammaloop-workspace-check] Compiling gammalooprs v0.3.4 (/build/source/crates/gammalooprs)
  337. 50.42 s [gammaloop-workspace-check] Checking unsafe-libyaml v0.2.11
  338. 50.53 s [gammaloop-workspace-check] Checking ctrlc v3.5.2
  339. 50.77 s [gammaloop-workspace-check] Checking include_dir v0.7.4
  340. 50.85 s [gammaloop-workspace-check] Checking pathfinding v4.15.0
  341. 50.95 s [gammaloop-workspace-check] Checking tracing-appender v0.2.5
  342. 51.01 s [gammaloop-workspace-check] Checking schemars v1.2.1
  343. 51.04 s [gammaloop-workspace-check] Checking brotli v7.0.0
  344. 51.25 s [gammaloop-workspace-check] Checking dirs v6.0.0
  345. 51.28 s [gammaloop-workspace-check] Checking clarabel v0.11.1
  346. 51.34 s [gammaloop-workspace-check] Checking slotmap v1.1.1
  347. 51.68 s [gammaloop-workspace-check] Compiling numerica v2.2.0 (https://github.com/alphal00p/symbolica?rev=a277a8dadbaae5a8d6605f2f381991a601e1f345#a277a8da)
  348. 51.78 s [gammaloop-workspace-check] Checking addr2line v0.25.1
  349. 51.80 s [gammaloop-workspace-check] Checking ratatui-macros v0.7.0
  350. 51.95 s [gammaloop-workspace-check] Checking ratatui v0.30.0
  351. 51.99 s [gammaloop-workspace-check] Checking serde_yaml v0.9.34+deprecated
  352. 52.28 s [gammaloop-workspace-check] Checking tracing-indicatif v0.3.14
  353. 52.32 s [gammaloop-workspace-check] Checking json5 v0.4.1
  354. 52.51 s [gammaloop-workspace-check] Checking vectorize v0.2.0
  355. 52.63 s [gammaloop-workspace-check] Checking base62 v2.2.4
  356. 52.66 s [gammaloop-workspace-check] Checking ringbuffer v0.16.0
  357. 52.74 s [gammaloop-workspace-check] Checking rust-embed v8.11.0
  358. 52.86 s [gammaloop-workspace-check] Checking clap_complete v4.6.3
  359. 52.88 s [gammaloop-workspace-check] Checking fd-lock v4.0.4
  360. 52.90 s [gammaloop-workspace-check] Checking strip-ansi-escapes v0.2.1
  361. 52.94 s [gammaloop-workspace-check] Compiling gammaloop-api v0.1.0 (/build/source/crates/gammaloop-api)
  362. 53.03 s [gammaloop-workspace-check] Checking itertools v0.13.0
  363. 53.10 s [gammaloop-workspace-check] Checking strum v0.26.3
  364. 53.15 s [gammaloop-workspace-check] Checking sysinfo v0.33.1
  365. 53.32 s [gammaloop-workspace-check] Checking shlex v1.3.0
  366. 53.35 s [gammaloop-workspace-check] Checking futures-task v0.3.32
  367. 53.63 s [gammaloop-workspace-check] Checking futures-core v0.3.32
  368. 53.66 s [gammaloop-workspace-check] Checking slab v0.4.12
  369. 53.78 s [gammaloop-workspace-check] Checking clap_complete_nushell v4.6.0
  370. 53.89 s [gammaloop-workspace-check] Checking sdd v3.0.10
  371. 53.94 s [gammaloop-workspace-check] Checking futures-util v0.3.32
  372. 54.02 s [gammaloop-workspace-check] Compiling gammaloop-integration-tests v0.1.0 (/build/source/tests)
  373. 54.10 s [gammaloop-workspace-check] Compiling test-log-core v0.2.20
  374. 54.12 s [gammaloop-workspace-check] Compiling rustc_version v0.4.1
  375. 54.26 s [gammaloop-workspace-check] Checking backtrace v0.3.76
  376. 54.29 s [gammaloop-workspace-check] Checking scc v2.4.0
  377. 54.47 s [gammaloop-workspace-check] Checking which v8.0.2
  378. 54.57 s [gammaloop-workspace-check] Checking bincode v1.3.3
  379. 54.81 s [gammaloop-workspace-check] Compiling gungraun-runner v0.18.2
  380. 54.95 s [gammaloop-workspace-check] Checking color-eyre v0.6.5
  381. 55.29 s [gammaloop-workspace-check] Checking reedline v0.42.0
  382. 55.53 s [gammaloop-workspace-check] Checking proc-macro2 v1.0.106
  383. 55.55 s [gammaloop-workspace-check] Checking base64 v0.21.7
  384. 55.62 s [gammaloop-workspace-check] Checking nalgebra v0.29.0
  385. 55.96 s [gammaloop-workspace-check] Compiling gungraun-macros v0.8.0
  386. 56.11 s [gammaloop-workspace-check] Checking quote v1.0.45
  387. 56.42 s [gammaloop-workspace-check] Checking maplit v1.0.2
  388. 56.52 s [gammaloop-workspace-check] Checking ron v0.8.1
  389. 56.53 s [gammaloop-workspace-check] Compiling iai-callgrind-runner v0.14.2
  390. 57.27 s [gammaloop-workspace-check] Checking futures-executor v0.3.32
  391. 57.32 s [gammaloop-workspace-check] Checking kurbo v0.13.0
  392. 57.51 s [gammaloop-workspace-check] Checking wait-timeout v0.2.1
  393. 57.56 s [gammaloop-workspace-check] Compiling iai-callgrind v0.14.2
  394. 57.66 s [gammaloop-workspace-check] Checking quick-error v1.2.3
  395. 57.74 s [gammaloop-workspace-check] Checking serial_test v3.4.0
  396. 57.77 s [gammaloop-workspace-check] Checking bit-vec v0.8.0
  397. 57.78 s [gammaloop-workspace-check] Checking rusty-fork v0.3.1
  398. 58.13 s [gammaloop-workspace-check] Checking bit-set v0.8.0
  399. 58.26 s [gammaloop-workspace-check] Checking syn v2.0.117
  400. 58.27 s [gammaloop-workspace-check] Compiling iai-callgrind-macros v0.5.1
  401. 58.31 s [gammaloop-workspace-check] Checking rand_xorshift v0.4.0
  402. 58.47 s [gammaloop-workspace-check] Checking console v0.15.11
  403. 58.50 s [gammaloop-workspace-check] Checking pathdiff v0.2.3
  404. 58.57 s [gammaloop-workspace-check] Checking unarray v0.1.4
  405. 58.72 s [gammaloop-workspace-check] Checking proptest v1.11.0
  406. 59.20 s [gammaloop-workspace-check] Compiling test-log-macros v0.2.20
  407. 59.33 s [gammaloop-workspace-check] Checking clinnet v0.1.8 (/build/source/crates/clinnet)
  408. 59.52 s [gammaloop-workspace-check] Checking similar-asserts v1.7.0
  409. 59.57 s [gammaloop-workspace-check] Checking kurvst v0.1.0 (/build/source/crates/kurvst)
  410. 59.96 s [gammaloop-workspace-check] Compiling graphica v2.1.0 (https://github.com/alphal00p/symbolica?rev=a277a8dadbaae5a8d6605f2f381991a601e1f345#a277a8da)
  411. 64.04 s [gammaloop-workspace-check] Checking test-log v0.2.20
  412. 65.82 s [gammaloop-workspace-check] Checking statrs v0.16.1
  413. 67.52 s [gammaloop-workspace-check] Checking momtrop v0.3.0
  414. 71.72 s [gammaloop-workspace-check] Compiling pyo3-macros v0.28.3
  415. 72.17 s [gammaloop-workspace-check] Checking gungraun v0.18.2
  416. 72.83 s [gammaloop-workspace-check] Compiling pyo3-stub-gen-derive v0.17.2
  417. 81.07 s [gammaloop-workspace-check] Checking pyo3-stub-gen v0.17.2
  418. 93.98 s [gammaloop-workspace-check] Checking symbolica-utils v0.1.0 (/build/source/crates/symbolica-utils)
  419. 93.98 s [gammaloop-workspace-check] Checking spenso-macros v0.3.2 (/build/source/crates/spenso-macros)
  420. 419.50 s [gammaloop-workspace-check] Compiling gammaloop-workspace-hack v0.1.0 (/build/source/crates/gammaloop-workspace-hack)
  421. 420.00 s [gammaloop-workspace-check] Checking linnet v0.17.0 (/build/source/crates/linnet)
  422. 426.54 s [gammaloop-workspace-check] Checking spenso v0.6.0 (/build/source/crates/spenso)
  423. 426.75 s [gammaloop-workspace-check] Checking linnet-py v0.1.0 (/build/source/crates/linnet-py)
  424. 426.77 s [gammaloop-workspace-check] Checking linnest v0.1.0 (/build/source/crates/linnest)
  425. 438.67 s [gammaloop-workspace-check] Checking idenso v0.3.0 (/build/source/crates/idenso)
  426. 438.67 s [gammaloop-workspace-check] Checking gammaloop-tracing-filter v0.1.0 (/build/source/crates/gammaloop-tracing-filter)
  427. 442.76 s [gammaloop-workspace-check] Checking spenso-hep-lib v0.1.7 (/build/source/crates/spenso-hep-lib)
  428. 443.09 s [gammaloop-workspace-check] Checking spynso3 v0.1.2 (/build/source/crates/spynso3)
  429. 495.22 s [gammaloop-workspace-check] warning: unused import: `GaussianReferenceFunction`
  430. 495.22 s [gammaloop-workspace-check] --> crates/gammaloop-api/src/state.rs:38:27
  431. 495.22 s [gammaloop-workspace-check] |
  432. 495.22 s [gammaloop-workspace-check] 38 | integrands::process::{GaussianReferenceFunction, ProcessIntegrand},
  433. 495.22 s [gammaloop-workspace-check] | ^^^^^^^^^^^^^^^^^^^^^^^^^
  434. 495.22 s [gammaloop-workspace-check] |
  435. 495.22 s [gammaloop-workspace-check] = note: `#[warn(unused_imports)]` (part of `#[warn(unused)]`) on by default
  436. 495.22 s [gammaloop-workspace-check]
  437. 504.57 s [gammaloop-workspace-check] warning: `gammaloop-api` (lib) generated 1 warning (run `cargo fix --lib -p gammaloop-api` to apply 1 suggestion)
  438. 505.42 s [gammaloop-workspace-check] error[E0560]: struct `CutInfo` has no field named `lmb_channel_id`
  439. 505.42 s [gammaloop-workspace-check] --> tests/tests/test_differential.rs:86:13
  440. 505.42 s [gammaloop-workspace-check] |
  441. 505.42 s [gammaloop-workspace-check] 86 | lmb_channel_id: None,
  442. 505.42 s [gammaloop-workspace-check] | ^^^^^^^^^^^^^^ `CutInfo` does not have this field
  443. 505.42 s [gammaloop-workspace-check] |
  444. 505.42 s [gammaloop-workspace-check] = note: available fields are: `sampling_channel_id`, `sampling_channel_edge_ids`
  445. 505.42 s [gammaloop-workspace-check]
  446. 505.42 s [gammaloop-workspace-check] error[E0560]: struct `CutInfo` has no field named `lmb_channel_edge_ids`
  447. 505.42 s [gammaloop-workspace-check] --> tests/tests/test_differential.rs:87:13
  448. 505.42 s [gammaloop-workspace-check] |
  449. 505.42 s [gammaloop-workspace-check] 87 | lmb_channel_edge_ids: None,
  450. 505.42 s [gammaloop-workspace-check] | ^^^^^^^^^^^^^^^^^^^^ `CutInfo` does not have this field
  451. 505.42 s [gammaloop-workspace-check] |
  452. 505.42 s [gammaloop-workspace-check] = note: available fields are: `sampling_channel_id`, `sampling_channel_edge_ids`
  453. 505.42 s [gammaloop-workspace-check]
  454. 505.45 s [gammaloop-workspace-check] error[E0609]: no field `lmb_channel_edge_ids` on type `CutInfo`
  455. 505.45 s [gammaloop-workspace-check] --> tests/tests/test_evaluation_api.rs:311:10
  456. 505.45 s [gammaloop-workspace-check] |
  457. 505.45 s [gammaloop-workspace-check] 311 | .lmb_channel_edge_ids
  458. 505.45 s [gammaloop-workspace-check] | ^^^^^^^^^^^^^^^^^^^^ unknown field
  459. 505.45 s [gammaloop-workspace-check] |
  460. 505.45 s [gammaloop-workspace-check] = note: available fields are: `particle_pdgs`, `cut_id`, `graph_id`, `graph_group_id`, `orientation_id` ... and 2 others
  461. 505.45 s [gammaloop-workspace-check]
  462. 505.48 s [gammaloop-workspace-check] error[E0609]: no field `lmb_channel_edge_ids` on type `CutInfo`
  463. 505.48 s [gammaloop-workspace-check] --> tests/tests/test_evaluation_api.rs:591:26
  464. 505.48 s [gammaloop-workspace-check] |
  465. 505.48 s [gammaloop-workspace-check] 591 | .lmb_channel_edge_ids
  466. 505.48 s [gammaloop-workspace-check] | ^^^^^^^^^^^^^^^^^^^^ unknown field
  467. 505.48 s [gammaloop-workspace-check] |
  468. 505.48 s [gammaloop-workspace-check] = note: available fields are: `particle_pdgs`, `cut_id`, `graph_id`, `graph_group_id`, `orientation_id` ... and 2 others
  469. 505.48 s [gammaloop-workspace-check]
  470. 505.53 s [gammaloop-workspace-check] error[E0609]: no field `lmb_channel_edge_ids` on type `CutInfo`
  471. 505.53 s [gammaloop-workspace-check] --> tests/tests/test_evaluation_api.rs:1177:18
  472. 505.53 s [gammaloop-workspace-check] |
  473. 505.53 s [gammaloop-workspace-check] 1177 | .lmb_channel_edge_ids
  474. 505.53 s [gammaloop-workspace-check] | ^^^^^^^^^^^^^^^^^^^^ unknown field
  475. 505.53 s [gammaloop-workspace-check] |
  476. 505.53 s [gammaloop-workspace-check] = note: available fields are: `particle_pdgs`, `cut_id`, `graph_id`, `graph_group_id`, `orientation_id` ... and 2 others
  477. 505.53 s [gammaloop-workspace-check]
  478. 505.54 s [gammaloop-workspace-check] For more information about this error, try `rustc --explain E0560`.
  479. 505.56 s [gammaloop-workspace-check] error: could not compile `gammaloop-integration-tests` (test "test_differential") due to 2 previous errors
  480. 505.56 s [gammaloop-workspace-check] warning: build failed, waiting for other jobs to finish...
  481. 505.90 s [gammaloop-workspace-check] error[E0609]: no field `lmb_channel_edge_ids` on type `CutInfo`
  482. 505.90 s [gammaloop-workspace-check] --> tests/tests/test_evaluation_api.rs:1222:22
  483. 505.90 s [gammaloop-workspace-check] |
  484. 505.90 s [gammaloop-workspace-check] 1222 | .lmb_channel_edge_ids
  485. 505.90 s [gammaloop-workspace-check] | ^^^^^^^^^^^^^^^^^^^^ unknown field
  486. 505.90 s [gammaloop-workspace-check] |
  487. 505.90 s [gammaloop-workspace-check] = note: available fields are: `particle_pdgs`, `cut_id`, `graph_id`, `graph_group_id`, `orientation_id` ... and 2 others
  488. 505.90 s [gammaloop-workspace-check]
  489. 505.91 s [gammaloop-workspace-check] error[E0609]: no field `lmb_channel_edge_ids` on type `CutInfo`
  490. 505.91 s [gammaloop-workspace-check] --> tests/tests/test_evaluation_api.rs:1281:14
  491. 505.91 s [gammaloop-workspace-check] |
  492. 505.91 s [gammaloop-workspace-check] 1281 | .lmb_channel_edge_ids
  493. 505.91 s [gammaloop-workspace-check] | ^^^^^^^^^^^^^^^^^^^^ unknown field
  494. 505.91 s [gammaloop-workspace-check] |
  495. 505.91 s [gammaloop-workspace-check] = note: available fields are: `particle_pdgs`, `cut_id`, `graph_id`, `graph_group_id`, `orientation_id` ... and 2 others
  496. 505.91 s [gammaloop-workspace-check]
  497. 505.96 s [gammaloop-workspace-check] error[E0609]: no field `lmb_channel_edge_ids` on type `CutInfo`
  498. 505.96 s [gammaloop-workspace-check] --> tests/tests/test_evaluation_api.rs:1428:18
  499. 505.96 s [gammaloop-workspace-check] |
  500. 505.96 s [gammaloop-workspace-check] 1428 | .lmb_channel_edge_ids
  501. 505.96 s [gammaloop-workspace-check] | ^^^^^^^^^^^^^^^^^^^^ unknown field
  502. 505.96 s [gammaloop-workspace-check] |
  503. 505.96 s [gammaloop-workspace-check] = note: available fields are: `particle_pdgs`, `cut_id`, `graph_id`, `graph_group_id`, `orientation_id` ... and 2 others
  504. 505.96 s [gammaloop-workspace-check]
  505. 506.10 s [gammaloop-workspace-check] For more information about this error, try `rustc --explain E0609`.
  506. 506.12 s [gammaloop-workspace-check] error: could not compile `gammaloop-integration-tests` (test "test_evaluation_api") due to 6 previous errors
  507. 507.59 s [gammaloop-workspace-check] error[E0609]: no field `lmb_channel_id` on type `CutInfo`
  508. 507.59 s [gammaloop-workspace-check] --> tests/tests/test_runs/utils.rs:568:36
  509. 507.59 s [gammaloop-workspace-check] |
  510. 507.59 s [gammaloop-workspace-check] 568 | event.cut_info.lmb_channel_id,
  511. 507.59 s [gammaloop-workspace-check] | ^^^^^^^^^^^^^^ unknown field
  512. 507.59 s [gammaloop-workspace-check] |
  513. 507.59 s [gammaloop-workspace-check] = note: available fields are: `particle_pdgs`, `cut_id`, `graph_id`, `graph_group_id`, `orientation_id` ... and 2 others
  514. 507.59 s [gammaloop-workspace-check]
  515. 507.60 s [gammaloop-workspace-check] error[E0609]: no field `lmb_channel_id` on type `CutInfo`
  516. 507.60 s [gammaloop-workspace-check] --> tests/tests/test_runs/utils.rs:580:36
  517. 507.60 s [gammaloop-workspace-check] |
  518. 507.60 s [gammaloop-workspace-check] 580 | event.cut_info.lmb_channel_id,
  519. 507.60 s [gammaloop-workspace-check] | ^^^^^^^^^^^^^^ unknown field
  520. 507.60 s [gammaloop-workspace-check] |
  521. 507.60 s [gammaloop-workspace-check] = note: available fields are: `particle_pdgs`, `cut_id`, `graph_id`, `graph_group_id`, `orientation_id` ... and 2 others
  522. 507.60 s [gammaloop-workspace-check]
  523. 508.36 s [gammaloop-workspace-check] error: could not compile `gammaloop-integration-tests` (test "test_runs") due to 2 previous errors
  524. 510.17 s Progress: 0 of 1 built (1 failed)
  525. 510.17 s Failed to build gammaloop-workspace-check after 8m22s
  526. 510.18 s Cannot build '/nix/store/b3fn5kzh9il8jkvkrrf819y71fyy0pgd-gammaloop-workspace-check-0.1.0.drv'.
  527. 510.18 s Reason: builder failed with exit code 101.
  528. 510.18 s Output paths:
  529. 510.18 s /nix/store/ar2dnhgd2gdqfiih4l9rzzajapip8jkr-gammaloop-workspace-check-0.1.0
  530. 510.18 s Last 520 log lines:
  531. 510.18 s > Running phase: unpackPhase
  532. 510.18 s > unpacking source archive /nix/store/ckhl73i8snhkklg8cnciy20qmwag9b2k-source
  533. 510.18 s > source root is source
  534. 510.18 s > Running phase: patchPhase
  535. 510.18 s > Executing configureCargoCommonVars
  536. 510.18 s > decompressing cargo artifacts from /nix/store/50vpxlcgfxf2d57i27v3d10zjwxxbm2r-gammaloop-workspace-deps-deps-0.1.0/target.tar.zst to target
  537. 510.18 s > Running phase: updateAutotoolsGnuConfigScriptsPhase
  538. 510.18 s > Running phase: configurePhase
  539. 510.18 s > will append /build/source/.cargo-home/config.toml with contents of /nix/store/5drf77x6km4ky7gwlrzdx9bbd6fz09g3-vendor-cargo-deps/config.toml
  540. 510.18 s > default configurePhase, nothing to do
  541. 510.18 s > Running phase: buildPhase
  542. 510.18 s > +++ command cargo --version
  543. 510.18 s > cargo 1.97.0 (c980f4866 2026-06-30)
  544. 510.18 s > +++ command cargo check --profile ci-optim --locked --workspace --features gammaloop-tracing-filter/clap,gammaloop-tracing-filter/symbolica,idenso/bincode,idenso/reference-cases,linnet/bincode,linnet/drawing,linnet/rkyv,linnet/serde,linnet/symbolica,spenso-macros/shadowing,spenso/shadowing,symbolica/tracing_max_level_info,three-dimensional-reps/display,three-dimensional-reps/eval,three-dimensional-reps/serde --all-targets
  545. 510.18 s > Checking cfg-if v1.0.4
  546. 510.18 s > Checking memchr v2.8.0
  547. 510.18 s > Checking once_cell v1.21.4
  548. 510.18 s > Checking either v1.15.0
  549. 510.18 s > Checking serde_core v1.0.228
  550. 510.18 s > Checking libc v0.2.186
  551. 510.18 s > Checking libm v0.2.16
  552. 510.18 s > Checking itoa v1.0.18
  553. 510.18 s > Checking log v0.4.29
  554. 510.18 s > Checking regex-syntax v0.8.10
  555. 510.18 s > Checking zerocopy v0.8.48
  556. 510.18 s > Checking crossbeam-utils v0.8.21
  557. 510.18 s > Checking equivalent v1.0.2
  558. 510.18 s > Checking zmij v1.0.21
  559. 510.18 s > Checking bytemuck v1.25.0
  560. 510.18 s > Checking lazy_static v1.5.0
  561. 510.18 s > Compiling target-lexicon v0.13.5
  562. 510.18 s > Checking arrayvec v0.7.6
  563. 510.18 s > Checking powerfmt v0.2.0
  564. 510.18 s > Checking pin-project-lite v0.2.17
  565. 510.18 s > Checking num-conv v0.2.1
  566. 510.18 s > Checking time-core v0.1.8
  567. 510.18 s > Checking deranged v0.5.8
  568. 510.18 s > Checking num_threads v0.1.7
  569. 510.18 s > Checking tracing-core v0.1.36
  570. 510.18 s > Checking foldhash v0.2.0
  571. 510.18 s > Checking allocator-api2 v0.2.21
  572. 510.18 s > Checking const-random v0.1.18
  573. 510.18 s > Checking itertools v0.14.0
  574. 510.18 s > Checking unty v0.0.4
  575. 510.18 s > Checking winnow v1.0.2
  576. 510.18 s > Checking nu-ansi-term v0.50.3
  577. 510.18 s > Checking safe_arch v0.7.4
  578. 510.18 s > Checking static_assertions v1.1.0
  579. 510.18 s > Checking safe_arch v1.0.0
  580. 510.18 s > Checking sharded-slab v0.1.7
  581. 510.18 s > Checking aho-corasick v1.1.4
  582. 510.18 s > Checking hashbrown v0.16.1
  583. 510.18 s > Checking crossbeam-epoch v0.9.18
  584. 510.18 s > Checking wide v0.7.33
  585. 510.18 s > Checking tracing-log v0.2.0
  586. 510.18 s > Checking crossbeam-deque v0.8.6
  587. 510.18 s > Checking tracing v0.1.44
  588. 510.18 s > Checking rayon-core v1.13.0
  589. 510.18 s > Checking thread_local v1.1.9
  590. 510.18 s > Checking az v1.3.0
  591. 510.18 s > Checking indenter v0.3.4
  592. 510.18 s > Checking toml_writer v1.1.1+spec-1.1.0
  593. 510.18 s > Checking wide v1.3.0
  594. 510.18 s > Compiling phf_shared v0.11.3
  595. 510.18 s > Checking anyhow v1.0.102
  596. 510.18 s > Checking utf8parse v0.2.2
  597. 510.18 s > Checking dyn-clone v1.0.20
  598. 510.18 s > Compiling pyo3-build-config v0.28.3
  599. 510.18 s > Checking rawpointer v0.2.1
  600. 510.18 s > Checking alloc-no-stdlib v2.0.4
  601. 510.18 s > Checking anstyle-parse v1.0.0
  602. 510.18 s > Checking matrixmultiply v0.3.10
  603. 510.18 s > Checking alloc-stdlib v0.2.2
  604. 510.18 s > Checking rayon v1.12.0
  605. 510.18 s > Checking toml_parser v1.1.2+spec-1.1.0
  606. 510.18 s > Checking anstyle v1.0.14
  607. 510.18 s > Checking anstyle-query v1.1.5
  608. 510.18 s > Checking num-traits v0.2.19
  609. 510.18 s > Checking colored v3.1.1
  610. 510.18 s > Checking colorchoice v1.0.5
  611. 510.18 s > Checking is_terminal_polyfill v1.70.2
  612. 510.18 s > Compiling phf_generator v0.11.3
  613. 510.18 s > Checking anstream v1.0.0
  614. 510.18 s > Checking eyre v0.6.12
  615. 510.18 s > Checking unicode-width v0.2.2
  616. 510.18 s > Checking bitflags v1.3.2
  617. 510.18 s > Compiling phf_codegen v0.11.3
  618. 510.18 s > Checking brotli-decompressor v5.0.0
  619. 510.18 s > Checking inventory v0.3.24
  620. 510.18 s > Checking spec_math v0.1.6
  621. 510.18 s > Checking thiserror v2.0.18
  622. 510.18 s > Compiling getopts v0.2.24
  623. 510.18 s > Checking libloading v0.9.0
  624. 510.18 s > Checking byteorder v1.5.0
  625. 510.18 s > Checking append-only-vec v0.1.8
  626. 510.18 s > Checking regex-automata v0.4.14
  627. 510.18 s > Checking getrandom v0.3.4
  628. 510.18 s > Checking time v0.3.47
  629. 510.18 s > Checking gmp-mpfr-sys v1.7.1
  630. 510.18 s > Checking region v3.0.2
  631. 510.18 s > Checking hugepage-rs v0.1.1
  632. 510.18 s > Checking wasmtime-jit-icache-coherence v34.0.2
  633. 510.18 s > Checking tinyjson v2.5.1
  634. 510.18 s > Checking rand_core v0.9.5
  635. 510.18 s > Checking bytes v1.11.1
  636. 510.18 s > Checking self_cell v1.2.2
  637. 510.18 s > Compiling unicode_names2_generator v1.3.0
  638. 510.18 s > Checking linux-raw-sys v0.12.1
  639. 510.18 s > Checking serde v1.0.228
  640. 510.18 s > Checking serde_json v1.0.149
  641. 510.18 s > Checking approx v0.5.1
  642. 510.18 s > Checking bitflags v2.11.1
  643. 510.18 s > Checking num-integer v0.1.46
  644. 510.18 s > Checking serde_spanned v1.1.1
  645. 510.18 s > Checking toml_datetime v1.1.1+spec-1.1.0
  646. 510.18 s > Compiling unic-common v0.9.0
  647. 510.18 s > Checking toml v1.1.2+spec-1.1.0
  648. 510.18 s > Compiling unic-char-range v0.9.0
  649. 510.18 s > Compiling unic-char-property v0.9.0
  650. 510.18 s > Checking rustix v1.1.4
  651. 510.18 s > Compiling unic-ucd-version v0.9.0
  652. 510.18 s > Compiling is-macro v0.3.7
  653. 510.18 s > Compiling rustpython-parser-vendored v0.4.0
  654. 510.18 s > Checking iana-time-zone v0.1.65
  655. 510.18 s > Checking brotli v8.0.2
  656. 510.18 s > Checking smallvec v1.15.1
  657. 510.18 s > Checking num-complex v0.4.6
  658. 510.18 s > Checking bincode v2.0.1
  659. 510.18 s > Checking tracing-serde v0.2.0
  660. 510.18 s > Checking smartstring v1.0.1
  661. 510.18 s > Checking chrono v0.4.44
  662. 510.18 s > Compiling rustpython-parser v0.4.0
  663. 510.18 s > Compiling phf v0.11.3
  664. 510.18 s > Checking rustc-hash v2.1.2
  665. 510.18 s > Compiling unic-ucd-ident v0.9.0
  666. 510.18 s > Compiling unic-emoji-char v0.9.0
  667. 510.18 s > Compiling lalrpop-util v0.20.2
  668. 510.18 s > Compiling rustc-hash v1.1.0
  669. 510.18 s > Checking rug v1.30.0
  670. 510.18 s > Compiling symbolica v2.2.0 (https://github.com/alphal00p/symbolica?rev=a277a8dadbaae5a8d6605f2f381991a601e1f345#a277a8da)
  671. 510.18 s > Checking unicode-segmentation v1.13.2
  672. 510.18 s > Checking typenum v1.20.0
  673. 510.18 s > Checking getrandom v0.2.17
  674. 510.18 s > Checking scopeguard v1.2.0
  675. 510.18 s > Checking simba v0.9.1
  676. 510.18 s > Checking ndarray v0.17.2
  677. 510.18 s > Checking lock_api v0.4.14
  678. 510.18 s > Checking ppv-lite86 v0.2.21
  679. 510.18 s > Checking ahash v0.8.12
  680. 510.18 s > Checking parking_lot_core v0.9.12
  681. 510.18 s > Checking unicode-ident v1.0.24
  682. 510.18 s > Checking hashbrown v0.17.0
  683. 510.18 s > Checking errno v0.3.14
  684. 510.18 s > Checking strsim v0.11.1
  685. 510.18 s > Checking parking_lot v0.12.5
  686. 510.18 s > Checking generic-array v0.14.7
  687. 510.18 s > Checking rand_chacha v0.9.0
  688. 510.18 s > Checking unicase v2.9.0
  689. 510.18 s > Checking clap_lex v1.1.0
  690. 510.18 s > Checking vte v0.14.1
  691. 510.18 s > Checking signal-hook-registry v1.4.8
  692. 510.18 s > Checking same-file v1.0.6
  693. 510.18 s > Checking walkdir v2.5.0
  694. 510.18 s > Checking signal-hook v0.3.18
  695. 510.18 s > Checking rand v0.9.4
  696. 510.18 s > Checking half v2.7.1
  697. 510.18 s > Checking mio v1.2.0
  698. 510.18 s > Checking terminal_size v0.4.4
  699. 510.18 s > Checking indexmap v2.14.0
  700. 510.18 s > Checking block-buffer v0.10.4
  701. 510.18 s > Checking clap_builder v4.6.0
  702. 510.18 s > Checking crypto-common v0.1.7
  703. 510.18 s > Checking matchers v0.2.0
  704. 510.18 s > Checking regex v1.12.3
  705. 510.18 s > Checking tracing-subscriber v0.3.23
  706. 510.18 s > Checking ciborium-io v0.2.2
  707. 510.18 s > Checking minimal-lexical v0.2.1
  708. 510.18 s > Checking ciborium-ll v0.2.2
  709. 510.18 s > Checking digest v0.10.7
  710. 510.18 s > Checking nom v7.1.3
  711. 510.18 s > Checking signal-hook-mio v0.2.5
  712. 510.18 s > Compiling unicode_names2 v1.3.0
  713. 510.18 s > Checking derive_more v2.1.1
  714. 510.18 s > Checking num-bigint v0.4.6
  715. 510.18 s > Checking console v0.16.3
  716. 510.18 s > Checking bstr v1.12.1
  717. 510.18 s > Checking cpufeatures v0.2.17
  718. 510.18 s > Checking linux-raw-sys v0.4.15
  719. 510.18 s > Checking symjit v2.21.0
  720. 510.18 s > Checking winnow v0.7.15
  721. 510.18 s > Checking rustix v0.38.44
  722. 510.18 s > Checking globset v0.4.18
  723. 510.18 s > Checking sha2 v0.10.9
  724. 510.18 s > Checking clap v4.6.1
  725. 510.18 s > Checking ciborium v0.2.2
  726. 510.18 s > Checking getrandom v0.4.2
  727. 510.18 s > Checking rand_core v0.6.4
  728. 510.18 s > Checking fnv v1.0.7
  729. 510.18 s > Checking plotters-backend v0.3.7
  730. 510.18 s > Checking fastrand v2.4.1
  731. 510.18 s > Checking rust-embed-utils v8.11.0
  732. 510.18 s > Compiling pyo3-macros-backend v0.28.3
  733. 510.18 s > Compiling pyo3-ffi v0.28.3
  734. 510.18 s > Compiling pyo3 v0.28.3
  735. 510.18 s > Compiling numpy v0.28.0
  736. 510.18 s > Checking tempfile v3.27.0
  737. 510.18 s > Checking plotters-svg v0.3.7
  738. 510.18 s > Checking crossterm v0.28.1
  739. 510.18 s > Checking serde_spanned v0.6.9
  740. 510.18 s > Checking toml_datetime v0.6.11
  741. 510.18 s > Checking itertools v0.10.5
  742. 510.18 s > Checking cast v0.3.0
  743. 510.18 s > Checking toml_write v0.1.2
  744. 510.18 s > Checking tap v1.0.1
  745. 510.18 s > Checking ansitok v0.3.0
  746. 510.18 s > Checking wyz v0.5.1
  747. 510.18 s > Checking plotters v0.3.7
  748. 510.18 s > Checking rand_chacha v0.3.1
  749. 510.18 s > Checking radium v0.7.0
  750. 510.18 s > Checking typeid v1.0.3
  751. 510.18 s > Checking similar v2.7.0
  752. 510.18 s > Checking tinytemplate v1.2.1
  753. 510.18 s > Checking ansi-str v0.9.0
  754. 510.18 s > Checking is-terminal v0.4.17
  755. 510.18 s > Checking funty v2.0.0
  756. 510.18 s > Checking anes v0.1.6
  757. 510.18 s > Checking oorandom v11.1.5
  758. 510.18 s > Checking toml_edit v0.22.27
  759. 510.18 s > Checking bytecount v0.6.9
  760. 510.18 s > Checking rand v0.8.6
  761. 510.18 s > Checking testing_table v0.3.0
  762. 510.18 s > Checking papergrid v0.17.0
  763. 510.18 s > Checking ron v0.12.1
  764. 510.18 s > Checking toml_edit v0.25.11+spec-1.1.0
  765. 510.18 s > Checking env_filter v1.0.1
  766. 510.18 s > Checking xprec v0.2.2
  767. 510.18 s > Checking uncased v0.9.10
  768. 510.18 s > Checking jiff v0.2.24
  769. 510.18 s > Checking criterion-plot v0.5.0
  770. 510.18 s > Checking ptr_meta v0.1.4
  771. 510.18 s > Checking ucd-trie v0.1.7
  772. 510.18 s > Checking bitvec v1.0.1
  773. 510.18 s > Checking simdutf8 v0.1.5
  774. 510.18 s > Checking ahash v0.7.8
  775. 510.18 s > Checking approx v0.4.0
  776. 510.18 s > Checking pest v2.8.6
  777. 510.18 s > Checking bytecheck v0.6.12
  778. 510.18 s > Checking seahash v4.1.0
  779. 510.18 s > Checking hashbrown v0.12.3
  780. 510.18 s > Checking cgmath v0.18.0
  781. 510.18 s > Checking criterion v0.5.1
  782. 510.18 s > Checking num-rational v0.4.2
  783. 510.18 s > Checking tabled v0.20.0
  784. 510.18 s > Checking rend v0.4.2
  785. 510.18 s > Checking num-iter v0.1.45
  786. 510.18 s > Checking ref-ops v0.2.5
  787. 510.18 s > Checking num v0.4.3
  788. 510.18 s > Checking insta v1.47.2
  789. 510.18 s > Checking rand_xoshiro v0.6.0
  790. 510.18 s > Checking features v0.10.0
  791. 510.18 s > Checking constcat v0.5.1
  792. 510.18 s > Checking gat-lending-iterator v0.1.8
  793. 510.18 s > Checking colored v2.2.0
  794. 510.18 s > Checking arrayref v0.3.9
  795. 510.18 s > Checking cpufeatures v0.3.0
  796. 510.18 s > Checking constant_time_eq v0.4.2
  797. 510.18 s > Checking base64 v0.22.1
  798. 510.18 s > Checking joinery v2.1.0
  799. 510.18 s > Checking blake3 v1.8.5
  800. 510.18 s > Checking dot-parser v0.5.1
  801. 510.18 s > Checking siphasher v1.0.2
  802. 510.18 s > Checking toml v0.8.23
  803. 510.18 s > Checking phf_shared v0.13.1
  804. 510.18 s > Checking titlecase v2.2.1
  805. 510.18 s > Checking subprocess v0.2.15
  806. 510.18 s > Compiling rustpython-parser-core v0.4.0
  807. 510.18 s > Checking rust_lisp v0.18.0
  808. 510.18 s > Compiling vakint v0.1.2 (/build/source/crates/vakint)
  809. 510.18 s > Checking phf v0.13.1
  810. 510.18 s > Compiling rustpython-ast v0.4.0
  811. 510.18 s > Checking figment v0.10.19
  812. 510.18 s > Checking version-compare v0.2.1
  813. 510.18 s > Checking xpct v0.5.1
  814. 510.18 s > Checking ryu v1.0.23
  815. 510.18 s > Checking castaway v0.2.4
  816. 510.18 s > Checking string-template-plus v0.4.3
  817. 510.18 s > Checking toml_datetime v0.7.5+spec-1.1.0
  818. 510.18 s > Checking strum v0.27.2
  819. 510.18 s > Checking unicode-truncate v2.0.1
  820. 510.18 s > Checking compact_str v0.9.0
  821. 510.18 s > Checking kasuari v0.4.12
  822. 510.18 s > Checking lru v0.16.4
  823. 510.18 s > Checking toml v0.9.12+spec-1.1.0
  824. 510.18 s > Checking vte v0.15.0
  825. 510.18 s > Checking portable-atomic v1.13.1
  826. 510.18 s > Checking unit-prefix v0.5.2
  827. 510.18 s > Checking rand_distr v0.4.3
  828. 510.18 s > Checking vt100 v0.16.2
  829. 510.18 s > Checking simba v0.6.0
  830. 510.18 s > Checking line-clipping v0.3.7
  831. 510.18 s > Compiling three-dimensional-reps v0.1.0 (/build/source/crates/three-dimensional-reps)
  832. 510.18 s > Checking adler2 v2.0.1
  833. 510.18 s > Checking ratatui-core v0.1.0
  834. 510.18 s > Checking gimli v0.32.3
  835. 510.18 s > Checking thiserror v1.0.69
  836. 510.18 s > Checking derive_builder v0.11.2
  837. 510.18 s > Checking miniz_oxide v0.8.9
  838. 510.18 s > Checking crossterm v0.29.0
  839. 510.18 s > Checking object v0.37.3
  840. 510.18 s > Checking indicatif v0.18.4
  841. 510.18 s > Checking owo-colors v4.3.0
  842. 510.18 s > Checking tracing-error v0.2.1
  843. 510.18 s > Checking typed-index-collections v3.5.0
  844. 510.18 s > Checking serde-big-array v0.5.1
  845. 510.18 s > Checking amd v0.2.2
  846. 510.18 s > Checking itertools v0.11.0
  847. 510.18 s > Compiling gammaloop-tracing-filter-macros v0.1.0 (/build/source/crates/gammaloop-tracing-filter-macros)
  848. 510.18 s > Checking rustc-demangle v0.1.27
  849. 510.18 s > Checking option-ext v0.2.0
  850. 510.18 s > Checking dirs-sys v0.5.0
  851. 510.18 s > Checking env_logger v0.11.10
  852. 510.18 s > Checking ref-cast v1.0.25
  853. 510.18 s > Checking nix v0.31.2
  854. 510.18 s > Checking rkyv v0.7.46
  855. 510.18 s > Checking integer-sqrt v0.1.5
  856. 510.18 s > Checking brotli-decompressor v4.0.3
  857. 510.18 s > Checking crossbeam-channel v0.5.15
  858. 510.18 s > Checking itertools v0.12.1
  859. 510.18 s > Checking symlink v0.1.0
  860. 510.18 s > Checking ratatui-widgets v0.3.0
  861. 510.18 s > Checking ratatui-crossterm v0.1.0
  862. 510.18 s > Checking color-spantrace v0.3.0
  863. 510.18 s > Compiling gammalooprs v0.3.4 (/build/source/crates/gammalooprs)
  864. 510.18 s > Checking unsafe-libyaml v0.2.11
  865. 510.18 s > Checking ctrlc v3.5.2
  866. 510.18 s > Checking include_dir v0.7.4
  867. 510.18 s > Checking pathfinding v4.15.0
  868. 510.18 s > Checking tracing-appender v0.2.5
  869. 510.18 s > Checking schemars v1.2.1
  870. 510.18 s > Checking brotli v7.0.0
  871. 510.18 s > Checking dirs v6.0.0
  872. 510.18 s > Checking clarabel v0.11.1
  873. 510.18 s > Checking slotmap v1.1.1
  874. 510.18 s > Compiling numerica v2.2.0 (https://github.com/alphal00p/symbolica?rev=a277a8dadbaae5a8d6605f2f381991a601e1f345#a277a8da)
  875. 510.18 s > Checking addr2line v0.25.1
  876. 510.18 s > Checking ratatui-macros v0.7.0
  877. 510.18 s > Checking ratatui v0.30.0
  878. 510.18 s > Checking serde_yaml v0.9.34+deprecated
  879. 510.18 s > Checking tracing-indicatif v0.3.14
  880. 510.18 s > Checking json5 v0.4.1
  881. 510.18 s > Checking vectorize v0.2.0
  882. 510.18 s > Checking base62 v2.2.4
  883. 510.18 s > Checking ringbuffer v0.16.0
  884. 510.18 s > Checking rust-embed v8.11.0
  885. 510.18 s > Checking clap_complete v4.6.3
  886. 510.18 s > Checking fd-lock v4.0.4
  887. 510.18 s > Checking strip-ansi-escapes v0.2.1
  888. 510.18 s > Compiling gammaloop-api v0.1.0 (/build/source/crates/gammaloop-api)
  889. 510.18 s > Checking itertools v0.13.0
  890. 510.18 s > Checking strum v0.26.3
  891. 510.18 s > Checking sysinfo v0.33.1
  892. 510.18 s > Checking shlex v1.3.0
  893. 510.18 s > Checking futures-task v0.3.32
  894. 510.18 s > Checking futures-core v0.3.32
  895. 510.18 s > Checking slab v0.4.12
  896. 510.18 s > Checking clap_complete_nushell v4.6.0
  897. 510.18 s > Checking sdd v3.0.10
  898. 510.18 s > Checking futures-util v0.3.32
  899. 510.18 s > Compiling gammaloop-integration-tests v0.1.0 (/build/source/tests)
  900. 510.18 s > Compiling test-log-core v0.2.20
  901. 510.18 s > Compiling rustc_version v0.4.1
  902. 510.18 s > Checking backtrace v0.3.76
  903. 510.18 s > Checking scc v2.4.0
  904. 510.18 s > Checking which v8.0.2
  905. 510.18 s > Checking bincode v1.3.3
  906. 510.18 s > Compiling gungraun-runner v0.18.2
  907. 510.18 s > Checking color-eyre v0.6.5
  908. 510.18 s > Checking reedline v0.42.0
  909. 510.18 s > Checking proc-macro2 v1.0.106
  910. 510.18 s > Checking base64 v0.21.7
  911. 510.18 s > Checking nalgebra v0.29.0
  912. 510.18 s > Compiling gungraun-macros v0.8.0
  913. 510.18 s > Checking quote v1.0.45
  914. 510.18 s > Checking maplit v1.0.2
  915. 510.18 s > Checking ron v0.8.1
  916. 510.18 s > Compiling iai-callgrind-runner v0.14.2
  917. 510.18 s > Checking futures-executor v0.3.32
  918. 510.18 s > Checking kurbo v0.13.0
  919. 510.18 s > Checking wait-timeout v0.2.1
  920. 510.18 s > Compiling iai-callgrind v0.14.2
  921. 510.18 s > Checking quick-error v1.2.3
  922. 510.18 s > Checking serial_test v3.4.0
  923. 510.18 s > Checking bit-vec v0.8.0
  924. 510.18 s > Checking rusty-fork v0.3.1
  925. 510.18 s > Checking bit-set v0.8.0
  926. 510.18 s > Checking syn v2.0.117
  927. 510.18 s > Compiling iai-callgrind-macros v0.5.1
  928. 510.18 s > Checking rand_xorshift v0.4.0
  929. 510.18 s > Checking console v0.15.11
  930. 510.18 s > Checking pathdiff v0.2.3
  931. 510.18 s > Checking unarray v0.1.4
  932. 510.18 s > Checking proptest v1.11.0
  933. 510.18 s > Compiling test-log-macros v0.2.20
  934. 510.18 s > Checking clinnet v0.1.8 (/build/source/crates/clinnet)
  935. 510.18 s > Checking similar-asserts v1.7.0
  936. 510.18 s > Checking kurvst v0.1.0 (/build/source/crates/kurvst)
  937. 510.18 s > Compiling graphica v2.1.0 (https://github.com/alphal00p/symbolica?rev=a277a8dadbaae5a8d6605f2f381991a601e1f345#a277a8da)
  938. 510.18 s > Checking test-log v0.2.20
  939. 510.18 s > Checking statrs v0.16.1
  940. 510.18 s > Checking momtrop v0.3.0
  941. 510.18 s > Compiling pyo3-macros v0.28.3
  942. 510.18 s > Checking gungraun v0.18.2
  943. 510.18 s > Compiling pyo3-stub-gen-derive v0.17.2
  944. 510.18 s > Checking pyo3-stub-gen v0.17.2
  945. 510.18 s > Checking symbolica-utils v0.1.0 (/build/source/crates/symbolica-utils)
  946. 510.18 s > Checking spenso-macros v0.3.2 (/build/source/crates/spenso-macros)
  947. 510.18 s > Compiling gammaloop-workspace-hack v0.1.0 (/build/source/crates/gammaloop-workspace-hack)
  948. 510.18 s > Checking linnet v0.17.0 (/build/source/crates/linnet)
  949. 510.18 s > Checking spenso v0.6.0 (/build/source/crates/spenso)
  950. 510.18 s > Checking linnet-py v0.1.0 (/build/source/crates/linnet-py)
  951. 510.18 s > Checking linnest v0.1.0 (/build/source/crates/linnest)
  952. 510.18 s > Checking idenso v0.3.0 (/build/source/crates/idenso)
  953. 510.18 s > Checking gammaloop-tracing-filter v0.1.0 (/build/source/crates/gammaloop-tracing-filter)
  954. 510.18 s > Checking spenso-hep-lib v0.1.7 (/build/source/crates/spenso-hep-lib)
  955. 510.18 s > Checking spynso3 v0.1.2 (/build/source/crates/spynso3)
  956. 510.18 s > warning: unused import: `GaussianReferenceFunction`
  957. 510.18 s > --> crates/gammaloop-api/src/state.rs:38:27
  958. 510.18 s > |
  959. 510.18 s > 38 | integrands::process::{GaussianReferenceFunction, ProcessIntegrand},
  960. 510.18 s > | ^^^^^^^^^^^^^^^^^^^^^^^^^
  961. 510.18 s > |
  962. 510.18 s > = note: `#[warn(unused_imports)]` (part of `#[warn(unused)]`) on by default
  963. 510.18 s >
  964. 510.18 s > warning: `gammaloop-api` (lib) generated 1 warning (run `cargo fix --lib -p gammaloop-api` to apply 1 suggestion)
  965. 510.18 s > error[E0560]: struct `CutInfo` has no field named `lmb_channel_id`
  966. 510.18 s > --> tests/tests/test_differential.rs:86:13
  967. 510.18 s > |
  968. 510.18 s > 86 | lmb_channel_id: None,
  969. 510.18 s > | ^^^^^^^^^^^^^^ `CutInfo` does not have this field
  970. 510.18 s > |
  971. 510.18 s > = note: available fields are: `sampling_channel_id`, `sampling_channel_edge_ids`
  972. 510.18 s >
  973. 510.18 s > error[E0560]: struct `CutInfo` has no field named `lmb_channel_edge_ids`
  974. 510.18 s > --> tests/tests/test_differential.rs:87:13
  975. 510.18 s > |
  976. 510.18 s > 87 | lmb_channel_edge_ids: None,
  977. 510.18 s > | ^^^^^^^^^^^^^^^^^^^^ `CutInfo` does not have this field
  978. 510.18 s > |
  979. 510.18 s > = note: available fields are: `sampling_channel_id`, `sampling_channel_edge_ids`
  980. 510.18 s >
  981. 510.18 s > error[E0609]: no field `lmb_channel_edge_ids` on type `CutInfo`
  982. 510.18 s > --> tests/tests/test_evaluation_api.rs:311:10
  983. 510.18 s > |
  984. 510.18 s > 311 | .lmb_channel_edge_ids
  985. 510.18 s > | ^^^^^^^^^^^^^^^^^^^^ unknown field
  986. 510.18 s > |
  987. 510.18 s > = note: available fields are: `particle_pdgs`, `cut_id`, `graph_id`, `graph_group_id`, `orientation_id` ... and 2 others
  988. 510.18 s >
  989. 510.18 s > error[E0609]: no field `lmb_channel_edge_ids` on type `CutInfo`
  990. 510.18 s > --> tests/tests/test_evaluation_api.rs:591:26
  991. 510.18 s > |
  992. 510.18 s > 591 | .lmb_channel_edge_ids
  993. 510.18 s > | ^^^^^^^^^^^^^^^^^^^^ unknown field
  994. 510.18 s > |
  995. 510.18 s > = note: available fields are: `particle_pdgs`, `cut_id`, `graph_id`, `graph_group_id`, `orientation_id` ... and 2 others
  996. 510.18 s >
  997. 510.18 s > error[E0609]: no field `lmb_channel_edge_ids` on type `CutInfo`
  998. 510.18 s > --> tests/tests/test_evaluation_api.rs:1177:18
  999. 510.18 s > |
  1000. 510.18 s > 1177 | .lmb_channel_edge_ids
  1001. 510.18 s > | ^^^^^^^^^^^^^^^^^^^^ unknown field
  1002. 510.18 s > |
  1003. 510.18 s > = note: available fields are: `particle_pdgs`, `cut_id`, `graph_id`, `graph_group_id`, `orientation_id` ... and 2 others
  1004. 510.18 s >
  1005. 510.18 s > For more information about this error, try `rustc --explain E0560`.
  1006. 510.18 s > error: could not compile `gammaloop-integration-tests` (test "test_differential") due to 2 previous errors
  1007. 510.18 s > warning: build failed, waiting for other jobs to finish...
  1008. 510.18 s > error[E0609]: no field `lmb_channel_edge_ids` on type `CutInfo`
  1009. 510.18 s > --> tests/tests/test_evaluation_api.rs:1222:22
  1010. 510.18 s > |
  1011. 510.18 s > 1222 | .lmb_channel_edge_ids
  1012. 510.18 s > | ^^^^^^^^^^^^^^^^^^^^ unknown field
  1013. 510.18 s > |
  1014. 510.18 s > = note: available fields are: `particle_pdgs`, `cut_id`, `graph_id`, `graph_group_id`, `orientation_id` ... and 2 others
  1015. 510.18 s >
  1016. 510.18 s > error[E0609]: no field `lmb_channel_edge_ids` on type `CutInfo`
  1017. 510.18 s > --> tests/tests/test_evaluation_api.rs:1281:14
  1018. 510.18 s > |
  1019. 510.18 s > 1281 | .lmb_channel_edge_ids
  1020. 510.18 s > | ^^^^^^^^^^^^^^^^^^^^ unknown field
  1021. 510.18 s > |
  1022. 510.18 s > = note: available fields are: `particle_pdgs`, `cut_id`, `graph_id`, `graph_group_id`, `orientation_id` ... and 2 others
  1023. 510.18 s >
  1024. 510.18 s > error[E0609]: no field `lmb_channel_edge_ids` on type `CutInfo`
  1025. 510.18 s > --> tests/tests/test_evaluation_api.rs:1428:18
  1026. 510.18 s > |
  1027. 510.18 s > 1428 | .lmb_channel_edge_ids
  1028. 510.18 s > | ^^^^^^^^^^^^^^^^^^^^ unknown field
  1029. 510.18 s > |
  1030. 510.18 s > = note: available fields are: `particle_pdgs`, `cut_id`, `graph_id`, `graph_group_id`, `orientation_id` ... and 2 others
  1031. 510.18 s >
  1032. 510.18 s > For more information about this error, try `rustc --explain E0609`.
  1033. 510.18 s > error: could not compile `gammaloop-integration-tests` (test "test_evaluation_api") due to 6 previous errors
  1034. 510.18 s > error[E0609]: no field `lmb_channel_id` on type `CutInfo`
  1035. 510.18 s > --> tests/tests/test_runs/utils.rs:568:36
  1036. 510.18 s > |
  1037. 510.18 s > 568 | event.cut_info.lmb_channel_id,
  1038. 510.18 s > | ^^^^^^^^^^^^^^ unknown field
  1039. 510.18 s > |
  1040. 510.18 s > = note: available fields are: `particle_pdgs`, `cut_id`, `graph_id`, `graph_group_id`, `orientation_id` ... and 2 others
  1041. 510.18 s >
  1042. 510.18 s > error[E0609]: no field `lmb_channel_id` on type `CutInfo`
  1043. 510.18 s > --> tests/tests/test_runs/utils.rs:580:36
  1044. 510.18 s > |
  1045. 510.18 s > 580 | event.cut_info.lmb_channel_id,
  1046. 510.18 s > | ^^^^^^^^^^^^^^ unknown field
  1047. 510.18 s > |
  1048. 510.18 s > = note: available fields are: `particle_pdgs`, `cut_id`, `graph_id`, `graph_group_id`, `orientation_id` ... and 2 others
  1049. 510.18 s >
  1050. 510.18 s > error: could not compile `gammaloop-integration-tests` (test "test_runs") due to 2 previous errors
  1051. 510.18 s For full logs, run:
  1052. 510.18 s nix log /nix/store/b3fn5kzh9il8jkvkrrf819y71fyy0pgd-gammaloop-workspace-check-0.1.0.drv
  1053. 510.32 s Build failed.