0.00 s
$ /nix/store/9ypz3flqsrl5xl495mm8h645gadjsxi1-coreutils-9.11/bin/timeout --kill-after=15s 7200s /nix/store/23zk8sgzamrbmj1fday15szf7f2279s8-nix-2.34.7/bin/nix --extra-experimental-features nix-command --extra-experimental-features flakes --log-format internal-json build --no-link --print-out-paths git+https://github.com/alphal00p/gammaloop?ref=advanced_sampling&rev=3f9b1a28473f313d6242a556ada2e8dbcd6f6477&shallow=1#packages.x86_64-linux.crate-test-binaries-gammaloop-integration-tests --print-build-logs
3.82 s
4.65 s
Downloading cached gammaloop-crate-test-dependencies-b8cda0d438c96d4f-inputs from https://cache.nix-ci.com
23.98 s
Downloaded cached gammaloop-crate-test-dependencies-b8cda0d438c96d4f-inputs (3.1 GiB) in 19.3s
23.98 s
Progress: 0 of 4 built, 1 of 2 downloaded from cache
23.98 s
Downloading cached gammaloop-crate-test-dependencies-b8cda0d438c96d4f-deps from https://cache.nix-ci.com
24.14 s
Downloaded cached gammaloop-crate-test-dependencies-b8cda0d438c96d4f-deps (30.1 MiB) in 165ms
24.14 s
Progress: 0 of 4 built, 2 of 2 downloaded from cache
24.27 s
Building /nix/store/3n54lfss9xhwpqcvjwdcan2c71fjp217-gammaloop-crate-test-binaries-gammaloop-integration-tests-b8cda0d438c96d4f-inputs.drv
33.04 s
[gammaloop-crate-test-binaries-gammaloop-integration-tests-b8cda0d438c96d4f-inputs:post-build] Uploading to the NixCI cache: /nix/store/2y6pgnp23nhymhvncrkhdh5r8njnndw8-gammaloop-crate-test-binaries-gammaloop-integration-tests-b8cda0d438c96d4f-inputs
33.08 s
[gammaloop-crate-test-binaries-gammaloop-integration-tests-b8cda0d438c96d4f-inputs:post-build] warning: 'warn-short-path-literals' is deprecated, use 'lint-short-path-literals = ignore' instead
33.12 s
[gammaloop-crate-test-binaries-gammaloop-integration-tests-b8cda0d438c96d4f-inputs:post-build] copying 1 paths...
33.12 s
[gammaloop-crate-test-binaries-gammaloop-integration-tests-b8cda0d438c96d4f-inputs:post-build] copying path '/nix/store/2y6pgnp23nhymhvncrkhdh5r8njnndw8-gammaloop-crate-test-binaries-gammaloop-integration-tests-b8cda0d438c96d4f-inputs' to 'https://cache.nix-ci.com'...
138.20 s
[gammaloop-crate-test-binaries-gammaloop-integration-tests-b8cda0d438c96d4f-inputs:post-build] warning: 'warn-short-path-literals' is deprecated, use 'lint-short-path-literals = ignore' instead
138.46 s
[gammaloop-crate-test-binaries-gammaloop-integration-tests-b8cda0d438c96d4f-inputs:post-build] copying 1 paths...
138.46 s
[gammaloop-crate-test-binaries-gammaloop-integration-tests-b8cda0d438c96d4f-inputs:post-build] copying path '/nix/store/3n54lfss9xhwpqcvjwdcan2c71fjp217-gammaloop-crate-test-binaries-gammaloop-integration-tests-b8cda0d438c96d4f-inputs.drv' to 'https://cache.nix-ci.com'...
138.63 s
Uploaded gammaloop-crate-test-binaries-gammaloop-integration-tests-b8cda0d438c96d4f-inputs in 1m45s
138.63 s
Progress: 1 of 4 built, 2 of 2 downloaded from cache
138.63 s
Built gammaloop-crate-test-binaries-gammaloop-integration-tests-b8cda0d438c96d4f-inputs in 1m54s
138.73 s
Building /nix/store/hi7l229gyfak4kgx0s39badq73ns4b5w-gammaloop-crate-test-binaries-gammaloop-integration-tests-b8cda0d438c96d4f-deps-0.1.0.drv
138.83 s
[gammaloop-crate-test-binaries-gammaloop-integration-tests-b8cda0d438c96d4f-deps] Phase: unpackPhase
138.83 s
[gammaloop-crate-test-binaries-gammaloop-integration-tests-b8cda0d438c96d4f-deps] unpacking source archive /nix/store/zip3xcgspngrl6brgh8zi2jq9frx1qav-source
138.91 s
[gammaloop-crate-test-binaries-gammaloop-integration-tests-b8cda0d438c96d4f-deps] source root is source
138.93 s
[gammaloop-crate-test-binaries-gammaloop-integration-tests-b8cda0d438c96d4f-deps] Phase: patchPhase
139.03 s
[gammaloop-crate-test-binaries-gammaloop-integration-tests-b8cda0d438c96d4f-deps] Executing configureCargoCommonVars
139.04 s
[gammaloop-crate-test-binaries-gammaloop-integration-tests-b8cda0d438c96d4f-deps] copying cargo artifacts from /nix/store/2y6pgnp23nhymhvncrkhdh5r8njnndw8-gammaloop-crate-test-binaries-gammaloop-integration-tests-b8cda0d438c96d4f-inputs/target to target
139.04 s
[gammaloop-crate-test-binaries-gammaloop-integration-tests-b8cda0d438c96d4f-deps] will deep copy artifacts (instead of symlinking) as requested
140.92 s
[gammaloop-crate-test-binaries-gammaloop-integration-tests-b8cda0d438c96d4f-deps] Phase: updateAutotoolsGnuConfigScriptsPhase
140.97 s
[gammaloop-crate-test-binaries-gammaloop-integration-tests-b8cda0d438c96d4f-deps] Phase: configurePhase
140.97 s
[gammaloop-crate-test-binaries-gammaloop-integration-tests-b8cda0d438c96d4f-deps] will append /build/source/.cargo-home/config.toml with contents of /nix/store/5drf77x6km4ky7gwlrzdx9bbd6fz09g3-vendor-cargo-deps/config.toml
140.97 s
[gammaloop-crate-test-binaries-gammaloop-integration-tests-b8cda0d438c96d4f-deps] default configurePhase, nothing to do
140.98 s
[gammaloop-crate-test-binaries-gammaloop-integration-tests-b8cda0d438c96d4f-deps] Phase: buildPhase
140.98 s
[gammaloop-crate-test-binaries-gammaloop-integration-tests-b8cda0d438c96d4f-deps] +++ command cargo --version
140.99 s
[gammaloop-crate-test-binaries-gammaloop-integration-tests-b8cda0d438c96d4f-deps] cargo 1.97.0 (c980f4866 2026-06-30)
140.99 s
[gammaloop-crate-test-binaries-gammaloop-integration-tests-b8cda0d438c96d4f-deps] +++ command cargo test --profile ci-optim --no-run --offline -p gammaloop-integration-tests
141.66 s
[gammaloop-crate-test-binaries-gammaloop-integration-tests-b8cda0d438c96d4f-deps] Compiling gammaloop-integration-tests v0.1.0 (/build/source/tests)
141.80 s
[gammaloop-crate-test-binaries-gammaloop-integration-tests-b8cda0d438c96d4f-deps] error[E0560] : struct `CutInfo` has no field named `lmb_channel_id`
141.80 s
[gammaloop-crate-test-binaries-gammaloop-integration-tests-b8cda0d438c96d4f-deps] --> tests/tests/test_differential.rs:86:13
141.80 s
[gammaloop-crate-test-binaries-gammaloop-integration-tests-b8cda0d438c96d4f-deps] |
141.80 s
[gammaloop-crate-test-binaries-gammaloop-integration-tests-b8cda0d438c96d4f-deps] 86 | lmb_channel_id: None,
141.80 s
[gammaloop-crate-test-binaries-gammaloop-integration-tests-b8cda0d438c96d4f-deps] | ^^^^^^^^^^^^^^ `CutInfo` does not have this field
141.80 s
[gammaloop-crate-test-binaries-gammaloop-integration-tests-b8cda0d438c96d4f-deps] |
141.80 s
[gammaloop-crate-test-binaries-gammaloop-integration-tests-b8cda0d438c96d4f-deps] = note : available fields are: `sampling_channel_id`, `sampling_channel_edge_ids`
141.80 s
[gammaloop-crate-test-binaries-gammaloop-integration-tests-b8cda0d438c96d4f-deps]
141.80 s
[gammaloop-crate-test-binaries-gammaloop-integration-tests-b8cda0d438c96d4f-deps] error[E0560] : struct `CutInfo` has no field named `lmb_channel_edge_ids`
141.80 s
[gammaloop-crate-test-binaries-gammaloop-integration-tests-b8cda0d438c96d4f-deps] --> tests/tests/test_differential.rs:87:13
141.80 s
[gammaloop-crate-test-binaries-gammaloop-integration-tests-b8cda0d438c96d4f-deps] |
141.80 s
[gammaloop-crate-test-binaries-gammaloop-integration-tests-b8cda0d438c96d4f-deps] 87 | lmb_channel_edge_ids: None,
141.80 s
[gammaloop-crate-test-binaries-gammaloop-integration-tests-b8cda0d438c96d4f-deps] | ^^^^^^^^^^^^^^^^^^^^ `CutInfo` does not have this field
141.80 s
[gammaloop-crate-test-binaries-gammaloop-integration-tests-b8cda0d438c96d4f-deps] |
141.80 s
[gammaloop-crate-test-binaries-gammaloop-integration-tests-b8cda0d438c96d4f-deps] = note : available fields are: `sampling_channel_id`, `sampling_channel_edge_ids`
141.80 s
[gammaloop-crate-test-binaries-gammaloop-integration-tests-b8cda0d438c96d4f-deps]
141.82 s
[gammaloop-crate-test-binaries-gammaloop-integration-tests-b8cda0d438c96d4f-deps] error[E0063] : missing field `reference_moments` in initializer of `GraphEvaluationResult<_>`
141.82 s
[gammaloop-crate-test-binaries-gammaloop-integration-tests-b8cda0d438c96d4f-deps] --> tests/tests/test_differential.rs:532:19
141.82 s
[gammaloop-crate-test-binaries-gammaloop-integration-tests-b8cda0d438c96d4f-deps] |
141.82 s
[gammaloop-crate-test-binaries-gammaloop-integration-tests-b8cda0d438c96d4f-deps] 532 | let mut lhs = GraphEvaluationResult {
141.82 s
[gammaloop-crate-test-binaries-gammaloop-integration-tests-b8cda0d438c96d4f-deps] | ^^^^^^^^^^^^^^^^^^^^^ missing `reference_moments`
141.82 s
[gammaloop-crate-test-binaries-gammaloop-integration-tests-b8cda0d438c96d4f-deps]
141.82 s
[gammaloop-crate-test-binaries-gammaloop-integration-tests-b8cda0d438c96d4f-deps] error[E0063] : missing field `reference_moments` in initializer of `GraphEvaluationResult<_>`
141.82 s
[gammaloop-crate-test-binaries-gammaloop-integration-tests-b8cda0d438c96d4f-deps] --> tests/tests/test_differential.rs:539:15
141.82 s
[gammaloop-crate-test-binaries-gammaloop-integration-tests-b8cda0d438c96d4f-deps] |
141.82 s
[gammaloop-crate-test-binaries-gammaloop-integration-tests-b8cda0d438c96d4f-deps] 539 | let rhs = GraphEvaluationResult {
141.82 s
[gammaloop-crate-test-binaries-gammaloop-integration-tests-b8cda0d438c96d4f-deps] | ^^^^^^^^^^^^^^^^^^^^^ missing `reference_moments`
141.82 s
[gammaloop-crate-test-binaries-gammaloop-integration-tests-b8cda0d438c96d4f-deps]
141.89 s
[gammaloop-crate-test-binaries-gammaloop-integration-tests-b8cda0d438c96d4f-deps] Some errors have detailed explanations: E0063, E0560.
141.89 s
[gammaloop-crate-test-binaries-gammaloop-integration-tests-b8cda0d438c96d4f-deps] For more information about an error, try `rustc --explain E0063`.
141.90 s
[gammaloop-crate-test-binaries-gammaloop-integration-tests-b8cda0d438c96d4f-deps] error : could not compile `gammaloop-integration-tests` (test "test_differential") due to 4 previous errors
141.90 s
[gammaloop-crate-test-binaries-gammaloop-integration-tests-b8cda0d438c96d4f-deps] warning : build failed, waiting for other jobs to finish...
143.38 s
[gammaloop-crate-test-binaries-gammaloop-integration-tests-b8cda0d438c96d4f-deps] error[E0609] : no field `lmb_channel_id` on type `CutInfo`
143.38 s
[gammaloop-crate-test-binaries-gammaloop-integration-tests-b8cda0d438c96d4f-deps] --> tests/tests/test_runs/utils.rs:568:36
143.38 s
[gammaloop-crate-test-binaries-gammaloop-integration-tests-b8cda0d438c96d4f-deps] |
143.38 s
[gammaloop-crate-test-binaries-gammaloop-integration-tests-b8cda0d438c96d4f-deps] 568 | event.cut_info.lmb_channel_id,
143.38 s
[gammaloop-crate-test-binaries-gammaloop-integration-tests-b8cda0d438c96d4f-deps] | ^^^^^^^^^^^^^^ unknown field
143.38 s
[gammaloop-crate-test-binaries-gammaloop-integration-tests-b8cda0d438c96d4f-deps] |
143.38 s
[gammaloop-crate-test-binaries-gammaloop-integration-tests-b8cda0d438c96d4f-deps] = note : available fields are: `particle_pdgs`, `cut_id`, `graph_id`, `graph_group_id`, `orientation_id` ... and 2 others
143.38 s
[gammaloop-crate-test-binaries-gammaloop-integration-tests-b8cda0d438c96d4f-deps]
143.39 s
[gammaloop-crate-test-binaries-gammaloop-integration-tests-b8cda0d438c96d4f-deps] error[E0609] : no field `lmb_channel_id` on type `CutInfo`
143.39 s
[gammaloop-crate-test-binaries-gammaloop-integration-tests-b8cda0d438c96d4f-deps] --> tests/tests/test_runs/utils.rs:580:36
143.39 s
[gammaloop-crate-test-binaries-gammaloop-integration-tests-b8cda0d438c96d4f-deps] |
143.39 s
[gammaloop-crate-test-binaries-gammaloop-integration-tests-b8cda0d438c96d4f-deps] 580 | event.cut_info.lmb_channel_id,
143.39 s
[gammaloop-crate-test-binaries-gammaloop-integration-tests-b8cda0d438c96d4f-deps] | ^^^^^^^^^^^^^^ unknown field
143.39 s
[gammaloop-crate-test-binaries-gammaloop-integration-tests-b8cda0d438c96d4f-deps] |
143.39 s
[gammaloop-crate-test-binaries-gammaloop-integration-tests-b8cda0d438c96d4f-deps] = note : available fields are: `particle_pdgs`, `cut_id`, `graph_id`, `graph_group_id`, `orientation_id` ... and 2 others
143.39 s
[gammaloop-crate-test-binaries-gammaloop-integration-tests-b8cda0d438c96d4f-deps]
144.63 s
[gammaloop-crate-test-binaries-gammaloop-integration-tests-b8cda0d438c96d4f-deps] For more information about this error, try `rustc --explain E0609`.
144.68 s
[gammaloop-crate-test-binaries-gammaloop-integration-tests-b8cda0d438c96d4f-deps] error : could not compile `gammaloop-integration-tests` (test "test_runs") due to 2 previous errors
204.75 s
Progress: 1 of 3 built (1 failed), 2 of 2 downloaded from cache
204.75 s
Failed to build gammaloop-crate-test-binaries-gammaloop-integration-tests-b8cda0d438c96d4f-deps after 1m06s
204.75 s
error: Cannot build '/nix/store/hi7l229gyfak4kgx0s39badq73ns4b5w-gammaloop-crate-test-binaries-gammaloop-integration-tests-b8cda0d438c96d4f-deps-0.1.0.drv '.
204.75 s
Reason: builder failed with exit code 101 .
204.75 s
Output paths:
204.75 s
/nix/store/sabzak2d8m3v20w5d6shjq3rkjrgi97y-gammaloop-crate-test-binaries-gammaloop-integration-tests-b8cda0d438c96d4f-deps-0.1.0
204.75 s
Last 66 log lines:
204.75 s
> Running phase: unpackPhase
204.75 s
> unpacking source archive /nix/store/zip3xcgspngrl6brgh8zi2jq9frx1qav-source
204.75 s
> source root is source
204.75 s
> Running phase: patchPhase
204.75 s
> Executing configureCargoCommonVars
204.75 s
> copying cargo artifacts from /nix/store/2y6pgnp23nhymhvncrkhdh5r8njnndw8-gammaloop-crate-test-binaries-gammaloop-integration-tests-b8cda0d438c96d4f-inputs/target to target
204.75 s
> will deep copy artifacts (instead of symlinking) as requested
204.75 s
> Running phase: updateAutotoolsGnuConfigScriptsPhase
204.75 s
> Running phase: configurePhase
204.75 s
> will append /build/source/.cargo-home/config.toml with contents of /nix/store/5drf77x6km4ky7gwlrzdx9bbd6fz09g3-vendor-cargo-deps/config.toml
204.75 s
> default configurePhase, nothing to do
204.75 s
> Running phase: buildPhase
204.75 s
> +++ command cargo --version
204.75 s
> cargo 1.97.0 (c980f4866 2026-06-30)
204.75 s
> +++ command cargo test --profile ci-optim --no-run --offline -p gammaloop-integration-tests
204.75 s
> Compiling gammaloop-integration-tests v0.1.0 (/build/source/tests)
204.75 s
> error[E0560] : struct `CutInfo` has no field named `lmb_channel_id`
204.75 s
> --> tests/tests/test_differential.rs:86:13
204.75 s
> |
204.75 s
> 86 | lmb_channel_id: None,
204.75 s
> | ^^^^^^^^^^^^^^ `CutInfo` does not have this field
204.75 s
> |
204.75 s
> = note : available fields are: `sampling_channel_id`, `sampling_channel_edge_ids`
204.75 s
>
204.75 s
> error[E0560] : struct `CutInfo` has no field named `lmb_channel_edge_ids`
204.75 s
> --> tests/tests/test_differential.rs:87:13
204.75 s
> |
204.75 s
> 87 | lmb_channel_edge_ids: None,
204.75 s
> | ^^^^^^^^^^^^^^^^^^^^ `CutInfo` does not have this field
204.75 s
> |
204.75 s
> = note : available fields are: `sampling_channel_id`, `sampling_channel_edge_ids`
204.75 s
>
204.75 s
> error[E0063] : missing field `reference_moments` in initializer of `GraphEvaluationResult<_>`
204.75 s
> --> tests/tests/test_differential.rs:532:19
204.75 s
> |
204.75 s
> 532 | let mut lhs = GraphEvaluationResult {
204.75 s
> | ^^^^^^^^^^^^^^^^^^^^^ missing `reference_moments`
204.75 s
>
204.75 s
> error[E0063] : missing field `reference_moments` in initializer of `GraphEvaluationResult<_>`
204.75 s
> --> tests/tests/test_differential.rs:539:15
204.75 s
> |
204.75 s
> 539 | let rhs = GraphEvaluationResult {
204.75 s
> | ^^^^^^^^^^^^^^^^^^^^^ missing `reference_moments`
204.75 s
>
204.75 s
> Some errors have detailed explanations: E0063, E0560.
204.75 s
> For more information about an error, try `rustc --explain E0063`.
204.75 s
> error : could not compile `gammaloop-integration-tests` (test "test_differential") due to 4 previous errors
204.75 s
> warning : build failed, waiting for other jobs to finish...
204.75 s
> error[E0609] : no field `lmb_channel_id` on type `CutInfo`
204.75 s
> --> tests/tests/test_runs/utils.rs:568:36
204.75 s
> |
204.75 s
> 568 | event.cut_info.lmb_channel_id,
204.75 s
> | ^^^^^^^^^^^^^^ unknown field
204.75 s
> |
204.75 s
> = note : available fields are: `particle_pdgs`, `cut_id`, `graph_id`, `graph_group_id`, `orientation_id` ... and 2 others
204.75 s
>
204.75 s
> error[E0609] : no field `lmb_channel_id` on type `CutInfo`
204.75 s
> --> tests/tests/test_runs/utils.rs:580:36
204.75 s
> |
204.75 s
> 580 | event.cut_info.lmb_channel_id,
204.75 s
> | ^^^^^^^^^^^^^^ unknown field
204.75 s
> |
204.75 s
> = note : available fields are: `particle_pdgs`, `cut_id`, `graph_id`, `graph_group_id`, `orientation_id` ... and 2 others
204.75 s
>
204.75 s
> For more information about this error, try `rustc --explain E0609`.
204.75 s
> error : could not compile `gammaloop-integration-tests` (test "test_runs") due to 2 previous errors
204.75 s
For full logs, run:
204.75 s
nix log /nix/store/hi7l229gyfak4kgx0s39badq73ns4b5w-gammaloop-crate-test-binaries-gammaloop-integration-tests-b8cda0d438c96d4f-deps-0.1.0.drv
204.75 s
error: Cannot build '/nix/store/3i2bcj7z7ywlkydhm1y4qyv137fa6m23-nix-ci-artifact-barrier-crate-test-binaries-gammaloop-integration-tests.drv '.
204.75 s
Reason: 1 dependency failed .
204.75 s
Output paths:
204.75 s
/nix/store/1yzc17a24lcmb35yrklpxvh6q8vv9zmj-nix-ci-artifact-barrier-crate-test-binaries-gammaloop-integration-tests
204.75 s
Build failed due to failed dependency
204.83 s
Build failed.