1. 0.00 s $ /nix/store/9ypz3flqsrl5xl495mm8h645gadjsxi1-coreutils-9.11/bin/timeout --kill-after=15s 7200s /nix/store/23zk8sgzamrbmj1fday15szf7f2279s8-nix-2.34.7/bin/nix --extra-experimental-features nix-command --extra-experimental-features flakes --log-format internal-json build --no-link --print-out-paths git+https://github.com/alphal00p/gammaloop?ref=advanced_sampling&rev=3f9b1a28473f313d6242a556ada2e8dbcd6f6477&shallow=1#checks.x86_64-linux.gammaloop-check --print-build-logs
  2. 2.26 s
  3. 2.72 s Building /nix/store/gmbpv2azznl3dd48abbm33lq79pdf6qb-gammaloop-workspace-check-0.1.0.drv
  4. 2.78 s [gammaloop-workspace-check] Phase: unpackPhase
  5. 2.78 s [gammaloop-workspace-check] unpacking source archive /nix/store/453bxmlhly4wvsiv1az9yc5fqq6c327k-source
  6. 2.91 s [gammaloop-workspace-check] source root is source
  7. 2.93 s [gammaloop-workspace-check] Phase: patchPhase
  8. 2.94 s [gammaloop-workspace-check] Executing configureCargoCommonVars
  9. 2.94 s [gammaloop-workspace-check] decompressing cargo artifacts from /nix/store/50vpxlcgfxf2d57i27v3d10zjwxxbm2r-gammaloop-workspace-deps-deps-0.1.0/target.tar.zst to target
  10. 4.27 s [gammaloop-workspace-check] Phase: updateAutotoolsGnuConfigScriptsPhase
  11. 4.31 s [gammaloop-workspace-check] Phase: configurePhase
  12. 4.32 s [gammaloop-workspace-check] will append /build/source/.cargo-home/config.toml with contents of /nix/store/5drf77x6km4ky7gwlrzdx9bbd6fz09g3-vendor-cargo-deps/config.toml
  13. 4.32 s [gammaloop-workspace-check] default configurePhase, nothing to do
  14. 4.32 s [gammaloop-workspace-check] Phase: buildPhase
  15. 4.32 s [gammaloop-workspace-check] +++ command cargo --version
  16. 4.33 s [gammaloop-workspace-check] cargo 1.97.0 (c980f4866 2026-06-30)
  17. 4.35 s [gammaloop-workspace-check] +++ command cargo check --profile ci-optim --locked --workspace --features gammaloop-tracing-filter/clap,gammaloop-tracing-filter/symbolica,idenso/bincode,idenso/reference-cases,linnet/bincode,linnet/drawing,linnet/rkyv,linnet/serde,linnet/symbolica,spenso-macros/shadowing,spenso/shadowing,symbolica/tracing_max_level_info,three-dimensional-reps/display,three-dimensional-reps/eval,three-dimensional-reps/serde --all-targets
  18. 4.89 s [gammaloop-workspace-check] Checking cfg-if v1.0.4
  19. 4.89 s [gammaloop-workspace-check] Checking memchr v2.8.0
  20. 4.89 s [gammaloop-workspace-check] Checking once_cell v1.21.4
  21. 4.90 s [gammaloop-workspace-check] Checking either v1.15.0
  22. 4.90 s [gammaloop-workspace-check] Checking serde_core v1.0.228
  23. 4.90 s [gammaloop-workspace-check] Checking libc v0.2.186
  24. 4.90 s [gammaloop-workspace-check] Checking libm v0.2.16
  25. 4.91 s [gammaloop-workspace-check] Checking itoa v1.0.18
  26. 4.92 s [gammaloop-workspace-check] Checking log v0.4.29
  27. 4.92 s [gammaloop-workspace-check] Checking regex-syntax v0.8.10
  28. 4.93 s [gammaloop-workspace-check] Checking zerocopy v0.8.48
  29. 4.93 s [gammaloop-workspace-check] Checking crossbeam-utils v0.8.21
  30. 4.93 s [gammaloop-workspace-check] Checking equivalent v1.0.2
  31. 4.94 s [gammaloop-workspace-check] Checking zmij v1.0.21
  32. 4.94 s [gammaloop-workspace-check] Checking lazy_static v1.5.0
  33. 4.94 s [gammaloop-workspace-check] Checking bytemuck v1.25.0
  34. 4.94 s [gammaloop-workspace-check] Compiling target-lexicon v0.13.5
  35. 4.98 s [gammaloop-workspace-check] Checking arrayvec v0.7.6
  36. 4.99 s [gammaloop-workspace-check] Checking powerfmt v0.2.0
  37. 5.01 s [gammaloop-workspace-check] Checking num_threads v0.1.7
  38. 5.01 s [gammaloop-workspace-check] Checking pin-project-lite v0.2.17
  39. 5.03 s [gammaloop-workspace-check] Checking time-core v0.1.8
  40. 5.05 s [gammaloop-workspace-check] Checking itertools v0.14.0
  41. 5.07 s [gammaloop-workspace-check] Checking num-conv v0.2.1
  42. 5.07 s [gammaloop-workspace-check] Checking tracing-core v0.1.36
  43. 5.08 s [gammaloop-workspace-check] Checking deranged v0.5.8
  44. 5.10 s [gammaloop-workspace-check] Checking allocator-api2 v0.2.21
  45. 5.11 s [gammaloop-workspace-check] Checking safe_arch v0.7.4
  46. 5.12 s [gammaloop-workspace-check] Checking foldhash v0.2.0
  47. 5.14 s [gammaloop-workspace-check] Checking const-random v0.1.18
  48. 5.16 s [gammaloop-workspace-check] Checking nu-ansi-term v0.50.3
  49. 5.18 s [gammaloop-workspace-check] Checking static_assertions v1.1.0
  50. 5.19 s [gammaloop-workspace-check] Checking unty v0.0.4
  51. 5.21 s [gammaloop-workspace-check] Checking aho-corasick v1.1.4
  52. 5.23 s [gammaloop-workspace-check] Checking winnow v1.0.2
  53. 5.23 s [gammaloop-workspace-check] Checking crossbeam-epoch v0.9.18
  54. 5.24 s [gammaloop-workspace-check] Checking safe_arch v1.0.0
  55. 5.31 s [gammaloop-workspace-check] Checking wide v0.7.33
  56. 5.31 s [gammaloop-workspace-check] Checking hashbrown v0.16.1
  57. 5.32 s [gammaloop-workspace-check] Checking tracing v0.1.44
  58. 5.32 s [gammaloop-workspace-check] Checking tracing-log v0.2.0
  59. 5.41 s [gammaloop-workspace-check] Checking sharded-slab v0.1.7
  60. 5.43 s [gammaloop-workspace-check] Checking thread_local v1.1.9
  61. 5.49 s [gammaloop-workspace-check] Checking crossbeam-deque v0.8.6
  62. 5.50 s [gammaloop-workspace-check] Checking az v1.3.0
  63. 5.55 s [gammaloop-workspace-check] Checking indenter v0.3.4
  64. 5.61 s [gammaloop-workspace-check] Checking rayon-core v1.13.0
  65. 5.63 s [gammaloop-workspace-check] Checking toml_writer v1.1.1+spec-1.1.0
  66. 5.65 s [gammaloop-workspace-check] Checking num-traits v0.2.19
  67. 5.73 s [gammaloop-workspace-check] Checking wide v1.3.0
  68. 5.75 s [gammaloop-workspace-check] Compiling phf_shared v0.11.3
  69. 5.76 s [gammaloop-workspace-check] Checking anyhow v1.0.102
  70. 5.84 s [gammaloop-workspace-check] Checking dyn-clone v1.0.20
  71. 5.85 s [gammaloop-workspace-check] Checking getrandom v0.3.4
  72. 5.87 s [gammaloop-workspace-check] Checking time v0.3.47
  73. 5.88 s [gammaloop-workspace-check] Checking gmp-mpfr-sys v1.7.1
  74. 5.89 s [gammaloop-workspace-check] Checking alloc-no-stdlib v2.0.4
  75. 5.91 s [gammaloop-workspace-check] Checking rawpointer v0.2.1
  76. 5.93 s [gammaloop-workspace-check] Checking rayon v1.12.0
  77. 5.93 s [gammaloop-workspace-check] Checking rand_core v0.9.5
  78. 5.95 s [gammaloop-workspace-check] Checking utf8parse v0.2.2
  79. 5.95 s [gammaloop-workspace-check] Checking matrixmultiply v0.3.10
  80. 5.96 s [gammaloop-workspace-check] Checking toml_parser v1.1.2+spec-1.1.0
  81. 6.01 s [gammaloop-workspace-check] Checking alloc-stdlib v0.2.2
  82. 6.02 s [gammaloop-workspace-check] Checking anstyle-parse v1.0.0
  83. 6.06 s [gammaloop-workspace-check] Checking colored v3.1.1
  84. 6.07 s [gammaloop-workspace-check] Checking is_terminal_polyfill v1.70.2
  85. 6.08 s [gammaloop-workspace-check] Checking regex-automata v0.4.14
  86. 6.09 s [gammaloop-workspace-check] Checking anstyle v1.0.14
  87. 6.11 s [gammaloop-workspace-check] Checking anstyle-query v1.1.5
  88. 6.13 s [gammaloop-workspace-check] Checking colorchoice v1.0.5
  89. 6.15 s [gammaloop-workspace-check] Compiling phf_generator v0.11.3
  90. 6.19 s [gammaloop-workspace-check] Checking eyre v0.6.12
  91. 6.20 s [gammaloop-workspace-check] Checking bitflags v1.3.2
  92. 6.20 s [gammaloop-workspace-check] Checking unicode-width v0.2.2
  93. 6.23 s [gammaloop-workspace-check] Checking brotli-decompressor v5.0.0
  94. 6.24 s [gammaloop-workspace-check] Checking serde v1.0.228
  95. 6.25 s [gammaloop-workspace-check] Checking serde_json v1.0.149
  96. 6.26 s [gammaloop-workspace-check] Checking approx v0.5.1
  97. 6.26 s [gammaloop-workspace-check] Checking bitflags v2.11.1
  98. 6.29 s [gammaloop-workspace-check] Checking num-integer v0.1.46
  99. 6.30 s [gammaloop-workspace-check] Compiling pyo3-build-config v0.28.3
  100. 6.34 s [gammaloop-workspace-check] Checking serde_spanned v1.1.1
  101. 6.36 s [gammaloop-workspace-check] Checking toml_datetime v1.1.1+spec-1.1.0
  102. 6.36 s [gammaloop-workspace-check] Checking anstream v1.0.0
  103. 6.37 s [gammaloop-workspace-check] Compiling phf_codegen v0.11.3
  104. 6.40 s [gammaloop-workspace-check] Checking region v3.0.2
  105. 6.43 s [gammaloop-workspace-check] Checking wasmtime-jit-icache-coherence v34.0.2
  106. 6.46 s [gammaloop-workspace-check] Checking hugepage-rs v0.1.1
  107. 6.47 s [gammaloop-workspace-check] Checking spec_math v0.1.6
  108. 6.47 s [gammaloop-workspace-check] Checking inventory v0.3.24
  109. 6.48 s [gammaloop-workspace-check] Checking thiserror v2.0.18
  110. 6.50 s [gammaloop-workspace-check] Checking toml v1.1.2+spec-1.1.0
  111. 6.51 s [gammaloop-workspace-check] Compiling getopts v0.2.24
  112. 6.52 s [gammaloop-workspace-check] Checking libloading v0.9.0
  113. 6.53 s [gammaloop-workspace-check] Checking smallvec v1.15.1
  114. 6.54 s [gammaloop-workspace-check] Checking num-complex v0.4.6
  115. 6.54 s [gammaloop-workspace-check] Checking tracing-serde v0.2.0
  116. 6.55 s [gammaloop-workspace-check] Checking bincode v2.0.1
  117. 6.61 s [gammaloop-workspace-check] Checking smartstring v1.0.1
  118. 6.62 s [gammaloop-workspace-check] Checking tinyjson v2.5.1
  119. 6.65 s [gammaloop-workspace-check] Checking append-only-vec v0.1.8
  120. 6.73 s [gammaloop-workspace-check] Checking bytes v1.11.1
  121. 6.74 s [gammaloop-workspace-check] Checking self_cell v1.2.2
  122. 6.77 s [gammaloop-workspace-check] Checking byteorder v1.5.0
  123. 6.79 s [gammaloop-workspace-check] Compiling unicode_names2_generator v1.3.0
  124. 6.79 s [gammaloop-workspace-check] Checking simba v0.9.1
  125. 6.80 s [gammaloop-workspace-check] Compiling unic-char-range v0.9.0
  126. 6.84 s [gammaloop-workspace-check] Checking brotli v8.0.2
  127. 6.88 s [gammaloop-workspace-check] Compiling unic-common v0.9.0
  128. 6.89 s [gammaloop-workspace-check] Checking linux-raw-sys v0.12.1
  129. 6.90 s [gammaloop-workspace-check] Compiling unic-char-property v0.9.0
  130. 6.93 s [gammaloop-workspace-check] Compiling unic-ucd-version v0.9.0
  131. 6.94 s [gammaloop-workspace-check] Compiling is-macro v0.3.7
  132. 6.99 s [gammaloop-workspace-check] Compiling rustpython-parser-vendored v0.4.0
  133. 7.01 s [gammaloop-workspace-check] Checking iana-time-zone v0.1.65
  134. 7.09 s [gammaloop-workspace-check] Compiling rustpython-parser v0.4.0
  135. 7.12 s [gammaloop-workspace-check] Compiling phf v0.11.3
  136. 7.13 s [gammaloop-workspace-check] Checking rustc-hash v2.1.2
  137. 7.14 s [gammaloop-workspace-check] Checking chrono v0.4.44
  138. 7.15 s [gammaloop-workspace-check] Checking rustix v1.1.4
  139. 7.19 s [gammaloop-workspace-check] Compiling unic-emoji-char v0.9.0
  140. 7.20 s [gammaloop-workspace-check] Compiling unic-ucd-ident v0.9.0
  141. 7.21 s [gammaloop-workspace-check] Checking ndarray v0.17.2
  142. 7.22 s [gammaloop-workspace-check] Compiling lalrpop-util v0.20.2
  143. 7.30 s [gammaloop-workspace-check] Compiling rustc-hash v1.1.0
  144. 7.35 s [gammaloop-workspace-check] Checking rug v1.30.0
  145. 7.36 s [gammaloop-workspace-check] Compiling symbolica v2.2.0 (https://github.com/alphal00p/symbolica?rev=a277a8dadbaae5a8d6605f2f381991a601e1f345#a277a8da)
  146. 7.36 s [gammaloop-workspace-check] Checking unicode-segmentation v1.13.2
  147. 7.39 s [gammaloop-workspace-check] Checking typenum v1.20.0
  148. 7.44 s [gammaloop-workspace-check] Checking getrandom v0.2.17
  149. 7.56 s [gammaloop-workspace-check] Checking scopeguard v1.2.0
  150. 7.60 s [gammaloop-workspace-check] Checking lock_api v0.4.14
  151. 7.62 s [gammaloop-workspace-check] Checking parking_lot_core v0.9.12
  152. 7.72 s [gammaloop-workspace-check] Checking ppv-lite86 v0.2.21
  153. 7.73 s [gammaloop-workspace-check] Checking ahash v0.8.12
  154. 7.76 s [gammaloop-workspace-check] Checking unicode-ident v1.0.24
  155. 7.77 s [gammaloop-workspace-check] Checking hashbrown v0.17.0
  156. 7.81 s [gammaloop-workspace-check] Checking parking_lot v0.12.5
  157. 7.90 s [gammaloop-workspace-check] Checking generic-array v0.14.7
  158. 7.92 s [gammaloop-workspace-check] Checking errno v0.3.14
  159. 7.93 s [gammaloop-workspace-check] Checking strsim v0.11.1
  160. 7.93 s [gammaloop-workspace-check] Checking rand_chacha v0.9.0
  161. 7.99 s [gammaloop-workspace-check] Checking unicase v2.9.0
  162. 8.01 s [gammaloop-workspace-check] Checking clap_lex v1.1.0
  163. 8.04 s [gammaloop-workspace-check] Checking signal-hook-registry v1.4.8
  164. 8.05 s [gammaloop-workspace-check] Checking rand v0.9.4
  165. 8.08 s [gammaloop-workspace-check] Checking vte v0.14.1
  166. 8.10 s [gammaloop-workspace-check] Checking same-file v1.0.6
  167. 8.14 s [gammaloop-workspace-check] Checking indexmap v2.14.0
  168. 8.17 s [gammaloop-workspace-check] Checking signal-hook v0.3.18
  169. 8.18 s [gammaloop-workspace-check] Checking walkdir v2.5.0
  170. 8.18 s [gammaloop-workspace-check] Checking matchers v0.2.0
  171. 8.18 s [gammaloop-workspace-check] Checking regex v1.12.3
  172. 8.24 s [gammaloop-workspace-check] Checking tracing-subscriber v0.3.23
  173. 8.25 s [gammaloop-workspace-check] Checking crypto-common v0.1.7
  174. 8.28 s [gammaloop-workspace-check] Checking block-buffer v0.10.4
  175. 8.30 s [gammaloop-workspace-check] Checking half v2.7.1
  176. 8.31 s [gammaloop-workspace-check] Checking mio v1.2.0
  177. 8.36 s [gammaloop-workspace-check] Checking minimal-lexical v0.2.1
  178. 8.40 s [gammaloop-workspace-check] Checking ciborium-io v0.2.2
  179. 8.41 s [gammaloop-workspace-check] Checking symjit v2.21.0
  180. 8.43 s [gammaloop-workspace-check] Checking terminal_size v0.4.4
  181. 8.44 s [gammaloop-workspace-check] Checking digest v0.10.7
  182. 8.49 s [gammaloop-workspace-check] Checking clap_builder v4.6.0
  183. 8.53 s [gammaloop-workspace-check] Checking nom v7.1.3
  184. 8.54 s [gammaloop-workspace-check] Checking ciborium-ll v0.2.2
  185. 8.56 s [gammaloop-workspace-check] Checking derive_more v2.1.1
  186. 8.57 s [gammaloop-workspace-check] Checking signal-hook-mio v0.2.5
  187. 8.57 s [gammaloop-workspace-check] Checking num-bigint v0.4.6
  188. 8.61 s [gammaloop-workspace-check] Checking console v0.16.3
  189. 8.64 s [gammaloop-workspace-check] Checking bstr v1.12.1
  190. 8.66 s [gammaloop-workspace-check] Checking winnow v0.7.15
  191. 8.89 s [gammaloop-workspace-check] Checking cpufeatures v0.2.17
  192. 8.92 s [gammaloop-workspace-check] Checking linux-raw-sys v0.4.15
  193. 8.96 s [gammaloop-workspace-check] Checking globset v0.4.18
  194. 8.98 s [gammaloop-workspace-check] Checking sha2 v0.10.9
  195. 9.22 s [gammaloop-workspace-check] Checking ciborium v0.2.2
  196. 9.25 s [gammaloop-workspace-check] Checking getrandom v0.4.2
  197. 9.31 s [gammaloop-workspace-check] Checking rustix v0.38.44
  198. 9.34 s [gammaloop-workspace-check] Checking rand_core v0.6.4
  199. 9.48 s [gammaloop-workspace-check] Checking xprec v0.2.2
  200. 9.58 s [gammaloop-workspace-check] Checking fastrand v2.4.1
  201. 9.59 s [gammaloop-workspace-check] Checking plotters-backend v0.3.7
  202. 9.59 s [gammaloop-workspace-check] Checking fnv v1.0.7
  203. 9.62 s [gammaloop-workspace-check] Checking rust-embed-utils v8.11.0
  204. 9.68 s [gammaloop-workspace-check] Checking serde_spanned v0.6.9
  205. 9.73 s [gammaloop-workspace-check] Checking toml_datetime v0.6.11
  206. 9.74 s [gammaloop-workspace-check] Checking tempfile v3.27.0
  207. 9.75 s [gammaloop-workspace-check] Checking itertools v0.10.5
  208. 9.75 s [gammaloop-workspace-check] Checking plotters-svg v0.3.7
  209. 9.76 s [gammaloop-workspace-check] Compiling unicode_names2 v1.3.0
  210. 9.77 s [gammaloop-workspace-check] Checking ansitok v0.3.0
  211. 9.83 s [gammaloop-workspace-check] Checking clap v4.6.1
  212. 9.84 s [gammaloop-workspace-check] Checking tap v1.0.1
  213. 9.88 s [gammaloop-workspace-check] Checking cast v0.3.0
  214. 9.88 s [gammaloop-workspace-check] Checking toml_write v0.1.2
  215. 9.92 s [gammaloop-workspace-check] Checking wyz v0.5.1
  216. 9.97 s [gammaloop-workspace-check] Checking plotters v0.3.7
  217. 10.02 s [gammaloop-workspace-check] Checking rand_chacha v0.3.1
  218. 10.03 s [gammaloop-workspace-check] Checking radium v0.7.0
  219. 10.23 s [gammaloop-workspace-check] Checking typeid v1.0.3
  220. 10.24 s [gammaloop-workspace-check] Checking similar v2.7.0
  221. 10.24 s [gammaloop-workspace-check] Checking ansi-str v0.9.0
  222. 10.26 s [gammaloop-workspace-check] Checking tinytemplate v1.2.1
  223. 10.27 s [gammaloop-workspace-check] Checking crossterm v0.28.1
  224. 10.29 s [gammaloop-workspace-check] Checking toml_edit v0.22.27
  225. 10.31 s [gammaloop-workspace-check] Checking is-terminal v0.4.17
  226. 10.35 s [gammaloop-workspace-check] Checking bytecount v0.6.9
  227. 10.35 s [gammaloop-workspace-check] Checking oorandom v11.1.5
  228. 10.40 s [gammaloop-workspace-check] Checking funty v2.0.0
  229. 10.41 s [gammaloop-workspace-check] Checking anes v0.1.6
  230. 10.43 s [gammaloop-workspace-check] Checking rand v0.8.6
  231. 10.46 s [gammaloop-workspace-check] Checking papergrid v0.17.0
  232. 10.50 s [gammaloop-workspace-check] Checking ron v0.12.1
  233. 10.55 s [gammaloop-workspace-check] Checking testing_table v0.3.0
  234. 10.64 s [gammaloop-workspace-check] Checking toml_edit v0.25.11+spec-1.1.0
  235. 10.66 s [gammaloop-workspace-check] Checking criterion-plot v0.5.0
  236. 10.74 s [gammaloop-workspace-check] Checking env_filter v1.0.1
  237. 10.79 s [gammaloop-workspace-check] Checking bitvec v1.0.1
  238. 10.91 s [gammaloop-workspace-check] Checking uncased v0.9.10
  239. 10.92 s [gammaloop-workspace-check] Checking jiff v0.2.24
  240. 10.94 s [gammaloop-workspace-check] Checking ptr_meta v0.1.4
  241. 11.03 s [gammaloop-workspace-check] Checking criterion v0.5.1
  242. 11.04 s [gammaloop-workspace-check] Checking ucd-trie v0.1.7
  243. 11.08 s [gammaloop-workspace-check] Checking simdutf8 v0.1.5
  244. 11.15 s [gammaloop-workspace-check] Checking ahash v0.7.8
  245. 11.16 s [gammaloop-workspace-check] Checking approx v0.4.0
  246. 11.19 s [gammaloop-workspace-check] Checking bytecheck v0.6.12
  247. 11.20 s [gammaloop-workspace-check] Checking pest v2.8.6
  248. 11.24 s [gammaloop-workspace-check] Checking seahash v4.1.0
  249. 11.28 s [gammaloop-workspace-check] Checking hashbrown v0.12.3
  250. 11.35 s [gammaloop-workspace-check] Checking cgmath v0.18.0
  251. 11.43 s [gammaloop-workspace-check] Checking num-rational v0.4.2
  252. 11.47 s [gammaloop-workspace-check] Checking insta v1.47.2
  253. 11.49 s [gammaloop-workspace-check] Checking tabled v0.20.0
  254. 11.61 s [gammaloop-workspace-check] Checking rend v0.4.2
  255. 11.64 s [gammaloop-workspace-check] Checking num-iter v0.1.45
  256. 11.73 s [gammaloop-workspace-check] Checking ref-ops v0.2.5
  257. 11.74 s [gammaloop-workspace-check] Checking num v0.4.3
  258. 11.79 s [gammaloop-workspace-check] Checking rand_xoshiro v0.6.0
  259. 11.82 s [gammaloop-workspace-check] Checking toml v0.8.23
  260. 11.82 s [gammaloop-workspace-check] Checking features v0.10.0
  261. 11.84 s [gammaloop-workspace-check] Compiling pyo3-ffi v0.28.3
  262. 11.89 s [gammaloop-workspace-check] Compiling pyo3-macros-backend v0.28.3
  263. 12.14 s [gammaloop-workspace-check] Compiling pyo3 v0.28.3
  264. 12.15 s [gammaloop-workspace-check] Compiling numpy v0.28.0
  265. 12.16 s [gammaloop-workspace-check] Checking figment v0.10.19
  266. 12.22 s [gammaloop-workspace-check] Checking dot-parser v0.5.1
  267. 12.26 s [gammaloop-workspace-check] Checking constcat v0.5.1
  268. 12.30 s [gammaloop-workspace-check] Checking gat-lending-iterator v0.1.8
  269. 12.42 s [gammaloop-workspace-check] Checking colored v2.2.0
  270. 12.44 s [gammaloop-workspace-check] Checking cpufeatures v0.3.0
  271. 12.49 s [gammaloop-workspace-check] Checking arrayref v0.3.9
  272. 12.49 s [gammaloop-workspace-check] Checking constant_time_eq v0.4.2
  273. 12.57 s [gammaloop-workspace-check] Checking base64 v0.22.1
  274. 12.59 s [gammaloop-workspace-check] Checking siphasher v1.0.2
  275. 12.60 s [gammaloop-workspace-check] Checking joinery v2.1.0
  276. 12.60 s [gammaloop-workspace-check] Checking subprocess v0.2.15
  277. 12.63 s [gammaloop-workspace-check] Checking blake3 v1.8.5
  278. 12.63 s [gammaloop-workspace-check] Checking rust_lisp v0.18.0
  279. 12.65 s [gammaloop-workspace-check] Compiling vakint v0.1.2 (/build/source/crates/vakint)
  280. 12.71 s [gammaloop-workspace-check] Checking version-compare v0.2.1
  281. 12.75 s [gammaloop-workspace-check] Checking xpct v0.5.1
  282. 12.77 s [gammaloop-workspace-check] Checking titlecase v2.2.1
  283. 12.78 s [gammaloop-workspace-check] Checking phf_shared v0.13.1
  284. 12.79 s [gammaloop-workspace-check] Checking ryu v1.0.23
  285. 12.81 s [gammaloop-workspace-check] Checking castaway v0.2.4
  286. 12.86 s [gammaloop-workspace-check] Checking toml_datetime v0.7.5+spec-1.1.0
  287. 12.92 s [gammaloop-workspace-check] Checking strum v0.27.2
  288. 12.93 s [gammaloop-workspace-check] Checking unicode-truncate v2.0.1
  289. 12.93 s [gammaloop-workspace-check] Checking kasuari v0.4.12
  290. 12.94 s [gammaloop-workspace-check] Checking lru v0.16.4
  291. 12.95 s [gammaloop-workspace-check] Checking phf v0.13.1
  292. 12.97 s [gammaloop-workspace-check] Checking vte v0.15.0
  293. 12.98 s [gammaloop-workspace-check] Compiling rustpython-parser-core v0.4.0
  294. 12.98 s [gammaloop-workspace-check] Checking string-template-plus v0.4.3
  295. 12.99 s [gammaloop-workspace-check] Checking compact_str v0.9.0
  296. 13.01 s [gammaloop-workspace-check] Checking portable-atomic v1.13.1
  297. 13.01 s [gammaloop-workspace-check] Checking unit-prefix v0.5.2
  298. 13.03 s [gammaloop-workspace-check] Checking toml v0.9.12+spec-1.1.0
  299. 13.05 s [gammaloop-workspace-check] Checking rand_distr v0.4.3
  300. 13.06 s [gammaloop-workspace-check] Checking simba v0.6.0
  301. 13.08 s [gammaloop-workspace-check] Checking vt100 v0.16.2
  302. 13.12 s [gammaloop-workspace-check] Compiling rustpython-ast v0.4.0
  303. 13.15 s [gammaloop-workspace-check] Checking line-clipping v0.3.7
  304. 13.17 s [gammaloop-workspace-check] Checking gimli v0.32.3
  305. 13.20 s [gammaloop-workspace-check] Compiling three-dimensional-reps v0.1.0 (/build/source/crates/three-dimensional-reps)
  306. 13.25 s [gammaloop-workspace-check] Checking adler2 v2.0.1
  307. 13.26 s [gammaloop-workspace-check] Checking thiserror v1.0.69
  308. 13.28 s [gammaloop-workspace-check] Checking derive_builder v0.11.2
  309. 13.30 s [gammaloop-workspace-check] Checking owo-colors v4.3.0
  310. 13.32 s [gammaloop-workspace-check] Checking miniz_oxide v0.8.9
  311. 13.34 s [gammaloop-workspace-check] Checking crossterm v0.29.0
  312. 13.35 s [gammaloop-workspace-check] Checking object v0.37.3
  313. 13.36 s [gammaloop-workspace-check] Checking tracing-error v0.2.1
  314. 13.40 s [gammaloop-workspace-check] Checking ratatui-core v0.1.0
  315. 13.43 s [gammaloop-workspace-check] Checking indicatif v0.18.4
  316. 13.45 s [gammaloop-workspace-check] Checking typed-index-collections v3.5.0
  317. 13.52 s [gammaloop-workspace-check] Checking serde-big-array v0.5.1
  318. 13.60 s [gammaloop-workspace-check] Checking amd v0.2.2
  319. 13.64 s [gammaloop-workspace-check] Checking itertools v0.11.0
  320. 13.64 s [gammaloop-workspace-check] Compiling gammaloop-tracing-filter-macros v0.1.0 (/build/source/crates/gammaloop-tracing-filter-macros)
  321. 13.71 s [gammaloop-workspace-check] Checking env_logger v0.11.10
  322. 13.81 s [gammaloop-workspace-check] Checking rustc-demangle v0.1.27
  323. 13.85 s [gammaloop-workspace-check] Checking option-ext v0.2.0
  324. 13.87 s [gammaloop-workspace-check] Checking color-spantrace v0.3.0
  325. 13.89 s [gammaloop-workspace-check] Checking dirs-sys v0.5.0
  326. 13.93 s [gammaloop-workspace-check] Checking ref-cast v1.0.25
  327. 13.94 s [gammaloop-workspace-check] Checking nix v0.31.2
  328. 13.96 s [gammaloop-workspace-check] Checking integer-sqrt v0.1.5
  329. 13.98 s [gammaloop-workspace-check] Checking brotli-decompressor v4.0.3
  330. 13.99 s [gammaloop-workspace-check] Checking crossbeam-channel v0.5.15
  331. 14.01 s [gammaloop-workspace-check] Checking itertools v0.12.1
  332. 14.05 s [gammaloop-workspace-check] Checking unsafe-libyaml v0.2.11
  333. 14.06 s [gammaloop-workspace-check] Checking symlink v0.1.0
  334. 14.10 s [gammaloop-workspace-check] Checking ratatui-widgets v0.3.0
  335. 14.12 s [gammaloop-workspace-check] Checking ratatui-crossterm v0.1.0
  336. 14.15 s [gammaloop-workspace-check] Compiling gammalooprs v0.3.4 (/build/source/crates/gammalooprs)
  337. 14.20 s [gammaloop-workspace-check] Checking rkyv v0.7.46
  338. 14.21 s [gammaloop-workspace-check] Checking schemars v1.2.1
  339. 14.43 s [gammaloop-workspace-check] Checking tracing-appender v0.2.5
  340. 14.43 s [gammaloop-workspace-check] Checking clarabel v0.11.1
  341. 14.53 s [gammaloop-workspace-check] Checking ctrlc v3.5.2
  342. 14.58 s [gammaloop-workspace-check] Checking serde_yaml v0.9.34+deprecated
  343. 14.67 s [gammaloop-workspace-check] Checking include_dir v0.7.4
  344. 14.68 s [gammaloop-workspace-check] Checking pathfinding v4.15.0
  345. 14.70 s [gammaloop-workspace-check] Checking brotli v7.0.0
  346. 14.74 s [gammaloop-workspace-check] Checking dirs v6.0.0
  347. 14.82 s [gammaloop-workspace-check] Compiling numerica v2.2.0 (https://github.com/alphal00p/symbolica?rev=a277a8dadbaae5a8d6605f2f381991a601e1f345#a277a8da)
  348. 14.83 s [gammaloop-workspace-check] Checking slotmap v1.1.1
  349. 14.84 s [gammaloop-workspace-check] Checking addr2line v0.25.1
  350. 14.96 s [gammaloop-workspace-check] Checking tracing-indicatif v0.3.14
  351. 15.07 s [gammaloop-workspace-check] Checking json5 v0.4.1
  352. 15.12 s [gammaloop-workspace-check] Checking vectorize v0.2.0
  353. 15.18 s [gammaloop-workspace-check] Checking ringbuffer v0.16.0
  354. 15.24 s [gammaloop-workspace-check] Checking base62 v2.2.4
  355. 15.27 s [gammaloop-workspace-check] Checking ratatui-macros v0.7.0
  356. 15.31 s [gammaloop-workspace-check] Checking ratatui v0.30.0
  357. 15.31 s [gammaloop-workspace-check] Checking rust-embed v8.11.0
  358. 15.33 s [gammaloop-workspace-check] Checking clap_complete v4.6.3
  359. 15.37 s [gammaloop-workspace-check] Checking fd-lock v4.0.4
  360. 15.41 s [gammaloop-workspace-check] Checking strip-ansi-escapes v0.2.1
  361. 15.43 s [gammaloop-workspace-check] Compiling gammaloop-api v0.1.0 (/build/source/crates/gammaloop-api)
  362. 15.47 s [gammaloop-workspace-check] Checking itertools v0.13.0
  363. 15.49 s [gammaloop-workspace-check] Checking strum v0.26.3
  364. 15.49 s [gammaloop-workspace-check] Checking sysinfo v0.33.1
  365. 15.50 s [gammaloop-workspace-check] Checking shlex v1.3.0
  366. 15.54 s [gammaloop-workspace-check] Checking futures-task v0.3.32
  367. 15.60 s [gammaloop-workspace-check] Checking futures-core v0.3.32
  368. 15.66 s [gammaloop-workspace-check] Checking slab v0.4.12
  369. 15.67 s [gammaloop-workspace-check] Checking sdd v3.0.10
  370. 15.71 s [gammaloop-workspace-check] Compiling gammaloop-integration-tests v0.1.0 (/build/source/tests)
  371. 15.76 s [gammaloop-workspace-check] Checking futures-util v0.3.32
  372. 15.81 s [gammaloop-workspace-check] Checking clap_complete_nushell v4.6.0
  373. 15.81 s [gammaloop-workspace-check] Compiling test-log-core v0.2.20
  374. 15.90 s [gammaloop-workspace-check] Checking scc v2.4.0
  375. 15.91 s [gammaloop-workspace-check] Compiling rustc_version v0.4.1
  376. 15.92 s [gammaloop-workspace-check] Checking which v8.0.2
  377. 15.96 s [gammaloop-workspace-check] Checking bincode v1.3.3
  378. 16.06 s [gammaloop-workspace-check] Compiling gungraun-runner v0.18.2
  379. 16.15 s [gammaloop-workspace-check] Checking nalgebra v0.29.0
  380. 16.18 s [gammaloop-workspace-check] Checking backtrace v0.3.76
  381. 16.31 s [gammaloop-workspace-check] Checking proc-macro2 v1.0.106
  382. 16.43 s [gammaloop-workspace-check] Checking reedline v0.42.0
  383. 16.52 s [gammaloop-workspace-check] Checking color-eyre v0.6.5
  384. 16.64 s [gammaloop-workspace-check] Checking quote v1.0.45
  385. 16.84 s [gammaloop-workspace-check] Checking maplit v1.0.2
  386. 16.85 s [gammaloop-workspace-check] Compiling gungraun-macros v0.8.0
  387. 16.89 s [gammaloop-workspace-check] Checking base64 v0.21.7
  388. 16.89 s [gammaloop-workspace-check] Compiling iai-callgrind-runner v0.14.2
  389. 16.91 s [gammaloop-workspace-check] Checking kurbo v0.13.0
  390. 16.92 s [gammaloop-workspace-check] Checking wait-timeout v0.2.1
  391. 17.02 s [gammaloop-workspace-check] Checking quick-error v1.2.3
  392. 17.07 s [gammaloop-workspace-check] Checking ron v0.8.1
  393. 17.11 s [gammaloop-workspace-check] Compiling iai-callgrind v0.14.2
  394. 17.20 s [gammaloop-workspace-check] Checking bit-vec v0.8.0
  395. 17.37 s [gammaloop-workspace-check] Checking bit-set v0.8.0
  396. 17.39 s [gammaloop-workspace-check] Checking futures-executor v0.3.32
  397. 17.44 s [gammaloop-workspace-check] Checking rusty-fork v0.3.1
  398. 17.46 s [gammaloop-workspace-check] Checking syn v2.0.117
  399. 17.49 s [gammaloop-workspace-check] Checking serial_test v3.4.0
  400. 17.56 s [gammaloop-workspace-check] Compiling iai-callgrind-macros v0.5.1
  401. 17.62 s [gammaloop-workspace-check] Checking rand_xorshift v0.4.0
  402. 17.67 s [gammaloop-workspace-check] Checking console v0.15.11
  403. 17.68 s [gammaloop-workspace-check] Compiling test-log-macros v0.2.20
  404. 17.68 s [gammaloop-workspace-check] Checking pathdiff v0.2.3
  405. 17.71 s [gammaloop-workspace-check] Checking unarray v0.1.4
  406. 17.77 s [gammaloop-workspace-check] Checking proptest v1.11.0
  407. 17.79 s [gammaloop-workspace-check] Checking clinnet v0.1.8 (/build/source/crates/clinnet)
  408. 17.92 s [gammaloop-workspace-check] Checking similar-asserts v1.7.0
  409. 18.03 s [gammaloop-workspace-check] Compiling graphica v2.1.0 (https://github.com/alphal00p/symbolica?rev=a277a8dadbaae5a8d6605f2f381991a601e1f345#a277a8da)
  410. 18.17 s [gammaloop-workspace-check] Checking kurvst v0.1.0 (/build/source/crates/kurvst)
  411. 19.57 s [gammaloop-workspace-check] Checking test-log v0.2.20
  412. 20.41 s [gammaloop-workspace-check] Checking statrs v0.16.1
  413. 21.01 s [gammaloop-workspace-check] Checking momtrop v0.3.0
  414. 22.79 s [gammaloop-workspace-check] Checking gungraun v0.18.2
  415. 22.86 s [gammaloop-workspace-check] Compiling pyo3-stub-gen-derive v0.17.2
  416. 23.20 s [gammaloop-workspace-check] Compiling pyo3-macros v0.28.3
  417. 27.11 s [gammaloop-workspace-check] Checking pyo3-stub-gen v0.17.2
  418. 32.13 s [gammaloop-workspace-check] Checking symbolica-utils v0.1.0 (/build/source/crates/symbolica-utils)
  419. 32.13 s [gammaloop-workspace-check] Checking spenso-macros v0.3.2 (/build/source/crates/spenso-macros)
  420. 182.24 s [gammaloop-workspace-check] Compiling gammaloop-workspace-hack v0.1.0 (/build/source/crates/gammaloop-workspace-hack)
  421. 182.43 s [gammaloop-workspace-check] Checking linnet v0.17.0 (/build/source/crates/linnet)
  422. 185.18 s [gammaloop-workspace-check] Checking spenso v0.6.0 (/build/source/crates/spenso)
  423. 185.44 s [gammaloop-workspace-check] Checking linnet-py v0.1.0 (/build/source/crates/linnet-py)
  424. 185.44 s [gammaloop-workspace-check] Checking linnest v0.1.0 (/build/source/crates/linnest)
  425. 189.31 s [gammaloop-workspace-check] Checking idenso v0.3.0 (/build/source/crates/idenso)
  426. 189.31 s [gammaloop-workspace-check] Checking gammaloop-tracing-filter v0.1.0 (/build/source/crates/gammaloop-tracing-filter)
  427. 190.67 s [gammaloop-workspace-check] Checking spenso-hep-lib v0.1.7 (/build/source/crates/spenso-hep-lib)
  428. 190.80 s [gammaloop-workspace-check] Checking spynso3 v0.1.2 (/build/source/crates/spynso3)
  429. 215.39 s [gammaloop-workspace-check] error[E0560]: struct `CutInfo` has no field named `lmb_channel_id`
  430. 215.39 s [gammaloop-workspace-check] --> tests/tests/test_differential.rs:86:13
  431. 215.39 s [gammaloop-workspace-check] |
  432. 215.39 s [gammaloop-workspace-check] 86 | lmb_channel_id: None,
  433. 215.39 s [gammaloop-workspace-check] | ^^^^^^^^^^^^^^ `CutInfo` does not have this field
  434. 215.39 s [gammaloop-workspace-check] |
  435. 215.39 s [gammaloop-workspace-check] = note: available fields are: `sampling_channel_id`, `sampling_channel_edge_ids`
  436. 215.39 s [gammaloop-workspace-check]
  437. 215.39 s [gammaloop-workspace-check] error[E0560]: struct `CutInfo` has no field named `lmb_channel_edge_ids`
  438. 215.39 s [gammaloop-workspace-check] --> tests/tests/test_differential.rs:87:13
  439. 215.39 s [gammaloop-workspace-check] |
  440. 215.39 s [gammaloop-workspace-check] 87 | lmb_channel_edge_ids: None,
  441. 215.39 s [gammaloop-workspace-check] | ^^^^^^^^^^^^^^^^^^^^ `CutInfo` does not have this field
  442. 215.39 s [gammaloop-workspace-check] |
  443. 215.39 s [gammaloop-workspace-check] = note: available fields are: `sampling_channel_id`, `sampling_channel_edge_ids`
  444. 215.39 s [gammaloop-workspace-check]
  445. 215.40 s [gammaloop-workspace-check] error[E0063]: missing field `reference_moments` in initializer of `GraphEvaluationResult<_>`
  446. 215.40 s [gammaloop-workspace-check] --> tests/tests/test_differential.rs:532:19
  447. 215.40 s [gammaloop-workspace-check] |
  448. 215.40 s [gammaloop-workspace-check] 532 | let mut lhs = GraphEvaluationResult {
  449. 215.40 s [gammaloop-workspace-check] | ^^^^^^^^^^^^^^^^^^^^^ missing `reference_moments`
  450. 215.40 s [gammaloop-workspace-check]
  451. 215.40 s [gammaloop-workspace-check] error[E0063]: missing field `reference_moments` in initializer of `GraphEvaluationResult<_>`
  452. 215.40 s [gammaloop-workspace-check] --> tests/tests/test_differential.rs:539:15
  453. 215.40 s [gammaloop-workspace-check] |
  454. 215.40 s [gammaloop-workspace-check] 539 | let rhs = GraphEvaluationResult {
  455. 215.40 s [gammaloop-workspace-check] | ^^^^^^^^^^^^^^^^^^^^^ missing `reference_moments`
  456. 215.40 s [gammaloop-workspace-check]
  457. 215.44 s [gammaloop-workspace-check] Some errors have detailed explanations: E0063, E0560.
  458. 215.44 s [gammaloop-workspace-check] For more information about an error, try `rustc --explain E0063`.
  459. 215.45 s [gammaloop-workspace-check] error: could not compile `gammaloop-integration-tests` (test "test_differential") due to 4 previous errors
  460. 215.45 s [gammaloop-workspace-check] warning: build failed, waiting for other jobs to finish...
  461. 216.03 s [gammaloop-workspace-check] error[E0609]: no field `lmb_channel_id` on type `CutInfo`
  462. 216.03 s [gammaloop-workspace-check] --> tests/tests/test_runs/utils.rs:568:36
  463. 216.03 s [gammaloop-workspace-check] |
  464. 216.03 s [gammaloop-workspace-check] 568 | event.cut_info.lmb_channel_id,
  465. 216.03 s [gammaloop-workspace-check] | ^^^^^^^^^^^^^^ unknown field
  466. 216.03 s [gammaloop-workspace-check] |
  467. 216.03 s [gammaloop-workspace-check] = note: available fields are: `particle_pdgs`, `cut_id`, `graph_id`, `graph_group_id`, `orientation_id` ... and 2 others
  468. 216.03 s [gammaloop-workspace-check]
  469. 216.03 s [gammaloop-workspace-check] error[E0609]: no field `lmb_channel_id` on type `CutInfo`
  470. 216.03 s [gammaloop-workspace-check] --> tests/tests/test_runs/utils.rs:580:36
  471. 216.03 s [gammaloop-workspace-check] |
  472. 216.03 s [gammaloop-workspace-check] 580 | event.cut_info.lmb_channel_id,
  473. 216.03 s [gammaloop-workspace-check] | ^^^^^^^^^^^^^^ unknown field
  474. 216.03 s [gammaloop-workspace-check] |
  475. 216.03 s [gammaloop-workspace-check] = note: available fields are: `particle_pdgs`, `cut_id`, `graph_id`, `graph_group_id`, `orientation_id` ... and 2 others
  476. 216.03 s [gammaloop-workspace-check]
  477. 216.40 s [gammaloop-workspace-check] For more information about this error, try `rustc --explain E0609`.
  478. 216.42 s [gammaloop-workspace-check] error: could not compile `gammaloop-integration-tests` (test "test_runs") due to 2 previous errors
  479. 216.92 s Progress: 0 of 1 built (1 failed)
  480. 216.92 s Failed to build gammaloop-workspace-check after 3m34s
  481. 216.93 s Cannot build '/nix/store/gmbpv2azznl3dd48abbm33lq79pdf6qb-gammaloop-workspace-check-0.1.0.drv'.
  482. 216.93 s Reason: builder failed with exit code 101.
  483. 216.93 s Output paths:
  484. 216.93 s /nix/store/8rmjky42njpx16i1pybw197fgff2qc5d-gammaloop-workspace-check-0.1.0
  485. 216.93 s Last 475 log lines:
  486. 216.93 s > Running phase: unpackPhase
  487. 216.93 s > unpacking source archive /nix/store/453bxmlhly4wvsiv1az9yc5fqq6c327k-source
  488. 216.93 s > source root is source
  489. 216.93 s > Running phase: patchPhase
  490. 216.93 s > Executing configureCargoCommonVars
  491. 216.93 s > decompressing cargo artifacts from /nix/store/50vpxlcgfxf2d57i27v3d10zjwxxbm2r-gammaloop-workspace-deps-deps-0.1.0/target.tar.zst to target
  492. 216.93 s > Running phase: updateAutotoolsGnuConfigScriptsPhase
  493. 216.93 s > Running phase: configurePhase
  494. 216.93 s > will append /build/source/.cargo-home/config.toml with contents of /nix/store/5drf77x6km4ky7gwlrzdx9bbd6fz09g3-vendor-cargo-deps/config.toml
  495. 216.93 s > default configurePhase, nothing to do
  496. 216.93 s > Running phase: buildPhase
  497. 216.93 s > +++ command cargo --version
  498. 216.93 s > cargo 1.97.0 (c980f4866 2026-06-30)
  499. 216.93 s > +++ command cargo check --profile ci-optim --locked --workspace --features gammaloop-tracing-filter/clap,gammaloop-tracing-filter/symbolica,idenso/bincode,idenso/reference-cases,linnet/bincode,linnet/drawing,linnet/rkyv,linnet/serde,linnet/symbolica,spenso-macros/shadowing,spenso/shadowing,symbolica/tracing_max_level_info,three-dimensional-reps/display,three-dimensional-reps/eval,three-dimensional-reps/serde --all-targets
  500. 216.93 s > Checking cfg-if v1.0.4
  501. 216.93 s > Checking memchr v2.8.0
  502. 216.93 s > Checking once_cell v1.21.4
  503. 216.93 s > Checking either v1.15.0
  504. 216.93 s > Checking serde_core v1.0.228
  505. 216.93 s > Checking libc v0.2.186
  506. 216.93 s > Checking libm v0.2.16
  507. 216.93 s > Checking itoa v1.0.18
  508. 216.93 s > Checking log v0.4.29
  509. 216.93 s > Checking regex-syntax v0.8.10
  510. 216.93 s > Checking zerocopy v0.8.48
  511. 216.93 s > Checking crossbeam-utils v0.8.21
  512. 216.93 s > Checking equivalent v1.0.2
  513. 216.93 s > Checking zmij v1.0.21
  514. 216.93 s > Checking lazy_static v1.5.0
  515. 216.93 s > Checking bytemuck v1.25.0
  516. 216.93 s > Compiling target-lexicon v0.13.5
  517. 216.93 s > Checking arrayvec v0.7.6
  518. 216.93 s > Checking powerfmt v0.2.0
  519. 216.93 s > Checking num_threads v0.1.7
  520. 216.93 s > Checking pin-project-lite v0.2.17
  521. 216.93 s > Checking time-core v0.1.8
  522. 216.93 s > Checking itertools v0.14.0
  523. 216.93 s > Checking num-conv v0.2.1
  524. 216.93 s > Checking tracing-core v0.1.36
  525. 216.93 s > Checking deranged v0.5.8
  526. 216.93 s > Checking allocator-api2 v0.2.21
  527. 216.93 s > Checking safe_arch v0.7.4
  528. 216.93 s > Checking foldhash v0.2.0
  529. 216.93 s > Checking const-random v0.1.18
  530. 216.93 s > Checking nu-ansi-term v0.50.3
  531. 216.93 s > Checking static_assertions v1.1.0
  532. 216.93 s > Checking unty v0.0.4
  533. 216.93 s > Checking aho-corasick v1.1.4
  534. 216.93 s > Checking winnow v1.0.2
  535. 216.93 s > Checking crossbeam-epoch v0.9.18
  536. 216.93 s > Checking safe_arch v1.0.0
  537. 216.93 s > Checking wide v0.7.33
  538. 216.93 s > Checking hashbrown v0.16.1
  539. 216.93 s > Checking tracing v0.1.44
  540. 216.93 s > Checking tracing-log v0.2.0
  541. 216.93 s > Checking sharded-slab v0.1.7
  542. 216.93 s > Checking thread_local v1.1.9
  543. 216.93 s > Checking crossbeam-deque v0.8.6
  544. 216.93 s > Checking az v1.3.0
  545. 216.93 s > Checking indenter v0.3.4
  546. 216.93 s > Checking rayon-core v1.13.0
  547. 216.93 s > Checking toml_writer v1.1.1+spec-1.1.0
  548. 216.93 s > Checking num-traits v0.2.19
  549. 216.93 s > Checking wide v1.3.0
  550. 216.93 s > Compiling phf_shared v0.11.3
  551. 216.93 s > Checking anyhow v1.0.102
  552. 216.93 s > Checking dyn-clone v1.0.20
  553. 216.93 s > Checking getrandom v0.3.4
  554. 216.93 s > Checking time v0.3.47
  555. 216.93 s > Checking gmp-mpfr-sys v1.7.1
  556. 216.93 s > Checking alloc-no-stdlib v2.0.4
  557. 216.93 s > Checking rawpointer v0.2.1
  558. 216.93 s > Checking rayon v1.12.0
  559. 216.93 s > Checking rand_core v0.9.5
  560. 216.93 s > Checking utf8parse v0.2.2
  561. 216.93 s > Checking matrixmultiply v0.3.10
  562. 216.93 s > Checking toml_parser v1.1.2+spec-1.1.0
  563. 216.93 s > Checking alloc-stdlib v0.2.2
  564. 216.93 s > Checking anstyle-parse v1.0.0
  565. 216.93 s > Checking colored v3.1.1
  566. 216.93 s > Checking is_terminal_polyfill v1.70.2
  567. 216.93 s > Checking regex-automata v0.4.14
  568. 216.93 s > Checking anstyle v1.0.14
  569. 216.93 s > Checking anstyle-query v1.1.5
  570. 216.93 s > Checking colorchoice v1.0.5
  571. 216.93 s > Compiling phf_generator v0.11.3
  572. 216.93 s > Checking eyre v0.6.12
  573. 216.93 s > Checking bitflags v1.3.2
  574. 216.93 s > Checking unicode-width v0.2.2
  575. 216.93 s > Checking brotli-decompressor v5.0.0
  576. 216.93 s > Checking serde v1.0.228
  577. 216.93 s > Checking serde_json v1.0.149
  578. 216.93 s > Checking approx v0.5.1
  579. 216.93 s > Checking bitflags v2.11.1
  580. 216.93 s > Checking num-integer v0.1.46
  581. 216.93 s > Compiling pyo3-build-config v0.28.3
  582. 216.93 s > Checking serde_spanned v1.1.1
  583. 216.93 s > Checking toml_datetime v1.1.1+spec-1.1.0
  584. 216.93 s > Checking anstream v1.0.0
  585. 216.93 s > Compiling phf_codegen v0.11.3
  586. 216.93 s > Checking region v3.0.2
  587. 216.93 s > Checking wasmtime-jit-icache-coherence v34.0.2
  588. 216.93 s > Checking hugepage-rs v0.1.1
  589. 216.93 s > Checking spec_math v0.1.6
  590. 216.93 s > Checking inventory v0.3.24
  591. 216.93 s > Checking thiserror v2.0.18
  592. 216.93 s > Checking toml v1.1.2+spec-1.1.0
  593. 216.93 s > Compiling getopts v0.2.24
  594. 216.93 s > Checking libloading v0.9.0
  595. 216.93 s > Checking smallvec v1.15.1
  596. 216.93 s > Checking num-complex v0.4.6
  597. 216.93 s > Checking tracing-serde v0.2.0
  598. 216.93 s > Checking bincode v2.0.1
  599. 216.93 s > Checking smartstring v1.0.1
  600. 216.93 s > Checking tinyjson v2.5.1
  601. 216.93 s > Checking append-only-vec v0.1.8
  602. 216.93 s > Checking bytes v1.11.1
  603. 216.93 s > Checking self_cell v1.2.2
  604. 216.93 s > Checking byteorder v1.5.0
  605. 216.93 s > Compiling unicode_names2_generator v1.3.0
  606. 216.93 s > Checking simba v0.9.1
  607. 216.93 s > Compiling unic-char-range v0.9.0
  608. 216.93 s > Checking brotli v8.0.2
  609. 216.93 s > Compiling unic-common v0.9.0
  610. 216.93 s > Checking linux-raw-sys v0.12.1
  611. 216.93 s > Compiling unic-char-property v0.9.0
  612. 216.93 s > Compiling unic-ucd-version v0.9.0
  613. 216.93 s > Compiling is-macro v0.3.7
  614. 216.93 s > Compiling rustpython-parser-vendored v0.4.0
  615. 216.93 s > Checking iana-time-zone v0.1.65
  616. 216.93 s > Compiling rustpython-parser v0.4.0
  617. 216.93 s > Compiling phf v0.11.3
  618. 216.93 s > Checking rustc-hash v2.1.2
  619. 216.93 s > Checking chrono v0.4.44
  620. 216.93 s > Checking rustix v1.1.4
  621. 216.93 s > Compiling unic-emoji-char v0.9.0
  622. 216.93 s > Compiling unic-ucd-ident v0.9.0
  623. 216.93 s > Checking ndarray v0.17.2
  624. 216.93 s > Compiling lalrpop-util v0.20.2
  625. 216.93 s > Compiling rustc-hash v1.1.0
  626. 216.93 s > Checking rug v1.30.0
  627. 216.93 s > Compiling symbolica v2.2.0 (https://github.com/alphal00p/symbolica?rev=a277a8dadbaae5a8d6605f2f381991a601e1f345#a277a8da)
  628. 216.93 s > Checking unicode-segmentation v1.13.2
  629. 216.93 s > Checking typenum v1.20.0
  630. 216.93 s > Checking getrandom v0.2.17
  631. 216.93 s > Checking scopeguard v1.2.0
  632. 216.93 s > Checking lock_api v0.4.14
  633. 216.93 s > Checking parking_lot_core v0.9.12
  634. 216.93 s > Checking ppv-lite86 v0.2.21
  635. 216.93 s > Checking ahash v0.8.12
  636. 216.93 s > Checking unicode-ident v1.0.24
  637. 216.93 s > Checking hashbrown v0.17.0
  638. 216.93 s > Checking parking_lot v0.12.5
  639. 216.93 s > Checking generic-array v0.14.7
  640. 216.93 s > Checking errno v0.3.14
  641. 216.93 s > Checking strsim v0.11.1
  642. 216.93 s > Checking rand_chacha v0.9.0
  643. 216.93 s > Checking unicase v2.9.0
  644. 216.93 s > Checking clap_lex v1.1.0
  645. 216.93 s > Checking signal-hook-registry v1.4.8
  646. 216.93 s > Checking rand v0.9.4
  647. 216.93 s > Checking vte v0.14.1
  648. 216.93 s > Checking same-file v1.0.6
  649. 216.93 s > Checking indexmap v2.14.0
  650. 216.93 s > Checking signal-hook v0.3.18
  651. 216.93 s > Checking walkdir v2.5.0
  652. 216.93 s > Checking matchers v0.2.0
  653. 216.93 s > Checking regex v1.12.3
  654. 216.93 s > Checking tracing-subscriber v0.3.23
  655. 216.93 s > Checking crypto-common v0.1.7
  656. 216.93 s > Checking block-buffer v0.10.4
  657. 216.93 s > Checking half v2.7.1
  658. 216.93 s > Checking mio v1.2.0
  659. 216.93 s > Checking minimal-lexical v0.2.1
  660. 216.93 s > Checking ciborium-io v0.2.2
  661. 216.93 s > Checking symjit v2.21.0
  662. 216.93 s > Checking terminal_size v0.4.4
  663. 216.93 s > Checking digest v0.10.7
  664. 216.93 s > Checking clap_builder v4.6.0
  665. 216.93 s > Checking nom v7.1.3
  666. 216.93 s > Checking ciborium-ll v0.2.2
  667. 216.93 s > Checking derive_more v2.1.1
  668. 216.93 s > Checking signal-hook-mio v0.2.5
  669. 216.93 s > Checking num-bigint v0.4.6
  670. 216.93 s > Checking console v0.16.3
  671. 216.93 s > Checking bstr v1.12.1
  672. 216.93 s > Checking winnow v0.7.15
  673. 216.93 s > Checking cpufeatures v0.2.17
  674. 216.93 s > Checking linux-raw-sys v0.4.15
  675. 216.93 s > Checking globset v0.4.18
  676. 216.93 s > Checking sha2 v0.10.9
  677. 216.93 s > Checking ciborium v0.2.2
  678. 216.93 s > Checking getrandom v0.4.2
  679. 216.93 s > Checking rustix v0.38.44
  680. 216.93 s > Checking rand_core v0.6.4
  681. 216.93 s > Checking xprec v0.2.2
  682. 216.93 s > Checking fastrand v2.4.1
  683. 216.93 s > Checking plotters-backend v0.3.7
  684. 216.93 s > Checking fnv v1.0.7
  685. 216.93 s > Checking rust-embed-utils v8.11.0
  686. 216.93 s > Checking serde_spanned v0.6.9
  687. 216.93 s > Checking toml_datetime v0.6.11
  688. 216.93 s > Checking tempfile v3.27.0
  689. 216.93 s > Checking itertools v0.10.5
  690. 216.93 s > Checking plotters-svg v0.3.7
  691. 216.93 s > Compiling unicode_names2 v1.3.0
  692. 216.93 s > Checking ansitok v0.3.0
  693. 216.93 s > Checking clap v4.6.1
  694. 216.93 s > Checking tap v1.0.1
  695. 216.93 s > Checking cast v0.3.0
  696. 216.93 s > Checking toml_write v0.1.2
  697. 216.93 s > Checking wyz v0.5.1
  698. 216.93 s > Checking plotters v0.3.7
  699. 216.93 s > Checking rand_chacha v0.3.1
  700. 216.93 s > Checking radium v0.7.0
  701. 216.93 s > Checking typeid v1.0.3
  702. 216.93 s > Checking similar v2.7.0
  703. 216.93 s > Checking ansi-str v0.9.0
  704. 216.93 s > Checking tinytemplate v1.2.1
  705. 216.93 s > Checking crossterm v0.28.1
  706. 216.93 s > Checking toml_edit v0.22.27
  707. 216.93 s > Checking is-terminal v0.4.17
  708. 216.93 s > Checking bytecount v0.6.9
  709. 216.93 s > Checking oorandom v11.1.5
  710. 216.93 s > Checking funty v2.0.0
  711. 216.93 s > Checking anes v0.1.6
  712. 216.93 s > Checking rand v0.8.6
  713. 216.93 s > Checking papergrid v0.17.0
  714. 216.93 s > Checking ron v0.12.1
  715. 216.93 s > Checking testing_table v0.3.0
  716. 216.93 s > Checking toml_edit v0.25.11+spec-1.1.0
  717. 216.93 s > Checking criterion-plot v0.5.0
  718. 216.93 s > Checking env_filter v1.0.1
  719. 216.93 s > Checking bitvec v1.0.1
  720. 216.93 s > Checking uncased v0.9.10
  721. 216.93 s > Checking jiff v0.2.24
  722. 216.93 s > Checking ptr_meta v0.1.4
  723. 216.93 s > Checking criterion v0.5.1
  724. 216.93 s > Checking ucd-trie v0.1.7
  725. 216.93 s > Checking simdutf8 v0.1.5
  726. 216.93 s > Checking ahash v0.7.8
  727. 216.93 s > Checking approx v0.4.0
  728. 216.93 s > Checking bytecheck v0.6.12
  729. 216.93 s > Checking pest v2.8.6
  730. 216.93 s > Checking seahash v4.1.0
  731. 216.93 s > Checking hashbrown v0.12.3
  732. 216.93 s > Checking cgmath v0.18.0
  733. 216.93 s > Checking num-rational v0.4.2
  734. 216.93 s > Checking insta v1.47.2
  735. 216.93 s > Checking tabled v0.20.0
  736. 216.93 s > Checking rend v0.4.2
  737. 216.93 s > Checking num-iter v0.1.45
  738. 216.93 s > Checking ref-ops v0.2.5
  739. 216.93 s > Checking num v0.4.3
  740. 216.93 s > Checking rand_xoshiro v0.6.0
  741. 216.93 s > Checking toml v0.8.23
  742. 216.93 s > Checking features v0.10.0
  743. 216.93 s > Compiling pyo3-ffi v0.28.3
  744. 216.93 s > Compiling pyo3-macros-backend v0.28.3
  745. 216.93 s > Compiling pyo3 v0.28.3
  746. 216.93 s > Compiling numpy v0.28.0
  747. 216.93 s > Checking figment v0.10.19
  748. 216.93 s > Checking dot-parser v0.5.1
  749. 216.93 s > Checking constcat v0.5.1
  750. 216.93 s > Checking gat-lending-iterator v0.1.8
  751. 216.93 s > Checking colored v2.2.0
  752. 216.93 s > Checking cpufeatures v0.3.0
  753. 216.93 s > Checking arrayref v0.3.9
  754. 216.93 s > Checking constant_time_eq v0.4.2
  755. 216.93 s > Checking base64 v0.22.1
  756. 216.93 s > Checking siphasher v1.0.2
  757. 216.93 s > Checking joinery v2.1.0
  758. 216.93 s > Checking subprocess v0.2.15
  759. 216.93 s > Checking blake3 v1.8.5
  760. 216.93 s > Checking rust_lisp v0.18.0
  761. 216.93 s > Compiling vakint v0.1.2 (/build/source/crates/vakint)
  762. 216.93 s > Checking version-compare v0.2.1
  763. 216.93 s > Checking xpct v0.5.1
  764. 216.93 s > Checking titlecase v2.2.1
  765. 216.93 s > Checking phf_shared v0.13.1
  766. 216.93 s > Checking ryu v1.0.23
  767. 216.93 s > Checking castaway v0.2.4
  768. 216.93 s > Checking toml_datetime v0.7.5+spec-1.1.0
  769. 216.93 s > Checking strum v0.27.2
  770. 216.93 s > Checking unicode-truncate v2.0.1
  771. 216.93 s > Checking kasuari v0.4.12
  772. 216.93 s > Checking lru v0.16.4
  773. 216.93 s > Checking phf v0.13.1
  774. 216.93 s > Checking vte v0.15.0
  775. 216.93 s > Compiling rustpython-parser-core v0.4.0
  776. 216.93 s > Checking string-template-plus v0.4.3
  777. 216.93 s > Checking compact_str v0.9.0
  778. 216.93 s > Checking portable-atomic v1.13.1
  779. 216.93 s > Checking unit-prefix v0.5.2
  780. 216.93 s > Checking toml v0.9.12+spec-1.1.0
  781. 216.93 s > Checking rand_distr v0.4.3
  782. 216.93 s > Checking simba v0.6.0
  783. 216.93 s > Checking vt100 v0.16.2
  784. 216.93 s > Compiling rustpython-ast v0.4.0
  785. 216.93 s > Checking line-clipping v0.3.7
  786. 216.93 s > Checking gimli v0.32.3
  787. 216.93 s > Compiling three-dimensional-reps v0.1.0 (/build/source/crates/three-dimensional-reps)
  788. 216.93 s > Checking adler2 v2.0.1
  789. 216.93 s > Checking thiserror v1.0.69
  790. 216.93 s > Checking derive_builder v0.11.2
  791. 216.93 s > Checking owo-colors v4.3.0
  792. 216.93 s > Checking miniz_oxide v0.8.9
  793. 216.93 s > Checking crossterm v0.29.0
  794. 216.93 s > Checking object v0.37.3
  795. 216.93 s > Checking tracing-error v0.2.1
  796. 216.93 s > Checking ratatui-core v0.1.0
  797. 216.93 s > Checking indicatif v0.18.4
  798. 216.93 s > Checking typed-index-collections v3.5.0
  799. 216.93 s > Checking serde-big-array v0.5.1
  800. 216.93 s > Checking amd v0.2.2
  801. 216.93 s > Checking itertools v0.11.0
  802. 216.93 s > Compiling gammaloop-tracing-filter-macros v0.1.0 (/build/source/crates/gammaloop-tracing-filter-macros)
  803. 216.93 s > Checking env_logger v0.11.10
  804. 216.93 s > Checking rustc-demangle v0.1.27
  805. 216.93 s > Checking option-ext v0.2.0
  806. 216.93 s > Checking color-spantrace v0.3.0
  807. 216.93 s > Checking dirs-sys v0.5.0
  808. 216.93 s > Checking ref-cast v1.0.25
  809. 216.93 s > Checking nix v0.31.2
  810. 216.93 s > Checking integer-sqrt v0.1.5
  811. 216.93 s > Checking brotli-decompressor v4.0.3
  812. 216.93 s > Checking crossbeam-channel v0.5.15
  813. 216.93 s > Checking itertools v0.12.1
  814. 216.93 s > Checking unsafe-libyaml v0.2.11
  815. 216.93 s > Checking symlink v0.1.0
  816. 216.93 s > Checking ratatui-widgets v0.3.0
  817. 216.93 s > Checking ratatui-crossterm v0.1.0
  818. 216.93 s > Compiling gammalooprs v0.3.4 (/build/source/crates/gammalooprs)
  819. 216.93 s > Checking rkyv v0.7.46
  820. 216.93 s > Checking schemars v1.2.1
  821. 216.93 s > Checking tracing-appender v0.2.5
  822. 216.93 s > Checking clarabel v0.11.1
  823. 216.93 s > Checking ctrlc v3.5.2
  824. 216.93 s > Checking serde_yaml v0.9.34+deprecated
  825. 216.93 s > Checking include_dir v0.7.4
  826. 216.93 s > Checking pathfinding v4.15.0
  827. 216.93 s > Checking brotli v7.0.0
  828. 216.93 s > Checking dirs v6.0.0
  829. 216.93 s > Compiling numerica v2.2.0 (https://github.com/alphal00p/symbolica?rev=a277a8dadbaae5a8d6605f2f381991a601e1f345#a277a8da)
  830. 216.93 s > Checking slotmap v1.1.1
  831. 216.93 s > Checking addr2line v0.25.1
  832. 216.93 s > Checking tracing-indicatif v0.3.14
  833. 216.93 s > Checking json5 v0.4.1
  834. 216.93 s > Checking vectorize v0.2.0
  835. 216.93 s > Checking ringbuffer v0.16.0
  836. 216.93 s > Checking base62 v2.2.4
  837. 216.93 s > Checking ratatui-macros v0.7.0
  838. 216.93 s > Checking ratatui v0.30.0
  839. 216.93 s > Checking rust-embed v8.11.0
  840. 216.93 s > Checking clap_complete v4.6.3
  841. 216.93 s > Checking fd-lock v4.0.4
  842. 216.93 s > Checking strip-ansi-escapes v0.2.1
  843. 216.93 s > Compiling gammaloop-api v0.1.0 (/build/source/crates/gammaloop-api)
  844. 216.93 s > Checking itertools v0.13.0
  845. 216.93 s > Checking strum v0.26.3
  846. 216.93 s > Checking sysinfo v0.33.1
  847. 216.93 s > Checking shlex v1.3.0
  848. 216.93 s > Checking futures-task v0.3.32
  849. 216.93 s > Checking futures-core v0.3.32
  850. 216.93 s > Checking slab v0.4.12
  851. 216.93 s > Checking sdd v3.0.10
  852. 216.93 s > Compiling gammaloop-integration-tests v0.1.0 (/build/source/tests)
  853. 216.93 s > Checking futures-util v0.3.32
  854. 216.93 s > Checking clap_complete_nushell v4.6.0
  855. 216.93 s > Compiling test-log-core v0.2.20
  856. 216.93 s > Checking scc v2.4.0
  857. 216.93 s > Compiling rustc_version v0.4.1
  858. 216.93 s > Checking which v8.0.2
  859. 216.93 s > Checking bincode v1.3.3
  860. 216.93 s > Compiling gungraun-runner v0.18.2
  861. 216.93 s > Checking nalgebra v0.29.0
  862. 216.93 s > Checking backtrace v0.3.76
  863. 216.93 s > Checking proc-macro2 v1.0.106
  864. 216.93 s > Checking reedline v0.42.0
  865. 216.93 s > Checking color-eyre v0.6.5
  866. 216.93 s > Checking quote v1.0.45
  867. 216.93 s > Checking maplit v1.0.2
  868. 216.93 s > Compiling gungraun-macros v0.8.0
  869. 216.93 s > Checking base64 v0.21.7
  870. 216.93 s > Compiling iai-callgrind-runner v0.14.2
  871. 216.93 s > Checking kurbo v0.13.0
  872. 216.93 s > Checking wait-timeout v0.2.1
  873. 216.93 s > Checking quick-error v1.2.3
  874. 216.93 s > Checking ron v0.8.1
  875. 216.93 s > Compiling iai-callgrind v0.14.2
  876. 216.93 s > Checking bit-vec v0.8.0
  877. 216.93 s > Checking bit-set v0.8.0
  878. 216.93 s > Checking futures-executor v0.3.32
  879. 216.93 s > Checking rusty-fork v0.3.1
  880. 216.93 s > Checking syn v2.0.117
  881. 216.93 s > Checking serial_test v3.4.0
  882. 216.93 s > Compiling iai-callgrind-macros v0.5.1
  883. 216.93 s > Checking rand_xorshift v0.4.0
  884. 216.93 s > Checking console v0.15.11
  885. 216.93 s > Compiling test-log-macros v0.2.20
  886. 216.93 s > Checking pathdiff v0.2.3
  887. 216.93 s > Checking unarray v0.1.4
  888. 216.93 s > Checking proptest v1.11.0
  889. 216.93 s > Checking clinnet v0.1.8 (/build/source/crates/clinnet)
  890. 216.93 s > Checking similar-asserts v1.7.0
  891. 216.93 s > Compiling graphica v2.1.0 (https://github.com/alphal00p/symbolica?rev=a277a8dadbaae5a8d6605f2f381991a601e1f345#a277a8da)
  892. 216.93 s > Checking kurvst v0.1.0 (/build/source/crates/kurvst)
  893. 216.93 s > Checking test-log v0.2.20
  894. 216.93 s > Checking statrs v0.16.1
  895. 216.93 s > Checking momtrop v0.3.0
  896. 216.93 s > Checking gungraun v0.18.2
  897. 216.93 s > Compiling pyo3-stub-gen-derive v0.17.2
  898. 216.93 s > Compiling pyo3-macros v0.28.3
  899. 216.93 s > Checking pyo3-stub-gen v0.17.2
  900. 216.93 s > Checking symbolica-utils v0.1.0 (/build/source/crates/symbolica-utils)
  901. 216.93 s > Checking spenso-macros v0.3.2 (/build/source/crates/spenso-macros)
  902. 216.93 s > Compiling gammaloop-workspace-hack v0.1.0 (/build/source/crates/gammaloop-workspace-hack)
  903. 216.93 s > Checking linnet v0.17.0 (/build/source/crates/linnet)
  904. 216.93 s > Checking spenso v0.6.0 (/build/source/crates/spenso)
  905. 216.93 s > Checking linnet-py v0.1.0 (/build/source/crates/linnet-py)
  906. 216.93 s > Checking linnest v0.1.0 (/build/source/crates/linnest)
  907. 216.93 s > Checking idenso v0.3.0 (/build/source/crates/idenso)
  908. 216.93 s > Checking gammaloop-tracing-filter v0.1.0 (/build/source/crates/gammaloop-tracing-filter)
  909. 216.93 s > Checking spenso-hep-lib v0.1.7 (/build/source/crates/spenso-hep-lib)
  910. 216.93 s > Checking spynso3 v0.1.2 (/build/source/crates/spynso3)
  911. 216.93 s > error[E0560]: struct `CutInfo` has no field named `lmb_channel_id`
  912. 216.93 s > --> tests/tests/test_differential.rs:86:13
  913. 216.93 s > |
  914. 216.93 s > 86 | lmb_channel_id: None,
  915. 216.93 s > | ^^^^^^^^^^^^^^ `CutInfo` does not have this field
  916. 216.93 s > |
  917. 216.93 s > = note: available fields are: `sampling_channel_id`, `sampling_channel_edge_ids`
  918. 216.93 s >
  919. 216.93 s > error[E0560]: struct `CutInfo` has no field named `lmb_channel_edge_ids`
  920. 216.93 s > --> tests/tests/test_differential.rs:87:13
  921. 216.93 s > |
  922. 216.93 s > 87 | lmb_channel_edge_ids: None,
  923. 216.93 s > | ^^^^^^^^^^^^^^^^^^^^ `CutInfo` does not have this field
  924. 216.93 s > |
  925. 216.93 s > = note: available fields are: `sampling_channel_id`, `sampling_channel_edge_ids`
  926. 216.93 s >
  927. 216.93 s > error[E0063]: missing field `reference_moments` in initializer of `GraphEvaluationResult<_>`
  928. 216.93 s > --> tests/tests/test_differential.rs:532:19
  929. 216.93 s > |
  930. 216.93 s > 532 | let mut lhs = GraphEvaluationResult {
  931. 216.93 s > | ^^^^^^^^^^^^^^^^^^^^^ missing `reference_moments`
  932. 216.93 s >
  933. 216.93 s > error[E0063]: missing field `reference_moments` in initializer of `GraphEvaluationResult<_>`
  934. 216.93 s > --> tests/tests/test_differential.rs:539:15
  935. 216.93 s > |
  936. 216.93 s > 539 | let rhs = GraphEvaluationResult {
  937. 216.93 s > | ^^^^^^^^^^^^^^^^^^^^^ missing `reference_moments`
  938. 216.93 s >
  939. 216.93 s > Some errors have detailed explanations: E0063, E0560.
  940. 216.93 s > For more information about an error, try `rustc --explain E0063`.
  941. 216.93 s > error: could not compile `gammaloop-integration-tests` (test "test_differential") due to 4 previous errors
  942. 216.93 s > warning: build failed, waiting for other jobs to finish...
  943. 216.93 s > error[E0609]: no field `lmb_channel_id` on type `CutInfo`
  944. 216.93 s > --> tests/tests/test_runs/utils.rs:568:36
  945. 216.93 s > |
  946. 216.93 s > 568 | event.cut_info.lmb_channel_id,
  947. 216.93 s > | ^^^^^^^^^^^^^^ unknown field
  948. 216.93 s > |
  949. 216.93 s > = note: available fields are: `particle_pdgs`, `cut_id`, `graph_id`, `graph_group_id`, `orientation_id` ... and 2 others
  950. 216.93 s >
  951. 216.93 s > error[E0609]: no field `lmb_channel_id` on type `CutInfo`
  952. 216.93 s > --> tests/tests/test_runs/utils.rs:580:36
  953. 216.93 s > |
  954. 216.93 s > 580 | event.cut_info.lmb_channel_id,
  955. 216.93 s > | ^^^^^^^^^^^^^^ unknown field
  956. 216.93 s > |
  957. 216.93 s > = note: available fields are: `particle_pdgs`, `cut_id`, `graph_id`, `graph_group_id`, `orientation_id` ... and 2 others
  958. 216.93 s >
  959. 216.93 s > For more information about this error, try `rustc --explain E0609`.
  960. 216.93 s > error: could not compile `gammaloop-integration-tests` (test "test_runs") due to 2 previous errors
  961. 216.93 s For full logs, run:
  962. 216.93 s nix log /nix/store/gmbpv2azznl3dd48abbm33lq79pdf6qb-gammaloop-workspace-check-0.1.0.drv
  963. 216.96 s Build failed.