build packages.x86_64-linux.crate-test-binaries-python-api-gammaloop-integration-tests

Reproduce this run
Retry Run
  1. 0.00 s $ /nix/store/9ypz3flqsrl5xl495mm8h645gadjsxi1-coreutils-9.11/bin/timeout --kill-after=15s 7200s /nix/store/23zk8sgzamrbmj1fday15szf7f2279s8-nix-2.34.7/bin/nix --extra-experimental-features nix-command --extra-experimental-features flakes --log-format internal-json build --no-link --print-out-paths git+https://github.com/alphal00p/gammaloop?ref=advanced_sampling&rev=3f9b1a28473f313d6242a556ada2e8dbcd6f6477&shallow=1#packages.x86_64-linux.crate-test-binaries-python-api-gammaloop-integration-tests --print-build-logs
  2. 13.44 s
  3. 14.50 s Building /nix/store/jqza3mqllnx662dyds8x3hfq5ylgfpg2-gammaloop-crate-test-binaries-gammaloop-integration-tests-d6e55b48f8214f9c-inputs.drv
  4. 28.08 s [gammaloop-crate-test-binaries-gammaloop-integration-tests-d6e55b48f8214f9c-inputs:post-build] Uploading to the NixCI cache: /nix/store/nj1fp5qvgg768ki0j5lrwfdh2jxaj7iz-gammaloop-crate-test-binaries-gammaloop-integration-tests-d6e55b48f8214f9c-inputs
  5. 28.13 s [gammaloop-crate-test-binaries-gammaloop-integration-tests-d6e55b48f8214f9c-inputs:post-build] warning: 'warn-short-path-literals' is deprecated, use 'lint-short-path-literals = ignore' instead
  6. 28.16 s [gammaloop-crate-test-binaries-gammaloop-integration-tests-d6e55b48f8214f9c-inputs:post-build] copying 1 paths...
  7. 28.16 s [gammaloop-crate-test-binaries-gammaloop-integration-tests-d6e55b48f8214f9c-inputs:post-build] copying path '/nix/store/nj1fp5qvgg768ki0j5lrwfdh2jxaj7iz-gammaloop-crate-test-binaries-gammaloop-integration-tests-d6e55b48f8214f9c-inputs' to 'https://cache.nix-ci.com'...
  8. 129.98 s [gammaloop-crate-test-binaries-gammaloop-integration-tests-d6e55b48f8214f9c-inputs:post-build] warning: 'warn-short-path-literals' is deprecated, use 'lint-short-path-literals = ignore' instead
  9. 130.34 s [gammaloop-crate-test-binaries-gammaloop-integration-tests-d6e55b48f8214f9c-inputs:post-build] copying 1 paths...
  10. 130.34 s [gammaloop-crate-test-binaries-gammaloop-integration-tests-d6e55b48f8214f9c-inputs:post-build] copying path '/nix/store/jqza3mqllnx662dyds8x3hfq5ylgfpg2-gammaloop-crate-test-binaries-gammaloop-integration-tests-d6e55b48f8214f9c-inputs.drv' to 'https://cache.nix-ci.com'...
  11. 130.53 s Uploaded gammaloop-crate-test-binaries-gammaloop-integration-tests-d6e55b48f8214f9c-inputs in 1m42s
  12. 130.53 s Progress: 1 of 4 built
  13. 130.53 s Built gammaloop-crate-test-binaries-gammaloop-integration-tests-d6e55b48f8214f9c-inputs in 1m56s
  14. 130.64 s Building /nix/store/lkbyrvjgy6gccva2z27sgfb2f2w7wkvz-gammaloop-crate-test-binaries-gammaloop-integration-tests-d6e55b48f8214f9c-deps-0.1.0.drv
  15. 130.75 s [gammaloop-crate-test-binaries-gammaloop-integration-tests-d6e55b48f8214f9c-deps] Phase: unpackPhase
  16. 130.75 s [gammaloop-crate-test-binaries-gammaloop-integration-tests-d6e55b48f8214f9c-deps] unpacking source archive /nix/store/zip3xcgspngrl6brgh8zi2jq9frx1qav-source
  17. 130.82 s [gammaloop-crate-test-binaries-gammaloop-integration-tests-d6e55b48f8214f9c-deps] source root is source
  18. 130.85 s [gammaloop-crate-test-binaries-gammaloop-integration-tests-d6e55b48f8214f9c-deps] Phase: patchPhase
  19. 130.97 s [gammaloop-crate-test-binaries-gammaloop-integration-tests-d6e55b48f8214f9c-deps] Executing configureCargoCommonVars
  20. 130.98 s [gammaloop-crate-test-binaries-gammaloop-integration-tests-d6e55b48f8214f9c-deps] copying cargo artifacts from /nix/store/nj1fp5qvgg768ki0j5lrwfdh2jxaj7iz-gammaloop-crate-test-binaries-gammaloop-integration-tests-d6e55b48f8214f9c-inputs/target to target
  21. 130.98 s [gammaloop-crate-test-binaries-gammaloop-integration-tests-d6e55b48f8214f9c-deps] will deep copy artifacts (instead of symlinking) as requested
  22. 133.18 s [gammaloop-crate-test-binaries-gammaloop-integration-tests-d6e55b48f8214f9c-deps] Phase: updateAutotoolsGnuConfigScriptsPhase
  23. 133.23 s [gammaloop-crate-test-binaries-gammaloop-integration-tests-d6e55b48f8214f9c-deps] Phase: configurePhase
  24. 133.23 s [gammaloop-crate-test-binaries-gammaloop-integration-tests-d6e55b48f8214f9c-deps] will append /build/source/.cargo-home/config.toml with contents of /nix/store/5drf77x6km4ky7gwlrzdx9bbd6fz09g3-vendor-cargo-deps/config.toml
  25. 133.24 s [gammaloop-crate-test-binaries-gammaloop-integration-tests-d6e55b48f8214f9c-deps] default configurePhase, nothing to do
  26. 133.24 s [gammaloop-crate-test-binaries-gammaloop-integration-tests-d6e55b48f8214f9c-deps] Phase: buildPhase
  27. 133.25 s [gammaloop-crate-test-binaries-gammaloop-integration-tests-d6e55b48f8214f9c-deps] +++ command cargo --version
  28. 133.25 s [gammaloop-crate-test-binaries-gammaloop-integration-tests-d6e55b48f8214f9c-deps] cargo 1.97.0 (c980f4866 2026-06-30)
  29. 133.26 s [gammaloop-crate-test-binaries-gammaloop-integration-tests-d6e55b48f8214f9c-deps] +++ command cargo test --profile ci-optim --no-run --offline -p gammaloop-integration-tests --features gammaloop-integration-tests/python-api-tests
  30. 133.79 s [gammaloop-crate-test-binaries-gammaloop-integration-tests-d6e55b48f8214f9c-deps] Compiling gammaloop-integration-tests v0.1.0 (/build/source/tests)
  31. 133.96 s [gammaloop-crate-test-binaries-gammaloop-integration-tests-d6e55b48f8214f9c-deps] error[E0560]: struct `CutInfo` has no field named `lmb_channel_id`
  32. 133.96 s [gammaloop-crate-test-binaries-gammaloop-integration-tests-d6e55b48f8214f9c-deps] --> tests/tests/test_differential.rs:86:13
  33. 133.96 s [gammaloop-crate-test-binaries-gammaloop-integration-tests-d6e55b48f8214f9c-deps] |
  34. 133.96 s [gammaloop-crate-test-binaries-gammaloop-integration-tests-d6e55b48f8214f9c-deps] 86 | lmb_channel_id: None,
  35. 133.96 s [gammaloop-crate-test-binaries-gammaloop-integration-tests-d6e55b48f8214f9c-deps] | ^^^^^^^^^^^^^^ `CutInfo` does not have this field
  36. 133.96 s [gammaloop-crate-test-binaries-gammaloop-integration-tests-d6e55b48f8214f9c-deps] |
  37. 133.96 s [gammaloop-crate-test-binaries-gammaloop-integration-tests-d6e55b48f8214f9c-deps] = note: available fields are: `sampling_channel_id`, `sampling_channel_edge_ids`
  38. 133.96 s [gammaloop-crate-test-binaries-gammaloop-integration-tests-d6e55b48f8214f9c-deps]
  39. 133.96 s [gammaloop-crate-test-binaries-gammaloop-integration-tests-d6e55b48f8214f9c-deps] error[E0560]: struct `CutInfo` has no field named `lmb_channel_edge_ids`
  40. 133.96 s [gammaloop-crate-test-binaries-gammaloop-integration-tests-d6e55b48f8214f9c-deps] --> tests/tests/test_differential.rs:87:13
  41. 133.96 s [gammaloop-crate-test-binaries-gammaloop-integration-tests-d6e55b48f8214f9c-deps] |
  42. 133.96 s [gammaloop-crate-test-binaries-gammaloop-integration-tests-d6e55b48f8214f9c-deps] 87 | lmb_channel_edge_ids: None,
  43. 133.96 s [gammaloop-crate-test-binaries-gammaloop-integration-tests-d6e55b48f8214f9c-deps] | ^^^^^^^^^^^^^^^^^^^^ `CutInfo` does not have this field
  44. 133.96 s [gammaloop-crate-test-binaries-gammaloop-integration-tests-d6e55b48f8214f9c-deps] |
  45. 133.96 s [gammaloop-crate-test-binaries-gammaloop-integration-tests-d6e55b48f8214f9c-deps] = note: available fields are: `sampling_channel_id`, `sampling_channel_edge_ids`
  46. 133.96 s [gammaloop-crate-test-binaries-gammaloop-integration-tests-d6e55b48f8214f9c-deps]
  47. 133.98 s [gammaloop-crate-test-binaries-gammaloop-integration-tests-d6e55b48f8214f9c-deps] error[E0063]: missing field `reference_moments` in initializer of `GraphEvaluationResult<_>`
  48. 133.98 s [gammaloop-crate-test-binaries-gammaloop-integration-tests-d6e55b48f8214f9c-deps] --> tests/tests/test_differential.rs:532:19
  49. 133.98 s [gammaloop-crate-test-binaries-gammaloop-integration-tests-d6e55b48f8214f9c-deps] |
  50. 133.98 s [gammaloop-crate-test-binaries-gammaloop-integration-tests-d6e55b48f8214f9c-deps] 532 | let mut lhs = GraphEvaluationResult {
  51. 133.98 s [gammaloop-crate-test-binaries-gammaloop-integration-tests-d6e55b48f8214f9c-deps] | ^^^^^^^^^^^^^^^^^^^^^ missing `reference_moments`
  52. 133.98 s [gammaloop-crate-test-binaries-gammaloop-integration-tests-d6e55b48f8214f9c-deps]
  53. 133.98 s [gammaloop-crate-test-binaries-gammaloop-integration-tests-d6e55b48f8214f9c-deps] error[E0063]: missing field `reference_moments` in initializer of `GraphEvaluationResult<_>`
  54. 133.98 s [gammaloop-crate-test-binaries-gammaloop-integration-tests-d6e55b48f8214f9c-deps] --> tests/tests/test_differential.rs:539:15
  55. 133.98 s [gammaloop-crate-test-binaries-gammaloop-integration-tests-d6e55b48f8214f9c-deps] |
  56. 133.98 s [gammaloop-crate-test-binaries-gammaloop-integration-tests-d6e55b48f8214f9c-deps] 539 | let rhs = GraphEvaluationResult {
  57. 133.98 s [gammaloop-crate-test-binaries-gammaloop-integration-tests-d6e55b48f8214f9c-deps] | ^^^^^^^^^^^^^^^^^^^^^ missing `reference_moments`
  58. 133.98 s [gammaloop-crate-test-binaries-gammaloop-integration-tests-d6e55b48f8214f9c-deps]
  59. 134.09 s [gammaloop-crate-test-binaries-gammaloop-integration-tests-d6e55b48f8214f9c-deps] Some errors have detailed explanations: E0063, E0560.
  60. 134.09 s [gammaloop-crate-test-binaries-gammaloop-integration-tests-d6e55b48f8214f9c-deps] For more information about an error, try `rustc --explain E0063`.
  61. 134.10 s [gammaloop-crate-test-binaries-gammaloop-integration-tests-d6e55b48f8214f9c-deps] error: could not compile `gammaloop-integration-tests` (test "test_differential") due to 4 previous errors
  62. 134.10 s [gammaloop-crate-test-binaries-gammaloop-integration-tests-d6e55b48f8214f9c-deps] warning: build failed, waiting for other jobs to finish...
  63. 135.44 s [gammaloop-crate-test-binaries-gammaloop-integration-tests-d6e55b48f8214f9c-deps] error[E0609]: no field `lmb_channel_id` on type `CutInfo`
  64. 135.44 s [gammaloop-crate-test-binaries-gammaloop-integration-tests-d6e55b48f8214f9c-deps] --> tests/tests/test_runs/utils.rs:568:36
  65. 135.44 s [gammaloop-crate-test-binaries-gammaloop-integration-tests-d6e55b48f8214f9c-deps] |
  66. 135.44 s [gammaloop-crate-test-binaries-gammaloop-integration-tests-d6e55b48f8214f9c-deps] 568 | event.cut_info.lmb_channel_id,
  67. 135.44 s [gammaloop-crate-test-binaries-gammaloop-integration-tests-d6e55b48f8214f9c-deps] | ^^^^^^^^^^^^^^ unknown field
  68. 135.44 s [gammaloop-crate-test-binaries-gammaloop-integration-tests-d6e55b48f8214f9c-deps] |
  69. 135.44 s [gammaloop-crate-test-binaries-gammaloop-integration-tests-d6e55b48f8214f9c-deps] = note: available fields are: `particle_pdgs`, `cut_id`, `graph_id`, `graph_group_id`, `orientation_id` ... and 2 others
  70. 135.44 s [gammaloop-crate-test-binaries-gammaloop-integration-tests-d6e55b48f8214f9c-deps]
  71. 135.44 s [gammaloop-crate-test-binaries-gammaloop-integration-tests-d6e55b48f8214f9c-deps] error[E0609]: no field `lmb_channel_id` on type `CutInfo`
  72. 135.44 s [gammaloop-crate-test-binaries-gammaloop-integration-tests-d6e55b48f8214f9c-deps] --> tests/tests/test_runs/utils.rs:580:36
  73. 135.44 s [gammaloop-crate-test-binaries-gammaloop-integration-tests-d6e55b48f8214f9c-deps] |
  74. 135.44 s [gammaloop-crate-test-binaries-gammaloop-integration-tests-d6e55b48f8214f9c-deps] 580 | event.cut_info.lmb_channel_id,
  75. 135.44 s [gammaloop-crate-test-binaries-gammaloop-integration-tests-d6e55b48f8214f9c-deps] | ^^^^^^^^^^^^^^ unknown field
  76. 135.44 s [gammaloop-crate-test-binaries-gammaloop-integration-tests-d6e55b48f8214f9c-deps] |
  77. 135.44 s [gammaloop-crate-test-binaries-gammaloop-integration-tests-d6e55b48f8214f9c-deps] = note: available fields are: `particle_pdgs`, `cut_id`, `graph_id`, `graph_group_id`, `orientation_id` ... and 2 others
  78. 135.44 s [gammaloop-crate-test-binaries-gammaloop-integration-tests-d6e55b48f8214f9c-deps]
  79. 136.16 s [gammaloop-crate-test-binaries-gammaloop-integration-tests-d6e55b48f8214f9c-deps] For more information about this error, try `rustc --explain E0609`.
  80. 136.18 s [gammaloop-crate-test-binaries-gammaloop-integration-tests-d6e55b48f8214f9c-deps] error: could not compile `gammaloop-integration-tests` (test "test_runs") due to 2 previous errors
  81. 216.16 s Progress: 1 of 3 built (1 failed)
  82. 216.16 s Failed to build gammaloop-crate-test-binaries-gammaloop-integration-tests-d6e55b48f8214f9c-deps after 1m25s
  83. 216.16 s error: Cannot build '/nix/store/lkbyrvjgy6gccva2z27sgfb2f2w7wkvz-gammaloop-crate-test-binaries-gammaloop-integration-tests-d6e55b48f8214f9c-deps-0.1.0.drv'.
  84. 216.16 s Reason: builder failed with exit code 101.
  85. 216.16 s Output paths:
  86. 216.16 s /nix/store/lpi8ak3spm6savvbdk4sflwkq3w55q5r-gammaloop-crate-test-binaries-gammaloop-integration-tests-d6e55b48f8214f9c-deps-0.1.0
  87. 216.16 s Last 66 log lines:
  88. 216.16 s > Running phase: unpackPhase
  89. 216.16 s > unpacking source archive /nix/store/zip3xcgspngrl6brgh8zi2jq9frx1qav-source
  90. 216.16 s > source root is source
  91. 216.16 s > Running phase: patchPhase
  92. 216.16 s > Executing configureCargoCommonVars
  93. 216.16 s > copying cargo artifacts from /nix/store/nj1fp5qvgg768ki0j5lrwfdh2jxaj7iz-gammaloop-crate-test-binaries-gammaloop-integration-tests-d6e55b48f8214f9c-inputs/target to target
  94. 216.16 s > will deep copy artifacts (instead of symlinking) as requested
  95. 216.16 s > Running phase: updateAutotoolsGnuConfigScriptsPhase
  96. 216.16 s > Running phase: configurePhase
  97. 216.16 s > will append /build/source/.cargo-home/config.toml with contents of /nix/store/5drf77x6km4ky7gwlrzdx9bbd6fz09g3-vendor-cargo-deps/config.toml
  98. 216.16 s > default configurePhase, nothing to do
  99. 216.16 s > Running phase: buildPhase
  100. 216.16 s > +++ command cargo --version
  101. 216.16 s > cargo 1.97.0 (c980f4866 2026-06-30)
  102. 216.16 s > +++ command cargo test --profile ci-optim --no-run --offline -p gammaloop-integration-tests --features gammaloop-integration-tests/python-api-tests
  103. 216.16 s > Compiling gammaloop-integration-tests v0.1.0 (/build/source/tests)
  104. 216.16 s > error[E0560]: struct `CutInfo` has no field named `lmb_channel_id`
  105. 216.16 s > --> tests/tests/test_differential.rs:86:13
  106. 216.16 s > |
  107. 216.16 s > 86 | lmb_channel_id: None,
  108. 216.16 s > | ^^^^^^^^^^^^^^ `CutInfo` does not have this field
  109. 216.16 s > |
  110. 216.16 s > = note: available fields are: `sampling_channel_id`, `sampling_channel_edge_ids`
  111. 216.16 s >
  112. 216.16 s > error[E0560]: struct `CutInfo` has no field named `lmb_channel_edge_ids`
  113. 216.16 s > --> tests/tests/test_differential.rs:87:13
  114. 216.16 s > |
  115. 216.16 s > 87 | lmb_channel_edge_ids: None,
  116. 216.16 s > | ^^^^^^^^^^^^^^^^^^^^ `CutInfo` does not have this field
  117. 216.16 s > |
  118. 216.16 s > = note: available fields are: `sampling_channel_id`, `sampling_channel_edge_ids`
  119. 216.16 s >
  120. 216.16 s > error[E0063]: missing field `reference_moments` in initializer of `GraphEvaluationResult<_>`
  121. 216.16 s > --> tests/tests/test_differential.rs:532:19
  122. 216.16 s > |
  123. 216.16 s > 532 | let mut lhs = GraphEvaluationResult {
  124. 216.16 s > | ^^^^^^^^^^^^^^^^^^^^^ missing `reference_moments`
  125. 216.16 s >
  126. 216.16 s > error[E0063]: missing field `reference_moments` in initializer of `GraphEvaluationResult<_>`
  127. 216.16 s > --> tests/tests/test_differential.rs:539:15
  128. 216.16 s > |
  129. 216.16 s > 539 | let rhs = GraphEvaluationResult {
  130. 216.16 s > | ^^^^^^^^^^^^^^^^^^^^^ missing `reference_moments`
  131. 216.16 s >
  132. 216.16 s > Some errors have detailed explanations: E0063, E0560.
  133. 216.16 s > For more information about an error, try `rustc --explain E0063`.
  134. 216.16 s > error: could not compile `gammaloop-integration-tests` (test "test_differential") due to 4 previous errors
  135. 216.16 s > warning: build failed, waiting for other jobs to finish...
  136. 216.16 s > error[E0609]: no field `lmb_channel_id` on type `CutInfo`
  137. 216.16 s > --> tests/tests/test_runs/utils.rs:568:36
  138. 216.16 s > |
  139. 216.16 s > 568 | event.cut_info.lmb_channel_id,
  140. 216.16 s > | ^^^^^^^^^^^^^^ unknown field
  141. 216.16 s > |
  142. 216.16 s > = note: available fields are: `particle_pdgs`, `cut_id`, `graph_id`, `graph_group_id`, `orientation_id` ... and 2 others
  143. 216.16 s >
  144. 216.16 s > error[E0609]: no field `lmb_channel_id` on type `CutInfo`
  145. 216.16 s > --> tests/tests/test_runs/utils.rs:580:36
  146. 216.16 s > |
  147. 216.16 s > 580 | event.cut_info.lmb_channel_id,
  148. 216.16 s > | ^^^^^^^^^^^^^^ unknown field
  149. 216.16 s > |
  150. 216.16 s > = note: available fields are: `particle_pdgs`, `cut_id`, `graph_id`, `graph_group_id`, `orientation_id` ... and 2 others
  151. 216.16 s >
  152. 216.16 s > For more information about this error, try `rustc --explain E0609`.
  153. 216.16 s > error: could not compile `gammaloop-integration-tests` (test "test_runs") due to 2 previous errors
  154. 216.16 s For full logs, run:
  155. 216.16 s nix log /nix/store/lkbyrvjgy6gccva2z27sgfb2f2w7wkvz-gammaloop-crate-test-binaries-gammaloop-integration-tests-d6e55b48f8214f9c-deps-0.1.0.drv
  156. 216.16 s error: Cannot build '/nix/store/mbp3wk6m8kzyiq5fmnmpbwn5mbn9rlsy-nix-ci-artifact-barrier-crate-test-binaries-python-api-gammaloop-integration-tests.drv'.
  157. 216.16 s Reason: 1 dependency failed.
  158. 216.16 s Output paths:
  159. 216.16 s /nix/store/xiwrhbydsk3x2n1ss9anc6a5s66q340s-nix-ci-artifact-barrier-crate-test-binaries-python-api-gammaloop-integration-tests
  160. 216.17 s Build failed due to failed dependency
  161. 216.29 s Build failed.