build packages.x86_64-linux.crate-test-binaries-python-api-gammaloop-integration-tests
0.01 s
$ /nix/store/9ypz3flqsrl5xl495mm8h645gadjsxi1-coreutils-9.11/bin/timeout --kill-after=15s 7200s /nix/store/23zk8sgzamrbmj1fday15szf7f2279s8-nix-2.34.7/bin/nix --extra-experimental-features nix-command --extra-experimental-features flakes --log-format internal-json build --no-link --print-out-paths git+https://github.com/alphal00p/gammaloop?ref=advanced_sampling&rev=a04bbb8fe052dc2bc0f6b53f7756da11bf97f924&shallow=1#packages.x86_64-linux.crate-test-binaries-python-api-gammaloop-integration-tests --print-build-logs
1.51 s
error (ignored): SQLite database '/var/cache/nix-ci-worker/eval-cache-v6/b5d64031b06347e2cd689972e2b4125949b7ea7a9b47c7a4dca442bc999a959a.sqlite ' is busy
18.83 s
19.68 s
Downloading cached gammaloop-crate-test-dependencies-d6e55b48f8214f9c-inputs from https://cache.nix-ci.com
51.41 s
Downloaded cached gammaloop-crate-test-dependencies-d6e55b48f8214f9c-inputs (3.2 GiB) in 31.7s
51.42 s
Progress: 0 of 3 built, 1 of 3 downloaded from cache
51.42 s
Downloading cached gammaloop-crate-test-dependencies-d6e55b48f8214f9c-deps from https://cache.nix-ci.com
52.02 s
Downloaded cached gammaloop-crate-test-dependencies-d6e55b48f8214f9c-deps (30 MiB) in 598ms
52.02 s
Progress: 0 of 3 built, 2 of 3 downloaded from cache
52.02 s
Downloading cached gammaloop-crate-test-binaries-gammaloop-integration-tests-d6e55b48f8214f9c-inputs from https://cache.nix-ci.com
83.65 s
Downloaded cached gammaloop-crate-test-binaries-gammaloop-integration-tests-d6e55b48f8214f9c-inputs (3.2 GiB) in 31.6s
83.65 s
Progress: 0 of 3 built, 3 of 3 downloaded from cache
84.57 s
Building /nix/store/0k9s3dg8zlxyd6l94ikbxf4sqdbyrpq6-gammaloop-crate-test-binaries-gammaloop-integration-tests-d6e55b48f8214f9c-deps-0.1.0.drv
84.71 s
[gammaloop-crate-test-binaries-gammaloop-integration-tests-d6e55b48f8214f9c-deps] Phase: unpackPhase
84.71 s
[gammaloop-crate-test-binaries-gammaloop-integration-tests-d6e55b48f8214f9c-deps] unpacking source archive /nix/store/mihhxhg81q7j5z719niswnivgvyvfkc5-source
85.76 s
[gammaloop-crate-test-binaries-gammaloop-integration-tests-d6e55b48f8214f9c-deps] source root is source
85.79 s
[gammaloop-crate-test-binaries-gammaloop-integration-tests-d6e55b48f8214f9c-deps] Phase: patchPhase
85.94 s
[gammaloop-crate-test-binaries-gammaloop-integration-tests-d6e55b48f8214f9c-deps] Executing configureCargoCommonVars
85.95 s
[gammaloop-crate-test-binaries-gammaloop-integration-tests-d6e55b48f8214f9c-deps] copying cargo artifacts from /nix/store/39vrxj0mbhbqrjhjrl796xxkwaprja72-gammaloop-crate-test-binaries-gammaloop-integration-tests-d6e55b48f8214f9c-inputs/target to target
85.95 s
[gammaloop-crate-test-binaries-gammaloop-integration-tests-d6e55b48f8214f9c-deps] will deep copy artifacts (instead of symlinking) as requested
92.90 s
[gammaloop-crate-test-binaries-gammaloop-integration-tests-d6e55b48f8214f9c-deps] Phase: updateAutotoolsGnuConfigScriptsPhase
92.96 s
[gammaloop-crate-test-binaries-gammaloop-integration-tests-d6e55b48f8214f9c-deps] Phase: configurePhase
92.96 s
[gammaloop-crate-test-binaries-gammaloop-integration-tests-d6e55b48f8214f9c-deps] will append /build/source/.cargo-home/config.toml with contents of /nix/store/5drf77x6km4ky7gwlrzdx9bbd6fz09g3-vendor-cargo-deps/config.toml
92.97 s
[gammaloop-crate-test-binaries-gammaloop-integration-tests-d6e55b48f8214f9c-deps] default configurePhase, nothing to do
92.97 s
[gammaloop-crate-test-binaries-gammaloop-integration-tests-d6e55b48f8214f9c-deps] Phase: buildPhase
92.98 s
[gammaloop-crate-test-binaries-gammaloop-integration-tests-d6e55b48f8214f9c-deps] +++ command cargo --version
92.99 s
[gammaloop-crate-test-binaries-gammaloop-integration-tests-d6e55b48f8214f9c-deps] cargo 1.97.0 (c980f4866 2026-06-30)
92.99 s
[gammaloop-crate-test-binaries-gammaloop-integration-tests-d6e55b48f8214f9c-deps] +++ command cargo test --profile ci-optim --no-run --offline -p gammaloop-integration-tests --features gammaloop-integration-tests/python-api-tests
93.85 s
[gammaloop-crate-test-binaries-gammaloop-integration-tests-d6e55b48f8214f9c-deps] Compiling gammaloop-integration-tests v0.1.0 (/build/source/tests)
96.83 s
[gammaloop-crate-test-binaries-gammaloop-integration-tests-d6e55b48f8214f9c-deps] error[E0609] : no field `lmb_channel_id` on type `CutInfo`
96.84 s
[gammaloop-crate-test-binaries-gammaloop-integration-tests-d6e55b48f8214f9c-deps] --> tests/tests/test_runs/utils.rs:568:36
96.84 s
[gammaloop-crate-test-binaries-gammaloop-integration-tests-d6e55b48f8214f9c-deps] |
96.84 s
[gammaloop-crate-test-binaries-gammaloop-integration-tests-d6e55b48f8214f9c-deps] 568 | event.cut_info.lmb_channel_id,
96.84 s
[gammaloop-crate-test-binaries-gammaloop-integration-tests-d6e55b48f8214f9c-deps] | ^^^^^^^^^^^^^^ unknown field
96.84 s
[gammaloop-crate-test-binaries-gammaloop-integration-tests-d6e55b48f8214f9c-deps] |
96.84 s
[gammaloop-crate-test-binaries-gammaloop-integration-tests-d6e55b48f8214f9c-deps] = note : available fields are: `particle_pdgs`, `cut_id`, `graph_id`, `graph_group_id`, `orientation_id` ... and 2 others
96.84 s
[gammaloop-crate-test-binaries-gammaloop-integration-tests-d6e55b48f8214f9c-deps]
96.84 s
[gammaloop-crate-test-binaries-gammaloop-integration-tests-d6e55b48f8214f9c-deps] error[E0609] : no field `lmb_channel_id` on type `CutInfo`
96.84 s
[gammaloop-crate-test-binaries-gammaloop-integration-tests-d6e55b48f8214f9c-deps] --> tests/tests/test_runs/utils.rs:580:36
96.84 s
[gammaloop-crate-test-binaries-gammaloop-integration-tests-d6e55b48f8214f9c-deps] |
96.84 s
[gammaloop-crate-test-binaries-gammaloop-integration-tests-d6e55b48f8214f9c-deps] 580 | event.cut_info.lmb_channel_id,
96.84 s
[gammaloop-crate-test-binaries-gammaloop-integration-tests-d6e55b48f8214f9c-deps] | ^^^^^^^^^^^^^^ unknown field
96.84 s
[gammaloop-crate-test-binaries-gammaloop-integration-tests-d6e55b48f8214f9c-deps] |
96.84 s
[gammaloop-crate-test-binaries-gammaloop-integration-tests-d6e55b48f8214f9c-deps] = note : available fields are: `particle_pdgs`, `cut_id`, `graph_id`, `graph_group_id`, `orientation_id` ... and 2 others
96.84 s
[gammaloop-crate-test-binaries-gammaloop-integration-tests-d6e55b48f8214f9c-deps]
98.74 s
[gammaloop-crate-test-binaries-gammaloop-integration-tests-d6e55b48f8214f9c-deps] For more information about this error, try `rustc --explain E0609`.
98.81 s
[gammaloop-crate-test-binaries-gammaloop-integration-tests-d6e55b48f8214f9c-deps] error : could not compile `gammaloop-integration-tests` (test "test_runs") due to 2 previous errors
98.81 s
[gammaloop-crate-test-binaries-gammaloop-integration-tests-d6e55b48f8214f9c-deps] warning : build failed, waiting for other jobs to finish...
181.08 s
Progress: 0 of 2 built (1 failed), 3 of 3 downloaded from cache
181.08 s
Failed to build gammaloop-crate-test-binaries-gammaloop-integration-tests-d6e55b48f8214f9c-deps after 1m36s
181.10 s
error: Cannot build '/nix/store/0k9s3dg8zlxyd6l94ikbxf4sqdbyrpq6-gammaloop-crate-test-binaries-gammaloop-integration-tests-d6e55b48f8214f9c-deps-0.1.0.drv '.
181.10 s
Reason: builder failed with exit code 101 .
181.10 s
Output paths:
181.10 s
/nix/store/jfhac9hw5259wrblprxqqavgbzsgz50i-gammaloop-crate-test-binaries-gammaloop-integration-tests-d6e55b48f8214f9c-deps-0.1.0
181.10 s
Last 35 log lines:
181.10 s
> Running phase: unpackPhase
181.10 s
> unpacking source archive /nix/store/mihhxhg81q7j5z719niswnivgvyvfkc5-source
181.10 s
> source root is source
181.10 s
> Running phase: patchPhase
181.10 s
> Executing configureCargoCommonVars
181.10 s
> copying cargo artifacts from /nix/store/39vrxj0mbhbqrjhjrl796xxkwaprja72-gammaloop-crate-test-binaries-gammaloop-integration-tests-d6e55b48f8214f9c-inputs/target to target
181.10 s
> will deep copy artifacts (instead of symlinking) as requested
181.10 s
> Running phase: updateAutotoolsGnuConfigScriptsPhase
181.10 s
> Running phase: configurePhase
181.10 s
> will append /build/source/.cargo-home/config.toml with contents of /nix/store/5drf77x6km4ky7gwlrzdx9bbd6fz09g3-vendor-cargo-deps/config.toml
181.10 s
> default configurePhase, nothing to do
181.10 s
> Running phase: buildPhase
181.10 s
> +++ command cargo --version
181.10 s
> cargo 1.97.0 (c980f4866 2026-06-30)
181.10 s
> +++ command cargo test --profile ci-optim --no-run --offline -p gammaloop-integration-tests --features gammaloop-integration-tests/python-api-tests
181.10 s
> Compiling gammaloop-integration-tests v0.1.0 (/build/source/tests)
181.10 s
> error[E0609] : no field `lmb_channel_id` on type `CutInfo`
181.10 s
> --> tests/tests/test_runs/utils.rs:568:36
181.10 s
> |
181.10 s
> 568 | event.cut_info.lmb_channel_id,
181.10 s
> | ^^^^^^^^^^^^^^ unknown field
181.10 s
> |
181.10 s
> = note : available fields are: `particle_pdgs`, `cut_id`, `graph_id`, `graph_group_id`, `orientation_id` ... and 2 others
181.10 s
>
181.10 s
> error[E0609] : no field `lmb_channel_id` on type `CutInfo`
181.10 s
> --> tests/tests/test_runs/utils.rs:580:36
181.10 s
> |
181.10 s
> 580 | event.cut_info.lmb_channel_id,
181.10 s
> | ^^^^^^^^^^^^^^ unknown field
181.10 s
> |
181.10 s
> = note : available fields are: `particle_pdgs`, `cut_id`, `graph_id`, `graph_group_id`, `orientation_id` ... and 2 others
181.10 s
>
181.10 s
> For more information about this error, try `rustc --explain E0609`.
181.10 s
> error : could not compile `gammaloop-integration-tests` (test "test_runs") due to 2 previous errors
181.10 s
> warning : build failed, waiting for other jobs to finish...
181.10 s
For full logs, run:
181.10 s
nix log /nix/store/0k9s3dg8zlxyd6l94ikbxf4sqdbyrpq6-gammaloop-crate-test-binaries-gammaloop-integration-tests-d6e55b48f8214f9c-deps-0.1.0.drv
181.10 s
error: Cannot build '/nix/store/jhw9naf5742qi54cr8d1c4brks1ckild-nix-ci-artifact-barrier-crate-test-binaries-python-api-gammaloop-integration-tests.drv '.
181.10 s
Reason: 1 dependency failed .
181.10 s
Output paths:
181.10 s
/nix/store/6mplz5q6dbv96pzx34jz3mmgkfhn4x38-nix-ci-artifact-barrier-crate-test-binaries-python-api-gammaloop-integration-tests
181.27 s
Build failed due to failed dependency
181.57 s
Build failed.