0.00 s
$ /nix/store/9ypz3flqsrl5xl495mm8h645gadjsxi1-coreutils-9.11/bin/timeout --kill-after=15s 7200s /nix/store/23zk8sgzamrbmj1fday15szf7f2279s8-nix-2.34.7/bin/nix --extra-experimental-features nix-command --extra-experimental-features flakes --log-format internal-json build --no-link --print-out-paths git+https://github.com/alphal00p/gammaloop?ref=advanced_sampling&rev=a04bbb8fe052dc2bc0f6b53f7756da11bf97f924&shallow=1#checks.x86_64-linux.gammaloop-check --print-build-logs
3.10 s
3.56 s
Building /nix/store/xdkjvkkvbc84s2zga6acfn9bhiw63pi9-gammaloop-workspace-check-0.1.0.drv
3.62 s
[gammaloop-workspace-check] Phase: unpackPhase
3.63 s
[gammaloop-workspace-check] unpacking source archive /nix/store/nc861jsvy8gxrlx0fiqzjyav6cmdsxqj-source
3.79 s
[gammaloop-workspace-check] source root is source
3.82 s
[gammaloop-workspace-check] Phase: patchPhase
3.82 s
[gammaloop-workspace-check] Executing configureCargoCommonVars
3.82 s
[gammaloop-workspace-check] decompressing cargo artifacts from /nix/store/50vpxlcgfxf2d57i27v3d10zjwxxbm2r-gammaloop-workspace-deps-deps-0.1.0/target.tar.zst to target
5.15 s
[gammaloop-workspace-check] Phase: updateAutotoolsGnuConfigScriptsPhase
5.19 s
[gammaloop-workspace-check] Phase: configurePhase
5.19 s
[gammaloop-workspace-check] will append /build/source/.cargo-home/config.toml with contents of /nix/store/5drf77x6km4ky7gwlrzdx9bbd6fz09g3-vendor-cargo-deps/config.toml
5.19 s
[gammaloop-workspace-check] default configurePhase, nothing to do
5.19 s
[gammaloop-workspace-check] Phase: buildPhase
5.20 s
[gammaloop-workspace-check] +++ command cargo --version
5.20 s
[gammaloop-workspace-check] cargo 1.97.0 (c980f4866 2026-06-30)
5.23 s
[gammaloop-workspace-check] +++ command cargo check --profile ci-optim --locked --workspace --features gammaloop-tracing-filter/clap,gammaloop-tracing-filter/symbolica,idenso/bincode,idenso/reference-cases,linnet/bincode,linnet/drawing,linnet/rkyv,linnet/serde,linnet/symbolica,spenso-macros/shadowing,spenso/shadowing,symbolica/tracing_max_level_info,three-dimensional-reps/display,three-dimensional-reps/eval,three-dimensional-reps/serde --all-targets
5.81 s
[gammaloop-workspace-check] Checking cfg-if v1.0.4
5.81 s
[gammaloop-workspace-check] Checking memchr v2.8.0
5.81 s
[gammaloop-workspace-check] Checking once_cell v1.21.4
5.83 s
[gammaloop-workspace-check] Checking either v1.15.0
5.83 s
[gammaloop-workspace-check] Checking serde_core v1.0.228
5.83 s
[gammaloop-workspace-check] Checking libc v0.2.186
5.84 s
[gammaloop-workspace-check] Checking libm v0.2.16
5.86 s
[gammaloop-workspace-check] Checking itoa v1.0.18
5.86 s
[gammaloop-workspace-check] Checking log v0.4.29
5.86 s
[gammaloop-workspace-check] Checking regex-syntax v0.8.10
5.88 s
[gammaloop-workspace-check] Checking zerocopy v0.8.48
5.88 s
[gammaloop-workspace-check] Checking crossbeam-utils v0.8.21
5.90 s
[gammaloop-workspace-check] Checking equivalent v1.0.2
5.90 s
[gammaloop-workspace-check] Checking zmij v1.0.21
5.90 s
[gammaloop-workspace-check] Checking lazy_static v1.5.0
5.90 s
[gammaloop-workspace-check] Checking bytemuck v1.25.0
5.90 s
[gammaloop-workspace-check] Compiling target-lexicon v0.13.5
5.99 s
[gammaloop-workspace-check] Checking arrayvec v0.7.6
6.02 s
[gammaloop-workspace-check] Checking powerfmt v0.2.0
6.03 s
[gammaloop-workspace-check] Checking itertools v0.14.0
6.03 s
[gammaloop-workspace-check] Checking num-conv v0.2.1
6.03 s
[gammaloop-workspace-check] Checking time-core v0.1.8
6.12 s
[gammaloop-workspace-check] Checking pin-project-lite v0.2.17
6.18 s
[gammaloop-workspace-check] Checking deranged v0.5.8
6.19 s
[gammaloop-workspace-check] Checking num_threads v0.1.7
6.21 s
[gammaloop-workspace-check] Checking tracing-core v0.1.36
6.22 s
[gammaloop-workspace-check] Checking foldhash v0.2.0
6.24 s
[gammaloop-workspace-check] Checking allocator-api2 v0.2.21
6.32 s
[gammaloop-workspace-check] Checking const-random v0.1.18
6.34 s
[gammaloop-workspace-check] Checking safe_arch v0.7.4
6.36 s
[gammaloop-workspace-check] Checking nu-ansi-term v0.50.3
6.39 s
[gammaloop-workspace-check] Checking winnow v1.0.2
6.42 s
[gammaloop-workspace-check] Checking unty v0.0.4
6.44 s
[gammaloop-workspace-check] Checking crossbeam-epoch v0.9.18
6.48 s
[gammaloop-workspace-check] Checking aho-corasick v1.1.4
6.50 s
[gammaloop-workspace-check] Checking static_assertions v1.1.0
6.58 s
[gammaloop-workspace-check] Checking safe_arch v1.0.0
6.64 s
[gammaloop-workspace-check] Checking sharded-slab v0.1.7
6.70 s
[gammaloop-workspace-check] Checking tracing-log v0.2.0
6.71 s
[gammaloop-workspace-check] Checking crossbeam-deque v0.8.6
6.73 s
[gammaloop-workspace-check] Checking hashbrown v0.16.1
6.85 s
[gammaloop-workspace-check] Checking tracing v0.1.44
6.96 s
[gammaloop-workspace-check] Checking wide v0.7.33
6.99 s
[gammaloop-workspace-check] Checking rayon-core v1.13.0
7.13 s
[gammaloop-workspace-check] Checking thread_local v1.1.9
7.20 s
[gammaloop-workspace-check] Checking indenter v0.3.4
7.25 s
[gammaloop-workspace-check] Checking num-traits v0.2.19
7.32 s
[gammaloop-workspace-check] Checking az v1.3.0
7.44 s
[gammaloop-workspace-check] Checking toml_writer v1.1.1+spec-1.1.0
7.48 s
[gammaloop-workspace-check] Checking wide v1.3.0
7.52 s
[gammaloop-workspace-check] Compiling phf_shared v0.11.3
7.67 s
[gammaloop-workspace-check] Checking rayon v1.12.0
7.78 s
[gammaloop-workspace-check] Checking anyhow v1.0.102
7.83 s
[gammaloop-workspace-check] Checking dyn-clone v1.0.20
7.90 s
[gammaloop-workspace-check] Checking rawpointer v0.2.1
7.93 s
[gammaloop-workspace-check] Checking alloc-no-stdlib v2.0.4
7.95 s
[gammaloop-workspace-check] Checking utf8parse v0.2.2
7.96 s
[gammaloop-workspace-check] Checking colored v3.1.1
7.99 s
[gammaloop-workspace-check] Checking matrixmultiply v0.3.10
8.03 s
[gammaloop-workspace-check] Checking getrandom v0.3.4
8.06 s
[gammaloop-workspace-check] Checking time v0.3.47
8.08 s
[gammaloop-workspace-check] Checking gmp-mpfr-sys v1.7.1
8.10 s
[gammaloop-workspace-check] Checking anstyle-parse v1.0.0
8.12 s
[gammaloop-workspace-check] Checking toml_parser v1.1.2+spec-1.1.0
8.30 s
[gammaloop-workspace-check] Checking alloc-stdlib v0.2.2
8.31 s
[gammaloop-workspace-check] Checking colorchoice v1.0.5
8.32 s
[gammaloop-workspace-check] Checking rand_core v0.9.5
8.35 s
[gammaloop-workspace-check] Checking is_terminal_polyfill v1.70.2
8.41 s
[gammaloop-workspace-check] Checking anstyle-query v1.1.5
8.42 s
[gammaloop-workspace-check] Checking anstyle v1.0.14
8.44 s
[gammaloop-workspace-check] Checking approx v0.5.1
8.44 s
[gammaloop-workspace-check] Checking num-integer v0.1.46
8.51 s
[gammaloop-workspace-check] Compiling phf_generator v0.11.3
8.54 s
[gammaloop-workspace-check] Checking eyre v0.6.12
8.63 s
[gammaloop-workspace-check] Checking unicode-width v0.2.2
8.66 s
[gammaloop-workspace-check] Checking bitflags v1.3.2
8.66 s
[gammaloop-workspace-check] Checking anstream v1.0.0
8.69 s
[gammaloop-workspace-check] Checking regex-automata v0.4.14
8.76 s
[gammaloop-workspace-check] Compiling phf_codegen v0.11.3
8.78 s
[gammaloop-workspace-check] Checking region v3.0.2
8.85 s
[gammaloop-workspace-check] Checking brotli-decompressor v5.0.0
8.90 s
[gammaloop-workspace-check] Checking wasmtime-jit-icache-coherence v34.0.2
8.95 s
[gammaloop-workspace-check] Checking hugepage-rs v0.1.1
8.99 s
[gammaloop-workspace-check] Checking inventory v0.3.24
8.99 s
[gammaloop-workspace-check] Checking spec_math v0.1.6
9.06 s
[gammaloop-workspace-check] Checking thiserror v2.0.18
9.07 s
[gammaloop-workspace-check] Compiling pyo3-build-config v0.28.3
9.08 s
[gammaloop-workspace-check] Compiling getopts v0.2.24
9.10 s
[gammaloop-workspace-check] Checking libloading v0.9.0
9.12 s
[gammaloop-workspace-check] Checking self_cell v1.2.2
9.13 s
[gammaloop-workspace-check] Checking byteorder v1.5.0
9.15 s
[gammaloop-workspace-check] Checking tinyjson v2.5.1
9.20 s
[gammaloop-workspace-check] Checking append-only-vec v0.1.8
9.22 s
[gammaloop-workspace-check] Checking bytes v1.11.1
9.35 s
[gammaloop-workspace-check] Compiling unic-char-range v0.9.0
9.36 s
[gammaloop-workspace-check] Compiling unicode_names2_generator v1.3.0
9.40 s
[gammaloop-workspace-check] Compiling unic-common v0.9.0
9.44 s
[gammaloop-workspace-check] Checking linux-raw-sys v0.12.1
9.50 s
[gammaloop-workspace-check] Compiling unic-ucd-version v0.9.0
9.52 s
[gammaloop-workspace-check] Compiling unic-char-property v0.9.0
9.52 s
[gammaloop-workspace-check] Compiling is-macro v0.3.7
9.61 s
[gammaloop-workspace-check] Compiling rustpython-parser-vendored v0.4.0
9.65 s
[gammaloop-workspace-check] Checking iana-time-zone v0.1.65
9.70 s
[gammaloop-workspace-check] Compiling rustpython-parser v0.4.0
9.86 s
[gammaloop-workspace-check] Compiling phf v0.11.3
9.94 s
[gammaloop-workspace-check] Checking serde v1.0.228
10.03 s
[gammaloop-workspace-check] Checking serde_json v1.0.149
10.09 s
[gammaloop-workspace-check] Checking bitflags v2.11.1
10.22 s
[gammaloop-workspace-check] Checking serde_spanned v1.1.1
10.28 s
[gammaloop-workspace-check] Checking toml_datetime v1.1.1+spec-1.1.0
10.33 s
[gammaloop-workspace-check] Checking brotli v8.0.2
10.34 s
[gammaloop-workspace-check] Checking rustc-hash v2.1.2
10.44 s
[gammaloop-workspace-check] Checking rustix v1.1.4
10.46 s
[gammaloop-workspace-check] Compiling unic-ucd-ident v0.9.0
10.60 s
[gammaloop-workspace-check] Compiling unic-emoji-char v0.9.0
10.64 s
[gammaloop-workspace-check] Compiling rustc-hash v1.1.0
10.66 s
[gammaloop-workspace-check] Checking toml v1.1.2+spec-1.1.0
10.76 s
[gammaloop-workspace-check] Compiling lalrpop-util v0.20.2
10.78 s
[gammaloop-workspace-check] Compiling symbolica v2.2.0 (https://github.com/alphal00p/symbolica?rev=a277a8dadbaae5a8d6605f2f381991a601e1f345#a277a8da)
10.83 s
[gammaloop-workspace-check] Checking smallvec v1.15.1
10.85 s
[gammaloop-workspace-check] Checking num-complex v0.4.6
10.88 s
[gammaloop-workspace-check] Checking bincode v2.0.1
11.04 s
[gammaloop-workspace-check] Checking tracing-serde v0.2.0
11.15 s
[gammaloop-workspace-check] Checking smartstring v1.0.1
11.18 s
[gammaloop-workspace-check] Checking chrono v0.4.44
11.50 s
[gammaloop-workspace-check] Checking rug v1.30.0
11.52 s
[gammaloop-workspace-check] Checking unicode-segmentation v1.13.2
11.54 s
[gammaloop-workspace-check] Checking simba v0.9.1
11.66 s
[gammaloop-workspace-check] Checking ndarray v0.17.2
11.76 s
[gammaloop-workspace-check] Checking typenum v1.20.0
11.92 s
[gammaloop-workspace-check] Checking ppv-lite86 v0.2.21
12.10 s
[gammaloop-workspace-check] Checking ahash v0.8.12
12.19 s
[gammaloop-workspace-check] Checking getrandom v0.2.17
12.21 s
[gammaloop-workspace-check] Checking scopeguard v1.2.0
12.29 s
[gammaloop-workspace-check] Checking lock_api v0.4.14
12.37 s
[gammaloop-workspace-check] Checking parking_lot_core v0.9.12
12.47 s
[gammaloop-workspace-check] Checking hashbrown v0.17.0
12.49 s
[gammaloop-workspace-check] Checking rand_chacha v0.9.0
12.60 s
[gammaloop-workspace-check] Checking unicode-ident v1.0.24
12.73 s
[gammaloop-workspace-check] Checking errno v0.3.14
12.76 s
[gammaloop-workspace-check] Checking unicase v2.9.0
12.81 s
[gammaloop-workspace-check] Checking parking_lot v0.12.5
12.89 s
[gammaloop-workspace-check] Checking rand v0.9.4
12.97 s
[gammaloop-workspace-check] Checking strsim v0.11.1
12.99 s
[gammaloop-workspace-check] Checking clap_lex v1.1.0
13.24 s
[gammaloop-workspace-check] Checking signal-hook-registry v1.4.8
13.29 s
[gammaloop-workspace-check] Checking vte v0.14.1
13.29 s
[gammaloop-workspace-check] Checking generic-array v0.14.7
13.31 s
[gammaloop-workspace-check] Checking matchers v0.2.0
13.44 s
[gammaloop-workspace-check] Checking regex v1.12.3
13.47 s
[gammaloop-workspace-check] Checking tracing-subscriber v0.3.23
13.48 s
[gammaloop-workspace-check] Checking same-file v1.0.6
13.53 s
[gammaloop-workspace-check] Checking signal-hook v0.3.18
13.58 s
[gammaloop-workspace-check] Checking indexmap v2.14.0
13.64 s
[gammaloop-workspace-check] Checking walkdir v2.5.0
13.73 s
[gammaloop-workspace-check] Checking symjit v2.21.0
13.76 s
[gammaloop-workspace-check] Checking half v2.7.1
13.84 s
[gammaloop-workspace-check] Checking mio v1.2.0
13.97 s
[gammaloop-workspace-check] Checking block-buffer v0.10.4
14.18 s
[gammaloop-workspace-check] Checking crypto-common v0.1.7
14.21 s
[gammaloop-workspace-check] Checking terminal_size v0.4.4
14.27 s
[gammaloop-workspace-check] Checking minimal-lexical v0.2.1
14.29 s
[gammaloop-workspace-check] Checking ciborium-io v0.2.2
14.34 s
[gammaloop-workspace-check] Checking clap_builder v4.6.0
14.39 s
[gammaloop-workspace-check] Checking ciborium-ll v0.2.2
14.44 s
[gammaloop-workspace-check] Checking digest v0.10.7
14.56 s
[gammaloop-workspace-check] Checking nom v7.1.3
14.63 s
[gammaloop-workspace-check] Checking derive_more v2.1.1
14.64 s
[gammaloop-workspace-check] Checking signal-hook-mio v0.2.5
14.70 s
[gammaloop-workspace-check] Checking num-bigint v0.4.6
14.71 s
[gammaloop-workspace-check] Checking console v0.16.3
14.74 s
[gammaloop-workspace-check] Checking bstr v1.12.1
14.75 s
[gammaloop-workspace-check] Checking linux-raw-sys v0.4.15
15.05 s
[gammaloop-workspace-check] Compiling unicode_names2 v1.3.0
15.22 s
[gammaloop-workspace-check] Checking winnow v0.7.15
15.27 s
[gammaloop-workspace-check] Checking cpufeatures v0.2.17
15.34 s
[gammaloop-workspace-check] Checking sha2 v0.10.9
15.58 s
[gammaloop-workspace-check] Checking globset v0.4.18
15.79 s
[gammaloop-workspace-check] Checking rustix v0.38.44
16.16 s
[gammaloop-workspace-check] Checking ciborium v0.2.2
16.17 s
[gammaloop-workspace-check] Checking rand_core v0.6.4
16.22 s
[gammaloop-workspace-check] Checking getrandom v0.4.2
16.24 s
[gammaloop-workspace-check] Checking plotters-backend v0.3.7
16.36 s
[gammaloop-workspace-check] Checking fastrand v2.4.1
16.43 s
[gammaloop-workspace-check] Checking fnv v1.0.7
16.50 s
[gammaloop-workspace-check] Checking plotters-svg v0.3.7
16.55 s
[gammaloop-workspace-check] Checking ansitok v0.3.0
16.55 s
[gammaloop-workspace-check] Checking rust-embed-utils v8.11.0
16.62 s
[gammaloop-workspace-check] Checking tempfile v3.27.0
16.66 s
[gammaloop-workspace-check] Checking serde_spanned v0.6.9
16.76 s
[gammaloop-workspace-check] Checking toml_datetime v0.6.11
16.77 s
[gammaloop-workspace-check] Checking itertools v0.10.5
16.83 s
[gammaloop-workspace-check] Checking crossterm v0.28.1
16.88 s
[gammaloop-workspace-check] Checking tap v1.0.1
16.90 s
[gammaloop-workspace-check] Checking cast v0.3.0
16.99 s
[gammaloop-workspace-check] Checking toml_write v0.1.2
17.01 s
[gammaloop-workspace-check] Checking wyz v0.5.1
17.01 s
[gammaloop-workspace-check] Checking plotters v0.3.7
17.03 s
[gammaloop-workspace-check] Checking ansi-str v0.9.0
17.19 s
[gammaloop-workspace-check] Checking rand_chacha v0.3.1
17.22 s
[gammaloop-workspace-check] Checking radium v0.7.0
17.30 s
[gammaloop-workspace-check] Checking typeid v1.0.3
17.31 s
[gammaloop-workspace-check] Checking clap v4.6.1
17.40 s
[gammaloop-workspace-check] Checking similar v2.7.0
17.44 s
[gammaloop-workspace-check] Checking tinytemplate v1.2.1
17.47 s
[gammaloop-workspace-check] Checking is-terminal v0.4.17
17.48 s
[gammaloop-workspace-check] Checking oorandom v11.1.5
17.61 s
[gammaloop-workspace-check] Checking funty v2.0.0
17.65 s
[gammaloop-workspace-check] Checking toml_edit v0.22.27
17.66 s
[gammaloop-workspace-check] Checking bytecount v0.6.9
17.68 s
[gammaloop-workspace-check] Checking anes v0.1.6
17.74 s
[gammaloop-workspace-check] Checking rand v0.8.6
17.83 s
[gammaloop-workspace-check] Checking papergrid v0.17.0
17.93 s
[gammaloop-workspace-check] Checking ron v0.12.1
18.16 s
[gammaloop-workspace-check] Checking testing_table v0.3.0
18.19 s
[gammaloop-workspace-check] Checking xprec v0.2.2
18.22 s
[gammaloop-workspace-check] Checking toml_edit v0.25.11+spec-1.1.0
18.35 s
[gammaloop-workspace-check] Checking env_filter v1.0.1
18.38 s
[gammaloop-workspace-check] Checking uncased v0.9.10
18.39 s
[gammaloop-workspace-check] Checking criterion-plot v0.5.0
18.42 s
[gammaloop-workspace-check] Checking jiff v0.2.24
18.55 s
[gammaloop-workspace-check] Checking ptr_meta v0.1.4
18.55 s
[gammaloop-workspace-check] Checking simdutf8 v0.1.5
18.63 s
[gammaloop-workspace-check] Checking ucd-trie v0.1.7
18.64 s
[gammaloop-workspace-check] Checking bitvec v1.0.1
18.68 s
[gammaloop-workspace-check] Checking ahash v0.7.8
18.71 s
[gammaloop-workspace-check] Checking approx v0.4.0
18.78 s
[gammaloop-workspace-check] Checking pest v2.8.6
18.83 s
[gammaloop-workspace-check] Checking bytecheck v0.6.12
18.88 s
[gammaloop-workspace-check] Checking hashbrown v0.12.3
18.90 s
[gammaloop-workspace-check] Checking criterion v0.5.1
18.91 s
[gammaloop-workspace-check] Checking seahash v4.1.0
18.95 s
[gammaloop-workspace-check] Checking cgmath v0.18.0
19.11 s
[gammaloop-workspace-check] Checking num-rational v0.4.2
19.29 s
[gammaloop-workspace-check] Checking rend v0.4.2
19.38 s
[gammaloop-workspace-check] Checking tabled v0.20.0
19.44 s
[gammaloop-workspace-check] Checking num-iter v0.1.45
19.55 s
[gammaloop-workspace-check] Checking ref-ops v0.2.5
19.56 s
[gammaloop-workspace-check] Checking insta v1.47.2
19.57 s
[gammaloop-workspace-check] Checking rand_xoshiro v0.6.0
19.59 s
[gammaloop-workspace-check] Checking num v0.4.3
19.66 s
[gammaloop-workspace-check] Checking features v0.10.0
19.67 s
[gammaloop-workspace-check] Checking constcat v0.5.1
19.72 s
[gammaloop-workspace-check] Checking gat-lending-iterator v0.1.8
19.73 s
[gammaloop-workspace-check] Checking colored v2.2.0
19.76 s
[gammaloop-workspace-check] Checking toml v0.8.23
19.86 s
[gammaloop-workspace-check] Compiling pyo3-ffi v0.28.3
20.02 s
[gammaloop-workspace-check] Compiling pyo3-macros-backend v0.28.3
20.09 s
[gammaloop-workspace-check] Compiling pyo3 v0.28.3
20.23 s
[gammaloop-workspace-check] Compiling numpy v0.28.0
20.28 s
[gammaloop-workspace-check] Checking figment v0.10.19
20.40 s
[gammaloop-workspace-check] Checking dot-parser v0.5.1
20.76 s
[gammaloop-workspace-check] Checking constant_time_eq v0.4.2
20.78 s
[gammaloop-workspace-check] Checking arrayref v0.3.9
20.91 s
[gammaloop-workspace-check] Checking cpufeatures v0.3.0
20.95 s
[gammaloop-workspace-check] Checking base64 v0.22.1
20.98 s
[gammaloop-workspace-check] Checking joinery v2.1.0
21.04 s
[gammaloop-workspace-check] Checking blake3 v1.8.5
21.16 s
[gammaloop-workspace-check] Checking siphasher v1.0.2
21.17 s
[gammaloop-workspace-check] Checking titlecase v2.2.1
21.25 s
[gammaloop-workspace-check] Compiling rustpython-parser-core v0.4.0
21.32 s
[gammaloop-workspace-check] Checking subprocess v0.2.15
21.36 s
[gammaloop-workspace-check] Checking rust_lisp v0.18.0
21.37 s
[gammaloop-workspace-check] Checking phf_shared v0.13.1
21.46 s
[gammaloop-workspace-check] Compiling rustpython-ast v0.4.0
21.50 s
[gammaloop-workspace-check] Compiling vakint v0.1.2 (/build/source/crates/vakint)
21.56 s
[gammaloop-workspace-check] Checking version-compare v0.2.1
21.66 s
[gammaloop-workspace-check] Checking phf v0.13.1
21.66 s
[gammaloop-workspace-check] Checking xpct v0.5.1
21.68 s
[gammaloop-workspace-check] Checking ryu v1.0.23
21.70 s
[gammaloop-workspace-check] Checking castaway v0.2.4
21.80 s
[gammaloop-workspace-check] Checking toml_datetime v0.7.5+spec-1.1.0
21.88 s
[gammaloop-workspace-check] Checking strum v0.27.2
21.91 s
[gammaloop-workspace-check] Checking unicode-truncate v2.0.1
21.94 s
[gammaloop-workspace-check] Checking compact_str v0.9.0
21.98 s
[gammaloop-workspace-check] Checking kasuari v0.4.12
22.00 s
[gammaloop-workspace-check] Checking lru v0.16.4
22.02 s
[gammaloop-workspace-check] Checking vte v0.15.0
22.08 s
[gammaloop-workspace-check] Checking string-template-plus v0.4.3
22.10 s
[gammaloop-workspace-check] Checking portable-atomic v1.13.1
22.15 s
[gammaloop-workspace-check] Checking toml v0.9.12+spec-1.1.0
22.23 s
[gammaloop-workspace-check] Checking vt100 v0.16.2
22.26 s
[gammaloop-workspace-check] Checking unit-prefix v0.5.2
22.30 s
[gammaloop-workspace-check] Checking rand_distr v0.4.3
22.33 s
[gammaloop-workspace-check] Checking simba v0.6.0
22.35 s
[gammaloop-workspace-check] Checking line-clipping v0.3.7
22.42 s
[gammaloop-workspace-check] Checking gimli v0.32.3
22.62 s
[gammaloop-workspace-check] Compiling three-dimensional-reps v0.1.0 (/build/source/crates/three-dimensional-reps)
22.65 s
[gammaloop-workspace-check] Checking adler2 v2.0.1
22.67 s
[gammaloop-workspace-check] Checking thiserror v1.0.69
22.68 s
[gammaloop-workspace-check] Checking ratatui-core v0.1.0
22.76 s
[gammaloop-workspace-check] Checking derive_builder v0.11.2
22.80 s
[gammaloop-workspace-check] Checking miniz_oxide v0.8.9
22.84 s
[gammaloop-workspace-check] Checking crossterm v0.29.0
22.84 s
[gammaloop-workspace-check] Checking owo-colors v4.3.0
22.86 s
[gammaloop-workspace-check] Checking object v0.37.3
22.88 s
[gammaloop-workspace-check] Checking tracing-error v0.2.1
23.02 s
[gammaloop-workspace-check] Checking typed-index-collections v3.5.0
23.04 s
[gammaloop-workspace-check] Checking indicatif v0.18.4
23.04 s
[gammaloop-workspace-check] Checking env_logger v0.11.10
23.10 s
[gammaloop-workspace-check] Checking serde-big-array v0.5.1
23.17 s
[gammaloop-workspace-check] Checking amd v0.2.2
23.28 s
[gammaloop-workspace-check] Checking itertools v0.11.0
23.40 s
[gammaloop-workspace-check] Compiling gammaloop-tracing-filter-macros v0.1.0 (/build/source/crates/gammaloop-tracing-filter-macros)
23.44 s
[gammaloop-workspace-check] Checking rustc-demangle v0.1.27
23.45 s
[gammaloop-workspace-check] Checking option-ext v0.2.0
23.54 s
[gammaloop-workspace-check] Checking dirs-sys v0.5.0
23.67 s
[gammaloop-workspace-check] Checking ref-cast v1.0.25
23.75 s
[gammaloop-workspace-check] Checking nix v0.31.2
23.80 s
[gammaloop-workspace-check] Checking integer-sqrt v0.1.5
23.86 s
[gammaloop-workspace-check] Checking brotli-decompressor v4.0.3
23.87 s
[gammaloop-workspace-check] Checking rkyv v0.7.46
23.87 s
[gammaloop-workspace-check] Checking crossbeam-channel v0.5.15
23.90 s
[gammaloop-workspace-check] Checking itertools v0.12.1
24.00 s
[gammaloop-workspace-check] Compiling gammalooprs v0.3.4 (/build/source/crates/gammalooprs)
24.17 s
[gammaloop-workspace-check] Checking color-spantrace v0.3.0
24.33 s
[gammaloop-workspace-check] Checking ratatui-widgets v0.3.0
24.37 s
[gammaloop-workspace-check] Checking ratatui-crossterm v0.1.0
24.54 s
[gammaloop-workspace-check] Checking symlink v0.1.0
24.54 s
[gammaloop-workspace-check] Checking unsafe-libyaml v0.2.11
24.62 s
[gammaloop-workspace-check] Checking tracing-appender v0.2.5
24.70 s
[gammaloop-workspace-check] Checking include_dir v0.7.4
24.89 s
[gammaloop-workspace-check] Checking pathfinding v4.15.0
24.95 s
[gammaloop-workspace-check] Checking tracing-indicatif v0.3.14
25.08 s
[gammaloop-workspace-check] Checking brotli v7.0.0
25.12 s
[gammaloop-workspace-check] Checking clarabel v0.11.1
25.28 s
[gammaloop-workspace-check] Checking schemars v1.2.1
25.29 s
[gammaloop-workspace-check] Checking ctrlc v3.5.2
25.59 s
[gammaloop-workspace-check] Checking dirs v6.0.0
25.62 s
[gammaloop-workspace-check] Checking slotmap v1.1.1
25.69 s
[gammaloop-workspace-check] Checking serde_yaml v0.9.34+deprecated
25.72 s
[gammaloop-workspace-check] Checking json5 v0.4.1
25.74 s
[gammaloop-workspace-check] Checking vectorize v0.2.0
25.87 s
[gammaloop-workspace-check] Checking base62 v2.2.4
26.02 s
[gammaloop-workspace-check] Checking addr2line v0.25.1
26.17 s
[gammaloop-workspace-check] Checking ringbuffer v0.16.0
26.50 s
[gammaloop-workspace-check] Checking rust-embed v8.11.0
26.55 s
[gammaloop-workspace-check] Checking ratatui-macros v0.7.0
26.61 s
[gammaloop-workspace-check] Checking clap_complete v4.6.3
26.62 s
[gammaloop-workspace-check] Checking fd-lock v4.0.4
26.62 s
[gammaloop-workspace-check] Checking strip-ansi-escapes v0.2.1
26.66 s
[gammaloop-workspace-check] Compiling gammaloop-api v0.1.0 (/build/source/crates/gammaloop-api)
26.67 s
[gammaloop-workspace-check] Checking ratatui v0.30.0
26.70 s
[gammaloop-workspace-check] Checking itertools v0.13.0
26.79 s
[gammaloop-workspace-check] Checking strum v0.26.3
26.81 s
[gammaloop-workspace-check] Checking sysinfo v0.33.1
26.86 s
[gammaloop-workspace-check] Checking shlex v1.3.0
26.94 s
[gammaloop-workspace-check] Checking futures-core v0.3.32
26.97 s
[gammaloop-workspace-check] Checking slab v0.4.12
27.00 s
[gammaloop-workspace-check] Checking futures-task v0.3.32
27.08 s
[gammaloop-workspace-check] Checking clap_complete_nushell v4.6.0
27.11 s
[gammaloop-workspace-check] Checking sdd v3.0.10
27.19 s
[gammaloop-workspace-check] Compiling numerica v2.2.0 (https://github.com/alphal00p/symbolica?rev=a277a8dadbaae5a8d6605f2f381991a601e1f345#a277a8da)
27.21 s
[gammaloop-workspace-check] Checking futures-util v0.3.32
27.26 s
[gammaloop-workspace-check] Compiling gammaloop-integration-tests v0.1.0 (/build/source/tests)
27.49 s
[gammaloop-workspace-check] Compiling test-log-core v0.2.20
27.74 s
[gammaloop-workspace-check] Checking scc v2.4.0
27.82 s
[gammaloop-workspace-check] Compiling rustc_version v0.4.1
28.09 s
[gammaloop-workspace-check] Checking backtrace v0.3.76
28.10 s
[gammaloop-workspace-check] Checking which v8.0.2
28.29 s
[gammaloop-workspace-check] Checking nalgebra v0.29.0
28.38 s
[gammaloop-workspace-check] Checking bincode v1.3.3
28.68 s
[gammaloop-workspace-check] Compiling gungraun-runner v0.18.2
28.69 s
[gammaloop-workspace-check] Checking reedline v0.42.0
28.81 s
[gammaloop-workspace-check] Checking color-eyre v0.6.5
28.86 s
[gammaloop-workspace-check] Compiling gungraun-macros v0.8.0
29.39 s
[gammaloop-workspace-check] Checking proc-macro2 v1.0.106
29.77 s
[gammaloop-workspace-check] Checking base64 v0.21.7
30.05 s
[gammaloop-workspace-check] Checking maplit v1.0.2
30.16 s
[gammaloop-workspace-check] Compiling iai-callgrind-runner v0.14.2
30.54 s
[gammaloop-workspace-check] Checking ron v0.8.1
30.82 s
[gammaloop-workspace-check] Checking kurbo v0.13.0
30.86 s
[gammaloop-workspace-check] Checking wait-timeout v0.2.1
30.92 s
[gammaloop-workspace-check] Checking quote v1.0.45
31.14 s
[gammaloop-workspace-check] Checking quick-error v1.2.3
31.29 s
[gammaloop-workspace-check] Compiling iai-callgrind v0.14.2
31.34 s
[gammaloop-workspace-check] Checking futures-executor v0.3.32
31.35 s
[gammaloop-workspace-check] Checking bit-vec v0.8.0
31.37 s
[gammaloop-workspace-check] Checking syn v2.0.117
31.61 s
[gammaloop-workspace-check] Checking rusty-fork v0.3.1
31.66 s
[gammaloop-workspace-check] Checking serial_test v3.4.0
31.84 s
[gammaloop-workspace-check] Checking bit-set v0.8.0
31.97 s
[gammaloop-workspace-check] Compiling iai-callgrind-macros v0.5.1
31.98 s
[gammaloop-workspace-check] Checking rand_xorshift v0.4.0
32.09 s
[gammaloop-workspace-check] Checking console v0.15.11
32.10 s
[gammaloop-workspace-check] Checking unarray v0.1.4
32.10 s
[gammaloop-workspace-check] Checking pathdiff v0.2.3
32.19 s
[gammaloop-workspace-check] Checking clinnet v0.1.8 (/build/source/crates/clinnet)
32.27 s
[gammaloop-workspace-check] Checking proptest v1.11.0
32.91 s
[gammaloop-workspace-check] Checking kurvst v0.1.0 (/build/source/crates/kurvst)
32.95 s
[gammaloop-workspace-check] Compiling test-log-macros v0.2.20
33.13 s
[gammaloop-workspace-check] Checking similar-asserts v1.7.0
33.76 s
[gammaloop-workspace-check] Compiling graphica v2.1.0 (https://github.com/alphal00p/symbolica?rev=a277a8dadbaae5a8d6605f2f381991a601e1f345#a277a8da)
38.89 s
[gammaloop-workspace-check] Checking test-log v0.2.20
40.92 s
[gammaloop-workspace-check] Checking statrs v0.16.1
42.25 s
[gammaloop-workspace-check] Checking momtrop v0.3.0
44.51 s
[gammaloop-workspace-check] Checking gungraun v0.18.2
44.64 s
[gammaloop-workspace-check] Compiling pyo3-stub-gen-derive v0.17.2
46.06 s
[gammaloop-workspace-check] Compiling pyo3-macros v0.28.3
53.66 s
[gammaloop-workspace-check] Checking pyo3-stub-gen v0.17.2
63.41 s
[gammaloop-workspace-check] Checking symbolica-utils v0.1.0 (/build/source/crates/symbolica-utils)
63.41 s
[gammaloop-workspace-check] Checking spenso-macros v0.3.2 (/build/source/crates/spenso-macros)
333.27 s
[gammaloop-workspace-check] Compiling gammaloop-workspace-hack v0.1.0 (/build/source/crates/gammaloop-workspace-hack)
333.62 s
[gammaloop-workspace-check] Checking linnet v0.17.0 (/build/source/crates/linnet)
337.54 s
[gammaloop-workspace-check] Checking spenso v0.6.0 (/build/source/crates/spenso)
337.70 s
[gammaloop-workspace-check] Checking linnet-py v0.1.0 (/build/source/crates/linnet-py)
337.70 s
[gammaloop-workspace-check] Checking linnest v0.1.0 (/build/source/crates/linnest)
344.48 s
[gammaloop-workspace-check] Checking idenso v0.3.0 (/build/source/crates/idenso)
344.48 s
[gammaloop-workspace-check] Checking gammaloop-tracing-filter v0.1.0 (/build/source/crates/gammaloop-tracing-filter)
347.11 s
[gammaloop-workspace-check] Checking spenso-hep-lib v0.1.7 (/build/source/crates/spenso-hep-lib)
347.35 s
[gammaloop-workspace-check] Checking spynso3 v0.1.2 (/build/source/crates/spynso3)
380.56 s
[gammaloop-workspace-check] error[E0609] : no field `lmb_channel_id` on type `CutInfo`
380.56 s
[gammaloop-workspace-check] --> tests/tests/test_runs/utils.rs:568:36
380.56 s
[gammaloop-workspace-check] |
380.56 s
[gammaloop-workspace-check] 568 | event.cut_info.lmb_channel_id,
380.56 s
[gammaloop-workspace-check] | ^^^^^^^^^^^^^^ unknown field
380.56 s
[gammaloop-workspace-check] |
380.56 s
[gammaloop-workspace-check] = note : available fields are: `particle_pdgs`, `cut_id`, `graph_id`, `graph_group_id`, `orientation_id` ... and 2 others
380.56 s
[gammaloop-workspace-check]
380.56 s
[gammaloop-workspace-check] error[E0609] : no field `lmb_channel_id` on type `CutInfo`
380.56 s
[gammaloop-workspace-check] --> tests/tests/test_runs/utils.rs:580:36
380.56 s
[gammaloop-workspace-check] |
380.56 s
[gammaloop-workspace-check] 580 | event.cut_info.lmb_channel_id,
380.56 s
[gammaloop-workspace-check] | ^^^^^^^^^^^^^^ unknown field
380.56 s
[gammaloop-workspace-check] |
380.56 s
[gammaloop-workspace-check] = note : available fields are: `particle_pdgs`, `cut_id`, `graph_id`, `graph_group_id`, `orientation_id` ... and 2 others
380.56 s
[gammaloop-workspace-check]
381.09 s
[gammaloop-workspace-check] For more information about this error, try `rustc --explain E0609`.
381.12 s
[gammaloop-workspace-check] error : could not compile `gammaloop-integration-tests` (test "test_runs") due to 2 previous errors
381.65 s
Progress: 0 of 1 built (1 failed)
381.65 s
Failed to build gammaloop-workspace-check after 6m18s
381.66 s
Cannot build ' /nix/store/xdkjvkkvbc84s2zga6acfn9bhiw63pi9-gammaloop-workspace-check-0.1.0.drv '.
381.66 s
Reason: builder failed with exit code 101 .
381.66 s
Output paths:
381.66 s
/nix/store/2r14ihw1y440b1jmdnp3zy05ffqkcmy3-gammaloop-workspace-check-0.1.0
381.66 s
Last 443 log lines:
381.66 s
> Running phase: unpackPhase
381.66 s
> unpacking source archive /nix/store/nc861jsvy8gxrlx0fiqzjyav6cmdsxqj-source
381.66 s
> source root is source
381.66 s
> Running phase: patchPhase
381.66 s
> Executing configureCargoCommonVars
381.66 s
> decompressing cargo artifacts from /nix/store/50vpxlcgfxf2d57i27v3d10zjwxxbm2r-gammaloop-workspace-deps-deps-0.1.0/target.tar.zst to target
381.66 s
> Running phase: updateAutotoolsGnuConfigScriptsPhase
381.66 s
> Running phase: configurePhase
381.66 s
> will append /build/source/.cargo-home/config.toml with contents of /nix/store/5drf77x6km4ky7gwlrzdx9bbd6fz09g3-vendor-cargo-deps/config.toml
381.66 s
> default configurePhase, nothing to do
381.66 s
> Running phase: buildPhase
381.66 s
> +++ command cargo --version
381.66 s
> cargo 1.97.0 (c980f4866 2026-06-30)
381.66 s
> +++ command cargo check --profile ci-optim --locked --workspace --features gammaloop-tracing-filter/clap,gammaloop-tracing-filter/symbolica,idenso/bincode,idenso/reference-cases,linnet/bincode,linnet/drawing,linnet/rkyv,linnet/serde,linnet/symbolica,spenso-macros/shadowing,spenso/shadowing,symbolica/tracing_max_level_info,three-dimensional-reps/display,three-dimensional-reps/eval,three-dimensional-reps/serde --all-targets
381.66 s
> Checking cfg-if v1.0.4
381.66 s
> Checking memchr v2.8.0
381.66 s
> Checking once_cell v1.21.4
381.66 s
> Checking either v1.15.0
381.66 s
> Checking serde_core v1.0.228
381.66 s
> Checking libc v0.2.186
381.66 s
> Checking libm v0.2.16
381.66 s
> Checking itoa v1.0.18
381.66 s
> Checking log v0.4.29
381.66 s
> Checking regex-syntax v0.8.10
381.66 s
> Checking zerocopy v0.8.48
381.66 s
> Checking crossbeam-utils v0.8.21
381.66 s
> Checking equivalent v1.0.2
381.66 s
> Checking zmij v1.0.21
381.66 s
> Checking lazy_static v1.5.0
381.66 s
> Checking bytemuck v1.25.0
381.66 s
> Compiling target-lexicon v0.13.5
381.66 s
> Checking arrayvec v0.7.6
381.66 s
> Checking powerfmt v0.2.0
381.66 s
> Checking itertools v0.14.0
381.66 s
> Checking num-conv v0.2.1
381.66 s
> Checking time-core v0.1.8
381.66 s
> Checking pin-project-lite v0.2.17
381.66 s
> Checking deranged v0.5.8
381.66 s
> Checking num_threads v0.1.7
381.66 s
> Checking tracing-core v0.1.36
381.66 s
> Checking foldhash v0.2.0
381.66 s
> Checking allocator-api2 v0.2.21
381.66 s
> Checking const-random v0.1.18
381.66 s
> Checking safe_arch v0.7.4
381.66 s
> Checking nu-ansi-term v0.50.3
381.66 s
> Checking winnow v1.0.2
381.66 s
> Checking unty v0.0.4
381.66 s
> Checking crossbeam-epoch v0.9.18
381.66 s
> Checking aho-corasick v1.1.4
381.66 s
> Checking static_assertions v1.1.0
381.66 s
> Checking safe_arch v1.0.0
381.66 s
> Checking sharded-slab v0.1.7
381.66 s
> Checking tracing-log v0.2.0
381.66 s
> Checking crossbeam-deque v0.8.6
381.66 s
> Checking hashbrown v0.16.1
381.66 s
> Checking tracing v0.1.44
381.66 s
> Checking wide v0.7.33
381.66 s
> Checking rayon-core v1.13.0
381.66 s
> Checking thread_local v1.1.9
381.66 s
> Checking indenter v0.3.4
381.66 s
> Checking num-traits v0.2.19
381.66 s
> Checking az v1.3.0
381.66 s
> Checking toml_writer v1.1.1+spec-1.1.0
381.66 s
> Checking wide v1.3.0
381.66 s
> Compiling phf_shared v0.11.3
381.66 s
> Checking rayon v1.12.0
381.66 s
> Checking anyhow v1.0.102
381.66 s
> Checking dyn-clone v1.0.20
381.66 s
> Checking rawpointer v0.2.1
381.66 s
> Checking alloc-no-stdlib v2.0.4
381.66 s
> Checking utf8parse v0.2.2
381.66 s
> Checking colored v3.1.1
381.66 s
> Checking matrixmultiply v0.3.10
381.66 s
> Checking getrandom v0.3.4
381.66 s
> Checking time v0.3.47
381.66 s
> Checking gmp-mpfr-sys v1.7.1
381.66 s
> Checking anstyle-parse v1.0.0
381.66 s
> Checking toml_parser v1.1.2+spec-1.1.0
381.66 s
> Checking alloc-stdlib v0.2.2
381.66 s
> Checking colorchoice v1.0.5
381.66 s
> Checking rand_core v0.9.5
381.66 s
> Checking is_terminal_polyfill v1.70.2
381.66 s
> Checking anstyle-query v1.1.5
381.66 s
> Checking anstyle v1.0.14
381.66 s
> Checking approx v0.5.1
381.66 s
> Checking num-integer v0.1.46
381.66 s
> Compiling phf_generator v0.11.3
381.66 s
> Checking eyre v0.6.12
381.66 s
> Checking unicode-width v0.2.2
381.66 s
> Checking bitflags v1.3.2
381.66 s
> Checking anstream v1.0.0
381.66 s
> Checking regex-automata v0.4.14
381.66 s
> Compiling phf_codegen v0.11.3
381.66 s
> Checking region v3.0.2
381.66 s
> Checking brotli-decompressor v5.0.0
381.66 s
> Checking wasmtime-jit-icache-coherence v34.0.2
381.66 s
> Checking hugepage-rs v0.1.1
381.66 s
> Checking inventory v0.3.24
381.66 s
> Checking spec_math v0.1.6
381.66 s
> Checking thiserror v2.0.18
381.66 s
> Compiling pyo3-build-config v0.28.3
381.66 s
> Compiling getopts v0.2.24
381.66 s
> Checking libloading v0.9.0
381.66 s
> Checking self_cell v1.2.2
381.66 s
> Checking byteorder v1.5.0
381.66 s
> Checking tinyjson v2.5.1
381.66 s
> Checking append-only-vec v0.1.8
381.66 s
> Checking bytes v1.11.1
381.66 s
> Compiling unic-char-range v0.9.0
381.66 s
> Compiling unicode_names2_generator v1.3.0
381.66 s
> Compiling unic-common v0.9.0
381.66 s
> Checking linux-raw-sys v0.12.1
381.66 s
> Compiling unic-ucd-version v0.9.0
381.66 s
> Compiling unic-char-property v0.9.0
381.66 s
> Compiling is-macro v0.3.7
381.66 s
> Compiling rustpython-parser-vendored v0.4.0
381.66 s
> Checking iana-time-zone v0.1.65
381.66 s
> Compiling rustpython-parser v0.4.0
381.66 s
> Compiling phf v0.11.3
381.66 s
> Checking serde v1.0.228
381.66 s
> Checking serde_json v1.0.149
381.66 s
> Checking bitflags v2.11.1
381.66 s
> Checking serde_spanned v1.1.1
381.66 s
> Checking toml_datetime v1.1.1+spec-1.1.0
381.66 s
> Checking brotli v8.0.2
381.66 s
> Checking rustc-hash v2.1.2
381.66 s
> Checking rustix v1.1.4
381.66 s
> Compiling unic-ucd-ident v0.9.0
381.66 s
> Compiling unic-emoji-char v0.9.0
381.66 s
> Compiling rustc-hash v1.1.0
381.66 s
> Checking toml v1.1.2+spec-1.1.0
381.66 s
> Compiling lalrpop-util v0.20.2
381.66 s
> Compiling symbolica v2.2.0 (https://github.com/alphal00p/symbolica?rev=a277a8dadbaae5a8d6605f2f381991a601e1f345#a277a8da)
381.66 s
> Checking smallvec v1.15.1
381.66 s
> Checking num-complex v0.4.6
381.66 s
> Checking bincode v2.0.1
381.66 s
> Checking tracing-serde v0.2.0
381.66 s
> Checking smartstring v1.0.1
381.66 s
> Checking chrono v0.4.44
381.66 s
> Checking rug v1.30.0
381.66 s
> Checking unicode-segmentation v1.13.2
381.66 s
> Checking simba v0.9.1
381.66 s
> Checking ndarray v0.17.2
381.66 s
> Checking typenum v1.20.0
381.66 s
> Checking ppv-lite86 v0.2.21
381.66 s
> Checking ahash v0.8.12
381.66 s
> Checking getrandom v0.2.17
381.66 s
> Checking scopeguard v1.2.0
381.66 s
> Checking lock_api v0.4.14
381.66 s
> Checking parking_lot_core v0.9.12
381.66 s
> Checking hashbrown v0.17.0
381.66 s
> Checking rand_chacha v0.9.0
381.66 s
> Checking unicode-ident v1.0.24
381.66 s
> Checking errno v0.3.14
381.66 s
> Checking unicase v2.9.0
381.66 s
> Checking parking_lot v0.12.5
381.66 s
> Checking rand v0.9.4
381.66 s
> Checking strsim v0.11.1
381.66 s
> Checking clap_lex v1.1.0
381.66 s
> Checking signal-hook-registry v1.4.8
381.66 s
> Checking vte v0.14.1
381.66 s
> Checking generic-array v0.14.7
381.66 s
> Checking matchers v0.2.0
381.66 s
> Checking regex v1.12.3
381.66 s
> Checking tracing-subscriber v0.3.23
381.66 s
> Checking same-file v1.0.6
381.66 s
> Checking signal-hook v0.3.18
381.66 s
> Checking indexmap v2.14.0
381.66 s
> Checking walkdir v2.5.0
381.66 s
> Checking symjit v2.21.0
381.66 s
> Checking half v2.7.1
381.66 s
> Checking mio v1.2.0
381.66 s
> Checking block-buffer v0.10.4
381.66 s
> Checking crypto-common v0.1.7
381.66 s
> Checking terminal_size v0.4.4
381.66 s
> Checking minimal-lexical v0.2.1
381.66 s
> Checking ciborium-io v0.2.2
381.66 s
> Checking clap_builder v4.6.0
381.66 s
> Checking ciborium-ll v0.2.2
381.66 s
> Checking digest v0.10.7
381.66 s
> Checking nom v7.1.3
381.66 s
> Checking derive_more v2.1.1
381.66 s
> Checking signal-hook-mio v0.2.5
381.66 s
> Checking num-bigint v0.4.6
381.66 s
> Checking console v0.16.3
381.66 s
> Checking bstr v1.12.1
381.66 s
> Checking linux-raw-sys v0.4.15
381.66 s
> Compiling unicode_names2 v1.3.0
381.66 s
> Checking winnow v0.7.15
381.66 s
> Checking cpufeatures v0.2.17
381.66 s
> Checking sha2 v0.10.9
381.66 s
> Checking globset v0.4.18
381.66 s
> Checking rustix v0.38.44
381.66 s
> Checking ciborium v0.2.2
381.66 s
> Checking rand_core v0.6.4
381.66 s
> Checking getrandom v0.4.2
381.66 s
> Checking plotters-backend v0.3.7
381.66 s
> Checking fastrand v2.4.1
381.66 s
> Checking fnv v1.0.7
381.66 s
> Checking plotters-svg v0.3.7
381.66 s
> Checking ansitok v0.3.0
381.66 s
> Checking rust-embed-utils v8.11.0
381.66 s
> Checking tempfile v3.27.0
381.66 s
> Checking serde_spanned v0.6.9
381.66 s
> Checking toml_datetime v0.6.11
381.66 s
> Checking itertools v0.10.5
381.66 s
> Checking crossterm v0.28.1
381.66 s
> Checking tap v1.0.1
381.66 s
> Checking cast v0.3.0
381.66 s
> Checking toml_write v0.1.2
381.66 s
> Checking wyz v0.5.1
381.66 s
> Checking plotters v0.3.7
381.66 s
> Checking ansi-str v0.9.0
381.66 s
> Checking rand_chacha v0.3.1
381.66 s
> Checking radium v0.7.0
381.66 s
> Checking typeid v1.0.3
381.66 s
> Checking clap v4.6.1
381.66 s
> Checking similar v2.7.0
381.66 s
> Checking tinytemplate v1.2.1
381.66 s
> Checking is-terminal v0.4.17
381.66 s
> Checking oorandom v11.1.5
381.66 s
> Checking funty v2.0.0
381.66 s
> Checking toml_edit v0.22.27
381.66 s
> Checking bytecount v0.6.9
381.66 s
> Checking anes v0.1.6
381.66 s
> Checking rand v0.8.6
381.66 s
> Checking papergrid v0.17.0
381.66 s
> Checking ron v0.12.1
381.66 s
> Checking testing_table v0.3.0
381.66 s
> Checking xprec v0.2.2
381.66 s
> Checking toml_edit v0.25.11+spec-1.1.0
381.66 s
> Checking env_filter v1.0.1
381.66 s
> Checking uncased v0.9.10
381.66 s
> Checking criterion-plot v0.5.0
381.66 s
> Checking jiff v0.2.24
381.66 s
> Checking ptr_meta v0.1.4
381.66 s
> Checking simdutf8 v0.1.5
381.66 s
> Checking ucd-trie v0.1.7
381.66 s
> Checking bitvec v1.0.1
381.66 s
> Checking ahash v0.7.8
381.66 s
> Checking approx v0.4.0
381.66 s
> Checking pest v2.8.6
381.66 s
> Checking bytecheck v0.6.12
381.66 s
> Checking hashbrown v0.12.3
381.66 s
> Checking criterion v0.5.1
381.66 s
> Checking seahash v4.1.0
381.66 s
> Checking cgmath v0.18.0
381.66 s
> Checking num-rational v0.4.2
381.66 s
> Checking rend v0.4.2
381.66 s
> Checking tabled v0.20.0
381.66 s
> Checking num-iter v0.1.45
381.66 s
> Checking ref-ops v0.2.5
381.66 s
> Checking insta v1.47.2
381.66 s
> Checking rand_xoshiro v0.6.0
381.66 s
> Checking num v0.4.3
381.66 s
> Checking features v0.10.0
381.66 s
> Checking constcat v0.5.1
381.66 s
> Checking gat-lending-iterator v0.1.8
381.66 s
> Checking colored v2.2.0
381.66 s
> Checking toml v0.8.23
381.66 s
> Compiling pyo3-ffi v0.28.3
381.66 s
> Compiling pyo3-macros-backend v0.28.3
381.66 s
> Compiling pyo3 v0.28.3
381.66 s
> Compiling numpy v0.28.0
381.66 s
> Checking figment v0.10.19
381.66 s
> Checking dot-parser v0.5.1
381.66 s
> Checking constant_time_eq v0.4.2
381.66 s
> Checking arrayref v0.3.9
381.66 s
> Checking cpufeatures v0.3.0
381.66 s
> Checking base64 v0.22.1
381.66 s
> Checking joinery v2.1.0
381.66 s
> Checking blake3 v1.8.5
381.66 s
> Checking siphasher v1.0.2
381.66 s
> Checking titlecase v2.2.1
381.66 s
> Compiling rustpython-parser-core v0.4.0
381.66 s
> Checking subprocess v0.2.15
381.66 s
> Checking rust_lisp v0.18.0
381.66 s
> Checking phf_shared v0.13.1
381.66 s
> Compiling rustpython-ast v0.4.0
381.66 s
> Compiling vakint v0.1.2 (/build/source/crates/vakint)
381.66 s
> Checking version-compare v0.2.1
381.66 s
> Checking phf v0.13.1
381.66 s
> Checking xpct v0.5.1
381.66 s
> Checking ryu v1.0.23
381.66 s
> Checking castaway v0.2.4
381.66 s
> Checking toml_datetime v0.7.5+spec-1.1.0
381.66 s
> Checking strum v0.27.2
381.66 s
> Checking unicode-truncate v2.0.1
381.66 s
> Checking compact_str v0.9.0
381.66 s
> Checking kasuari v0.4.12
381.66 s
> Checking lru v0.16.4
381.66 s
> Checking vte v0.15.0
381.66 s
> Checking string-template-plus v0.4.3
381.66 s
> Checking portable-atomic v1.13.1
381.66 s
> Checking toml v0.9.12+spec-1.1.0
381.66 s
> Checking vt100 v0.16.2
381.66 s
> Checking unit-prefix v0.5.2
381.66 s
> Checking rand_distr v0.4.3
381.66 s
> Checking simba v0.6.0
381.66 s
> Checking line-clipping v0.3.7
381.66 s
> Checking gimli v0.32.3
381.66 s
> Compiling three-dimensional-reps v0.1.0 (/build/source/crates/three-dimensional-reps)
381.66 s
> Checking adler2 v2.0.1
381.66 s
> Checking thiserror v1.0.69
381.66 s
> Checking ratatui-core v0.1.0
381.66 s
> Checking derive_builder v0.11.2
381.66 s
> Checking miniz_oxide v0.8.9
381.66 s
> Checking crossterm v0.29.0
381.66 s
> Checking owo-colors v4.3.0
381.66 s
> Checking object v0.37.3
381.66 s
> Checking tracing-error v0.2.1
381.66 s
> Checking typed-index-collections v3.5.0
381.66 s
> Checking indicatif v0.18.4
381.66 s
> Checking env_logger v0.11.10
381.66 s
> Checking serde-big-array v0.5.1
381.66 s
> Checking amd v0.2.2
381.66 s
> Checking itertools v0.11.0
381.66 s
> Compiling gammaloop-tracing-filter-macros v0.1.0 (/build/source/crates/gammaloop-tracing-filter-macros)
381.66 s
> Checking rustc-demangle v0.1.27
381.66 s
> Checking option-ext v0.2.0
381.66 s
> Checking dirs-sys v0.5.0
381.66 s
> Checking ref-cast v1.0.25
381.66 s
> Checking nix v0.31.2
381.66 s
> Checking integer-sqrt v0.1.5
381.66 s
> Checking brotli-decompressor v4.0.3
381.66 s
> Checking rkyv v0.7.46
381.66 s
> Checking crossbeam-channel v0.5.15
381.66 s
> Checking itertools v0.12.1
381.66 s
> Compiling gammalooprs v0.3.4 (/build/source/crates/gammalooprs)
381.66 s
> Checking color-spantrace v0.3.0
381.66 s
> Checking ratatui-widgets v0.3.0
381.66 s
> Checking ratatui-crossterm v0.1.0
381.66 s
> Checking symlink v0.1.0
381.66 s
> Checking unsafe-libyaml v0.2.11
381.66 s
> Checking tracing-appender v0.2.5
381.66 s
> Checking include_dir v0.7.4
381.66 s
> Checking pathfinding v4.15.0
381.66 s
> Checking tracing-indicatif v0.3.14
381.66 s
> Checking brotli v7.0.0
381.66 s
> Checking clarabel v0.11.1
381.66 s
> Checking schemars v1.2.1
381.66 s
> Checking ctrlc v3.5.2
381.66 s
> Checking dirs v6.0.0
381.66 s
> Checking slotmap v1.1.1
381.66 s
> Checking serde_yaml v0.9.34+deprecated
381.66 s
> Checking json5 v0.4.1
381.66 s
> Checking vectorize v0.2.0
381.66 s
> Checking base62 v2.2.4
381.66 s
> Checking addr2line v0.25.1
381.66 s
> Checking ringbuffer v0.16.0
381.66 s
> Checking rust-embed v8.11.0
381.66 s
> Checking ratatui-macros v0.7.0
381.66 s
> Checking clap_complete v4.6.3
381.66 s
> Checking fd-lock v4.0.4
381.66 s
> Checking strip-ansi-escapes v0.2.1
381.66 s
> Compiling gammaloop-api v0.1.0 (/build/source/crates/gammaloop-api)
381.66 s
> Checking ratatui v0.30.0
381.66 s
> Checking itertools v0.13.0
381.66 s
> Checking strum v0.26.3
381.66 s
> Checking sysinfo v0.33.1
381.66 s
> Checking shlex v1.3.0
381.66 s
> Checking futures-core v0.3.32
381.66 s
> Checking slab v0.4.12
381.66 s
> Checking futures-task v0.3.32
381.66 s
> Checking clap_complete_nushell v4.6.0
381.66 s
> Checking sdd v3.0.10
381.66 s
> Compiling numerica v2.2.0 (https://github.com/alphal00p/symbolica?rev=a277a8dadbaae5a8d6605f2f381991a601e1f345#a277a8da)
381.66 s
> Checking futures-util v0.3.32
381.66 s
> Compiling gammaloop-integration-tests v0.1.0 (/build/source/tests)
381.66 s
> Compiling test-log-core v0.2.20
381.66 s
> Checking scc v2.4.0
381.66 s
> Compiling rustc_version v0.4.1
381.66 s
> Checking backtrace v0.3.76
381.66 s
> Checking which v8.0.2
381.66 s
> Checking nalgebra v0.29.0
381.66 s
> Checking bincode v1.3.3
381.66 s
> Compiling gungraun-runner v0.18.2
381.66 s
> Checking reedline v0.42.0
381.66 s
> Checking color-eyre v0.6.5
381.66 s
> Compiling gungraun-macros v0.8.0
381.66 s
> Checking proc-macro2 v1.0.106
381.66 s
> Checking base64 v0.21.7
381.66 s
> Checking maplit v1.0.2
381.66 s
> Compiling iai-callgrind-runner v0.14.2
381.66 s
> Checking ron v0.8.1
381.66 s
> Checking kurbo v0.13.0
381.66 s
> Checking wait-timeout v0.2.1
381.66 s
> Checking quote v1.0.45
381.66 s
> Checking quick-error v1.2.3
381.66 s
> Compiling iai-callgrind v0.14.2
381.66 s
> Checking futures-executor v0.3.32
381.66 s
> Checking bit-vec v0.8.0
381.66 s
> Checking syn v2.0.117
381.66 s
> Checking rusty-fork v0.3.1
381.66 s
> Checking serial_test v3.4.0
381.66 s
> Checking bit-set v0.8.0
381.66 s
> Compiling iai-callgrind-macros v0.5.1
381.66 s
> Checking rand_xorshift v0.4.0
381.66 s
> Checking console v0.15.11
381.66 s
> Checking unarray v0.1.4
381.66 s
> Checking pathdiff v0.2.3
381.66 s
> Checking clinnet v0.1.8 (/build/source/crates/clinnet)
381.66 s
> Checking proptest v1.11.0
381.66 s
> Checking kurvst v0.1.0 (/build/source/crates/kurvst)
381.66 s
> Compiling test-log-macros v0.2.20
381.66 s
> Checking similar-asserts v1.7.0
381.66 s
> Compiling graphica v2.1.0 (https://github.com/alphal00p/symbolica?rev=a277a8dadbaae5a8d6605f2f381991a601e1f345#a277a8da)
381.66 s
> Checking test-log v0.2.20
381.66 s
> Checking statrs v0.16.1
381.66 s
> Checking momtrop v0.3.0
381.66 s
> Checking gungraun v0.18.2
381.66 s
> Compiling pyo3-stub-gen-derive v0.17.2
381.66 s
> Compiling pyo3-macros v0.28.3
381.66 s
> Checking pyo3-stub-gen v0.17.2
381.66 s
> Checking symbolica-utils v0.1.0 (/build/source/crates/symbolica-utils)
381.66 s
> Checking spenso-macros v0.3.2 (/build/source/crates/spenso-macros)
381.66 s
> Compiling gammaloop-workspace-hack v0.1.0 (/build/source/crates/gammaloop-workspace-hack)
381.66 s
> Checking linnet v0.17.0 (/build/source/crates/linnet)
381.66 s
> Checking spenso v0.6.0 (/build/source/crates/spenso)
381.66 s
> Checking linnet-py v0.1.0 (/build/source/crates/linnet-py)
381.66 s
> Checking linnest v0.1.0 (/build/source/crates/linnest)
381.66 s
> Checking idenso v0.3.0 (/build/source/crates/idenso)
381.66 s
> Checking gammaloop-tracing-filter v0.1.0 (/build/source/crates/gammaloop-tracing-filter)
381.66 s
> Checking spenso-hep-lib v0.1.7 (/build/source/crates/spenso-hep-lib)
381.66 s
> Checking spynso3 v0.1.2 (/build/source/crates/spynso3)
381.66 s
> error[E0609] : no field `lmb_channel_id` on type `CutInfo`
381.66 s
> --> tests/tests/test_runs/utils.rs:568:36
381.66 s
> |
381.66 s
> 568 | event.cut_info.lmb_channel_id,
381.66 s
> | ^^^^^^^^^^^^^^ unknown field
381.66 s
> |
381.66 s
> = note : available fields are: `particle_pdgs`, `cut_id`, `graph_id`, `graph_group_id`, `orientation_id` ... and 2 others
381.66 s
>
381.66 s
> error[E0609] : no field `lmb_channel_id` on type `CutInfo`
381.66 s
> --> tests/tests/test_runs/utils.rs:580:36
381.66 s
> |
381.66 s
> 580 | event.cut_info.lmb_channel_id,
381.66 s
> | ^^^^^^^^^^^^^^ unknown field
381.66 s
> |
381.66 s
> = note : available fields are: `particle_pdgs`, `cut_id`, `graph_id`, `graph_group_id`, `orientation_id` ... and 2 others
381.66 s
>
381.66 s
> For more information about this error, try `rustc --explain E0609`.
381.66 s
> error : could not compile `gammaloop-integration-tests` (test "test_runs") due to 2 previous errors
381.66 s
For full logs, run:
381.66 s
nix log /nix/store/xdkjvkkvbc84s2zga6acfn9bhiw63pi9-gammaloop-workspace-check-0.1.0.drv
381.69 s
Build failed.