1. 0.01 s $ /nix/store/9ypz3flqsrl5xl495mm8h645gadjsxi1-coreutils-9.11/bin/timeout --kill-after=15s 7200s /nix/store/23zk8sgzamrbmj1fday15szf7f2279s8-nix-2.34.7/bin/nix --extra-experimental-features nix-command --extra-experimental-features flakes --log-format internal-json build --no-link --print-out-paths git+https://github.com/alphal00p/gammaloop?ref=advanced_sampling&rev=a04bbb8fe052dc2bc0f6b53f7756da11bf97f924&shallow=1#checks.x86_64-linux.gammaloop-check --print-build-logs
  2. 0.48 s
  3. 0.76 s Building /nix/store/xdkjvkkvbc84s2zga6acfn9bhiw63pi9-gammaloop-workspace-check-0.1.0.drv
  4. 0.83 s [gammaloop-workspace-check] Phase: unpackPhase
  5. 0.83 s [gammaloop-workspace-check] unpacking source archive /nix/store/nc861jsvy8gxrlx0fiqzjyav6cmdsxqj-source
  6. 1.19 s [gammaloop-workspace-check] source root is source
  7. 1.22 s [gammaloop-workspace-check] Phase: patchPhase
  8. 1.22 s [gammaloop-workspace-check] Executing configureCargoCommonVars
  9. 1.22 s [gammaloop-workspace-check] decompressing cargo artifacts from /nix/store/50vpxlcgfxf2d57i27v3d10zjwxxbm2r-gammaloop-workspace-deps-deps-0.1.0/target.tar.zst to target
  10. 2.45 s [gammaloop-workspace-check] Phase: updateAutotoolsGnuConfigScriptsPhase
  11. 2.48 s [gammaloop-workspace-check] Phase: configurePhase
  12. 2.49 s [gammaloop-workspace-check] will append /build/source/.cargo-home/config.toml with contents of /nix/store/5drf77x6km4ky7gwlrzdx9bbd6fz09g3-vendor-cargo-deps/config.toml
  13. 2.49 s [gammaloop-workspace-check] default configurePhase, nothing to do
  14. 2.49 s [gammaloop-workspace-check] Phase: buildPhase
  15. 2.49 s [gammaloop-workspace-check] +++ command cargo --version
  16. 2.50 s [gammaloop-workspace-check] cargo 1.97.0 (c980f4866 2026-06-30)
  17. 2.53 s [gammaloop-workspace-check] +++ command cargo check --profile ci-optim --locked --workspace --features gammaloop-tracing-filter/clap,gammaloop-tracing-filter/symbolica,idenso/bincode,idenso/reference-cases,linnet/bincode,linnet/drawing,linnet/rkyv,linnet/serde,linnet/symbolica,spenso-macros/shadowing,spenso/shadowing,symbolica/tracing_max_level_info,three-dimensional-reps/display,three-dimensional-reps/eval,three-dimensional-reps/serde --all-targets
  18. 3.05 s [gammaloop-workspace-check] Checking cfg-if v1.0.4
  19. 3.05 s [gammaloop-workspace-check] Checking memchr v2.8.0
  20. 3.05 s [gammaloop-workspace-check] Checking once_cell v1.21.4
  21. 3.07 s [gammaloop-workspace-check] Checking either v1.15.0
  22. 3.07 s [gammaloop-workspace-check] Checking serde_core v1.0.228
  23. 3.07 s [gammaloop-workspace-check] Checking libc v0.2.186
  24. 3.08 s [gammaloop-workspace-check] Checking libm v0.2.16
  25. 3.09 s [gammaloop-workspace-check] Checking itoa v1.0.18
  26. 3.09 s [gammaloop-workspace-check] Checking log v0.4.29
  27. 3.09 s [gammaloop-workspace-check] Checking regex-syntax v0.8.10
  28. 3.11 s [gammaloop-workspace-check] Checking zerocopy v0.8.48
  29. 3.11 s [gammaloop-workspace-check] Checking crossbeam-utils v0.8.21
  30. 3.12 s [gammaloop-workspace-check] Checking equivalent v1.0.2
  31. 3.13 s [gammaloop-workspace-check] Checking zmij v1.0.21
  32. 3.13 s [gammaloop-workspace-check] Checking bytemuck v1.25.0
  33. 3.14 s [gammaloop-workspace-check] Checking lazy_static v1.5.0
  34. 3.14 s [gammaloop-workspace-check] Compiling target-lexicon v0.13.5
  35. 3.16 s [gammaloop-workspace-check] Checking arrayvec v0.7.6
  36. 3.17 s [gammaloop-workspace-check] Checking powerfmt v0.2.0
  37. 3.19 s [gammaloop-workspace-check] Checking itertools v0.14.0
  38. 3.20 s [gammaloop-workspace-check] Checking time-core v0.1.8
  39. 3.21 s [gammaloop-workspace-check] Checking num-conv v0.2.1
  40. 3.22 s [gammaloop-workspace-check] Checking pin-project-lite v0.2.17
  41. 3.26 s [gammaloop-workspace-check] Checking num_threads v0.1.7
  42. 3.31 s [gammaloop-workspace-check] Checking deranged v0.5.8
  43. 3.32 s [gammaloop-workspace-check] Checking safe_arch v0.7.4
  44. 3.33 s [gammaloop-workspace-check] Checking tracing-core v0.1.36
  45. 3.33 s [gammaloop-workspace-check] Checking allocator-api2 v0.2.21
  46. 3.34 s [gammaloop-workspace-check] Checking foldhash v0.2.0
  47. 3.35 s [gammaloop-workspace-check] Checking const-random v0.1.18
  48. 3.37 s [gammaloop-workspace-check] Checking static_assertions v1.1.0
  49. 3.38 s [gammaloop-workspace-check] Checking nu-ansi-term v0.50.3
  50. 3.43 s [gammaloop-workspace-check] Checking winnow v1.0.2
  51. 3.46 s [gammaloop-workspace-check] Checking unty v0.0.4
  52. 3.48 s [gammaloop-workspace-check] Checking aho-corasick v1.1.4
  53. 3.50 s [gammaloop-workspace-check] Checking crossbeam-epoch v0.9.18
  54. 3.51 s [gammaloop-workspace-check] Checking safe_arch v1.0.0
  55. 3.56 s [gammaloop-workspace-check] Checking wide v0.7.33
  56. 3.58 s [gammaloop-workspace-check] Checking hashbrown v0.16.1
  57. 3.63 s [gammaloop-workspace-check] Checking sharded-slab v0.1.7
  58. 3.69 s [gammaloop-workspace-check] Checking tracing-log v0.2.0
  59. 3.77 s [gammaloop-workspace-check] Checking crossbeam-deque v0.8.6
  60. 3.78 s [gammaloop-workspace-check] Checking tracing v0.1.44
  61. 3.80 s [gammaloop-workspace-check] Checking thread_local v1.1.9
  62. 3.89 s [gammaloop-workspace-check] Checking az v1.3.0
  63. 3.94 s [gammaloop-workspace-check] Checking rayon-core v1.13.0
  64. 3.96 s [gammaloop-workspace-check] Checking toml_writer v1.1.1+spec-1.1.0
  65. 3.98 s [gammaloop-workspace-check] Checking indenter v0.3.4
  66. 4.00 s [gammaloop-workspace-check] Checking wide v1.3.0
  67. 4.01 s [gammaloop-workspace-check] Checking num-traits v0.2.19
  68. 4.05 s [gammaloop-workspace-check] Compiling phf_shared v0.11.3
  69. 4.08 s [gammaloop-workspace-check] Checking anyhow v1.0.102
  70. 4.24 s [gammaloop-workspace-check] Checking dyn-clone v1.0.20
  71. 4.27 s [gammaloop-workspace-check] Checking utf8parse v0.2.2
  72. 4.29 s [gammaloop-workspace-check] Checking getrandom v0.3.4
  73. 4.29 s [gammaloop-workspace-check] Checking gmp-mpfr-sys v1.7.1
  74. 4.30 s [gammaloop-workspace-check] Checking alloc-no-stdlib v2.0.4
  75. 4.31 s [gammaloop-workspace-check] Checking rayon v1.12.0
  76. 4.34 s [gammaloop-workspace-check] Checking rawpointer v0.2.1
  77. 4.36 s [gammaloop-workspace-check] Checking alloc-stdlib v0.2.2
  78. 4.37 s [gammaloop-workspace-check] Checking time v0.3.47
  79. 4.39 s [gammaloop-workspace-check] Checking matrixmultiply v0.3.10
  80. 4.40 s [gammaloop-workspace-check] Checking anstyle-parse v1.0.0
  81. 4.42 s [gammaloop-workspace-check] Checking is_terminal_polyfill v1.70.2
  82. 4.43 s [gammaloop-workspace-check] Checking rand_core v0.9.5
  83. 4.47 s [gammaloop-workspace-check] Checking toml_parser v1.1.2+spec-1.1.0
  84. 4.48 s [gammaloop-workspace-check] Checking colorchoice v1.0.5
  85. 4.49 s [gammaloop-workspace-check] Checking colored v3.1.1
  86. 4.51 s [gammaloop-workspace-check] Checking anstyle v1.0.14
  87. 4.54 s [gammaloop-workspace-check] Checking anstyle-query v1.1.5
  88. 4.57 s [gammaloop-workspace-check] Checking serde v1.0.228
  89. 4.58 s [gammaloop-workspace-check] Checking serde_json v1.0.149
  90. 4.59 s [gammaloop-workspace-check] Checking bitflags v2.11.1
  91. 4.61 s [gammaloop-workspace-check] Checking regex-automata v0.4.14
  92. 4.63 s [gammaloop-workspace-check] Checking serde_spanned v1.1.1
  93. 4.63 s [gammaloop-workspace-check] Checking toml_datetime v1.1.1+spec-1.1.0
  94. 4.64 s [gammaloop-workspace-check] Compiling pyo3-build-config v0.28.3
  95. 4.70 s [gammaloop-workspace-check] Checking anstream v1.0.0
  96. 4.73 s [gammaloop-workspace-check] Checking approx v0.5.1
  97. 4.74 s [gammaloop-workspace-check] Checking num-integer v0.1.46
  98. 4.74 s [gammaloop-workspace-check] Compiling phf_generator v0.11.3
  99. 4.74 s [gammaloop-workspace-check] Checking eyre v0.6.12
  100. 4.78 s [gammaloop-workspace-check] Checking bitflags v1.3.2
  101. 4.80 s [gammaloop-workspace-check] Checking unicode-width v0.2.2
  102. 4.82 s [gammaloop-workspace-check] Checking toml v1.1.2+spec-1.1.0
  103. 4.83 s [gammaloop-workspace-check] Checking region v3.0.2
  104. 4.89 s [gammaloop-workspace-check] Compiling phf_codegen v0.11.3
  105. 4.90 s [gammaloop-workspace-check] Checking smallvec v1.15.1
  106. 4.94 s [gammaloop-workspace-check] Checking num-complex v0.4.6
  107. 4.95 s [gammaloop-workspace-check] Checking bincode v2.0.1
  108. 4.99 s [gammaloop-workspace-check] Checking tracing-serde v0.2.0
  109. 5.00 s [gammaloop-workspace-check] Checking brotli-decompressor v5.0.0
  110. 5.00 s [gammaloop-workspace-check] Checking wasmtime-jit-icache-coherence v34.0.2
  111. 5.01 s [gammaloop-workspace-check] Checking hugepage-rs v0.1.1
  112. 5.02 s [gammaloop-workspace-check] Checking spec_math v0.1.6
  113. 5.04 s [gammaloop-workspace-check] Checking inventory v0.3.24
  114. 5.08 s [gammaloop-workspace-check] Checking thiserror v2.0.18
  115. 5.09 s [gammaloop-workspace-check] Checking smartstring v1.0.1
  116. 5.10 s [gammaloop-workspace-check] Compiling getopts v0.2.24
  117. 5.10 s [gammaloop-workspace-check] Checking libloading v0.9.0
  118. 5.13 s [gammaloop-workspace-check] Checking byteorder v1.5.0
  119. 5.22 s [gammaloop-workspace-check] Checking simba v0.9.1
  120. 5.23 s [gammaloop-workspace-check] Checking bytes v1.11.1
  121. 5.25 s [gammaloop-workspace-check] Checking self_cell v1.2.2
  122. 5.26 s [gammaloop-workspace-check] Checking append-only-vec v0.1.8
  123. 5.29 s [gammaloop-workspace-check] Checking tinyjson v2.5.1
  124. 5.30 s [gammaloop-workspace-check] Compiling unicode_names2_generator v1.3.0
  125. 5.34 s [gammaloop-workspace-check] Compiling unic-char-range v0.9.0
  126. 5.44 s [gammaloop-workspace-check] Checking linux-raw-sys v0.12.1
  127. 5.45 s [gammaloop-workspace-check] Compiling unic-common v0.9.0
  128. 5.46 s [gammaloop-workspace-check] Compiling unic-char-property v0.9.0
  129. 5.51 s [gammaloop-workspace-check] Compiling unic-ucd-version v0.9.0
  130. 5.52 s [gammaloop-workspace-check] Compiling is-macro v0.3.7
  131. 5.53 s [gammaloop-workspace-check] Compiling rustpython-parser-vendored v0.4.0
  132. 5.53 s [gammaloop-workspace-check] Checking iana-time-zone v0.1.65
  133. 5.58 s [gammaloop-workspace-check] Compiling rustpython-parser v0.4.0
  134. 5.67 s [gammaloop-workspace-check] Checking chrono v0.4.44
  135. 5.71 s [gammaloop-workspace-check] Compiling phf v0.11.3
  136. 5.72 s [gammaloop-workspace-check] Checking rustc-hash v2.1.2
  137. 5.73 s [gammaloop-workspace-check] Compiling unic-ucd-ident v0.9.0
  138. 5.77 s [gammaloop-workspace-check] Compiling unic-emoji-char v0.9.0
  139. 5.79 s [gammaloop-workspace-check] Checking ndarray v0.17.2
  140. 5.84 s [gammaloop-workspace-check] Checking rustix v1.1.4
  141. 5.85 s [gammaloop-workspace-check] Checking brotli v8.0.2
  142. 5.89 s [gammaloop-workspace-check] Compiling lalrpop-util v0.20.2
  143. 5.95 s [gammaloop-workspace-check] Compiling rustc-hash v1.1.0
  144. 5.97 s [gammaloop-workspace-check] Checking rug v1.30.0
  145. 6.02 s [gammaloop-workspace-check] Checking unicode-segmentation v1.13.2
  146. 6.05 s [gammaloop-workspace-check] Compiling symbolica v2.2.0 (https://github.com/alphal00p/symbolica?rev=a277a8dadbaae5a8d6605f2f381991a601e1f345#a277a8da)
  147. 6.10 s [gammaloop-workspace-check] Checking typenum v1.20.0
  148. 6.30 s [gammaloop-workspace-check] Checking getrandom v0.2.17
  149. 6.34 s [gammaloop-workspace-check] Checking scopeguard v1.2.0
  150. 6.40 s [gammaloop-workspace-check] Checking lock_api v0.4.14
  151. 6.46 s [gammaloop-workspace-check] Checking parking_lot_core v0.9.12
  152. 6.54 s [gammaloop-workspace-check] Checking hashbrown v0.17.0
  153. 6.58 s [gammaloop-workspace-check] Checking unicode-ident v1.0.24
  154. 6.64 s [gammaloop-workspace-check] Checking parking_lot v0.12.5
  155. 6.66 s [gammaloop-workspace-check] Checking errno v0.3.14
  156. 6.72 s [gammaloop-workspace-check] Checking clap_lex v1.1.0
  157. 6.73 s [gammaloop-workspace-check] Checking unicase v2.9.0
  158. 6.79 s [gammaloop-workspace-check] Checking ppv-lite86 v0.2.21
  159. 6.83 s [gammaloop-workspace-check] Checking ahash v0.8.12
  160. 6.84 s [gammaloop-workspace-check] Checking strsim v0.11.1
  161. 6.89 s [gammaloop-workspace-check] Checking signal-hook-registry v1.4.8
  162. 6.91 s [gammaloop-workspace-check] Checking matchers v0.2.0
  163. 6.96 s [gammaloop-workspace-check] Checking regex v1.12.3
  164. 6.97 s [gammaloop-workspace-check] Checking generic-array v0.14.7
  165. 7.01 s [gammaloop-workspace-check] Checking vte v0.14.1
  166. 7.02 s [gammaloop-workspace-check] Checking tracing-subscriber v0.3.23
  167. 7.02 s [gammaloop-workspace-check] Checking same-file v1.0.6
  168. 7.06 s [gammaloop-workspace-check] Checking rand_chacha v0.9.0
  169. 7.08 s [gammaloop-workspace-check] Checking signal-hook v0.3.18
  170. 7.08 s [gammaloop-workspace-check] Checking indexmap v2.14.0
  171. 7.11 s [gammaloop-workspace-check] Checking walkdir v2.5.0
  172. 7.21 s [gammaloop-workspace-check] Checking half v2.7.1
  173. 7.24 s [gammaloop-workspace-check] Checking rand v0.9.4
  174. 7.27 s [gammaloop-workspace-check] Checking mio v1.2.0
  175. 7.29 s [gammaloop-workspace-check] Checking ciborium-io v0.2.2
  176. 7.34 s [gammaloop-workspace-check] Checking minimal-lexical v0.2.1
  177. 7.39 s [gammaloop-workspace-check] Checking ciborium-ll v0.2.2
  178. 7.49 s [gammaloop-workspace-check] Checking derive_more v2.1.1
  179. 7.54 s [gammaloop-workspace-check] Checking nom v7.1.3
  180. 7.54 s [gammaloop-workspace-check] Checking block-buffer v0.10.4
  181. 7.55 s [gammaloop-workspace-check] Checking crypto-common v0.1.7
  182. 7.57 s [gammaloop-workspace-check] Checking console v0.16.3
  183. 7.63 s [gammaloop-workspace-check] Checking num-bigint v0.4.6
  184. 7.65 s [gammaloop-workspace-check] Checking digest v0.10.7
  185. 7.66 s [gammaloop-workspace-check] Checking terminal_size v0.4.4
  186. 7.67 s [gammaloop-workspace-check] Checking signal-hook-mio v0.2.5
  187. 7.72 s [gammaloop-workspace-check] Checking clap_builder v4.6.0
  188. 7.73 s [gammaloop-workspace-check] Checking bstr v1.12.1
  189. 7.74 s [gammaloop-workspace-check] Checking symjit v2.21.0
  190. 7.79 s [gammaloop-workspace-check] Checking winnow v0.7.15
  191. 7.95 s [gammaloop-workspace-check] Checking linux-raw-sys v0.4.15
  192. 8.01 s [gammaloop-workspace-check] Checking cpufeatures v0.2.17
  193. 8.07 s [gammaloop-workspace-check] Checking sha2 v0.10.9
  194. 8.22 s [gammaloop-workspace-check] Checking rustix v0.38.44
  195. 8.27 s [gammaloop-workspace-check] Checking globset v0.4.18
  196. 8.36 s [gammaloop-workspace-check] Checking ciborium v0.2.2
  197. 8.37 s [gammaloop-workspace-check] Checking rand_core v0.6.4
  198. 8.48 s [gammaloop-workspace-check] Checking getrandom v0.4.2
  199. 8.51 s [gammaloop-workspace-check] Checking fnv v1.0.7
  200. 8.51 s [gammaloop-workspace-check] Checking fastrand v2.4.1
  201. 8.52 s [gammaloop-workspace-check] Checking xprec v0.2.2
  202. 8.56 s [gammaloop-workspace-check] Checking plotters-backend v0.3.7
  203. 8.57 s [gammaloop-workspace-check] Checking rust-embed-utils v8.11.0
  204. 8.64 s [gammaloop-workspace-check] Checking tempfile v3.27.0
  205. 8.65 s [gammaloop-workspace-check] Checking crossterm v0.28.1
  206. 8.66 s [gammaloop-workspace-check] Checking serde_spanned v0.6.9
  207. 8.68 s [gammaloop-workspace-check] Checking ansitok v0.3.0
  208. 8.70 s [gammaloop-workspace-check] Checking toml_datetime v0.6.11
  209. 8.71 s [gammaloop-workspace-check] Compiling unicode_names2 v1.3.0
  210. 8.73 s [gammaloop-workspace-check] Checking itertools v0.10.5
  211. 8.74 s [gammaloop-workspace-check] Checking plotters-svg v0.3.7
  212. 8.83 s [gammaloop-workspace-check] Checking cast v0.3.0
  213. 8.84 s [gammaloop-workspace-check] Checking tap v1.0.1
  214. 8.85 s [gammaloop-workspace-check] Checking toml_write v0.1.2
  215. 8.86 s [gammaloop-workspace-check] Checking plotters v0.3.7
  216. 8.89 s [gammaloop-workspace-check] Checking wyz v0.5.1
  217. 8.92 s [gammaloop-workspace-check] Checking rand_chacha v0.3.1
  218. 8.94 s [gammaloop-workspace-check] Checking ansi-str v0.9.0
  219. 8.96 s [gammaloop-workspace-check] Checking radium v0.7.0
  220. 9.01 s [gammaloop-workspace-check] Checking typeid v1.0.3
  221. 9.03 s [gammaloop-workspace-check] Checking similar v2.7.0
  222. 9.06 s [gammaloop-workspace-check] Checking tinytemplate v1.2.1
  223. 9.07 s [gammaloop-workspace-check] Checking is-terminal v0.4.17
  224. 9.12 s [gammaloop-workspace-check] Checking anes v0.1.6
  225. 9.14 s [gammaloop-workspace-check] Checking oorandom v11.1.5
  226. 9.18 s [gammaloop-workspace-check] Checking funty v2.0.0
  227. 9.20 s [gammaloop-workspace-check] Checking bytecount v0.6.9
  228. 9.25 s [gammaloop-workspace-check] Checking ron v0.12.1
  229. 9.26 s [gammaloop-workspace-check] Checking papergrid v0.17.0
  230. 9.27 s [gammaloop-workspace-check] Checking rand v0.8.6
  231. 9.31 s [gammaloop-workspace-check] Checking clap v4.6.1
  232. 9.35 s [gammaloop-workspace-check] Checking toml_edit v0.22.27
  233. 9.36 s [gammaloop-workspace-check] Checking testing_table v0.3.0
  234. 9.42 s [gammaloop-workspace-check] Checking toml_edit v0.25.11+spec-1.1.0
  235. 9.47 s [gammaloop-workspace-check] Checking bitvec v1.0.1
  236. 9.52 s [gammaloop-workspace-check] Checking criterion-plot v0.5.0
  237. 9.53 s [gammaloop-workspace-check] Checking uncased v0.9.10
  238. 9.55 s [gammaloop-workspace-check] Checking env_filter v1.0.1
  239. 9.56 s [gammaloop-workspace-check] Checking jiff v0.2.24
  240. 9.62 s [gammaloop-workspace-check] Checking ptr_meta v0.1.4
  241. 9.66 s [gammaloop-workspace-check] Checking simdutf8 v0.1.5
  242. 9.70 s [gammaloop-workspace-check] Checking ucd-trie v0.1.7
  243. 9.77 s [gammaloop-workspace-check] Checking criterion v0.5.1
  244. 9.79 s [gammaloop-workspace-check] Checking bytecheck v0.6.12
  245. 9.79 s [gammaloop-workspace-check] Checking pest v2.8.6
  246. 9.87 s [gammaloop-workspace-check] Checking ahash v0.7.8
  247. 10.01 s [gammaloop-workspace-check] Checking hashbrown v0.12.3
  248. 10.08 s [gammaloop-workspace-check] Checking rend v0.4.2
  249. 10.09 s [gammaloop-workspace-check] Checking tabled v0.20.0
  250. 10.16 s [gammaloop-workspace-check] Checking approx v0.4.0
  251. 10.21 s [gammaloop-workspace-check] Checking insta v1.47.2
  252. 10.26 s [gammaloop-workspace-check] Checking seahash v4.1.0
  253. 10.35 s [gammaloop-workspace-check] Checking cgmath v0.18.0
  254. 10.43 s [gammaloop-workspace-check] Compiling pyo3-ffi v0.28.3
  255. 10.47 s [gammaloop-workspace-check] Compiling pyo3-macros-backend v0.28.3
  256. 10.53 s [gammaloop-workspace-check] Compiling pyo3 v0.28.3
  257. 10.66 s [gammaloop-workspace-check] Compiling numpy v0.28.0
  258. 10.72 s [gammaloop-workspace-check] Checking toml v0.8.23
  259. 10.87 s [gammaloop-workspace-check] Checking dot-parser v0.5.1
  260. 10.94 s [gammaloop-workspace-check] Checking num-rational v0.4.2
  261. 11.04 s [gammaloop-workspace-check] Checking num-iter v0.1.45
  262. 11.11 s [gammaloop-workspace-check] Checking figment v0.10.19
  263. 11.12 s [gammaloop-workspace-check] Checking ref-ops v0.2.5
  264. 11.13 s [gammaloop-workspace-check] Checking rand_xoshiro v0.6.0
  265. 11.15 s [gammaloop-workspace-check] Checking num v0.4.3
  266. 11.18 s [gammaloop-workspace-check] Checking features v0.10.0
  267. 11.22 s [gammaloop-workspace-check] Checking gat-lending-iterator v0.1.8
  268. 11.23 s [gammaloop-workspace-check] Checking constcat v0.5.1
  269. 11.23 s [gammaloop-workspace-check] Checking colored v2.2.0
  270. 11.25 s [gammaloop-workspace-check] Checking arrayref v0.3.9
  271. 11.25 s [gammaloop-workspace-check] Checking cpufeatures v0.3.0
  272. 11.26 s [gammaloop-workspace-check] Checking constant_time_eq v0.4.2
  273. 11.27 s [gammaloop-workspace-check] Checking base64 v0.22.1
  274. 11.29 s [gammaloop-workspace-check] Checking joinery v2.1.0
  275. 11.30 s [gammaloop-workspace-check] Checking siphasher v1.0.2
  276. 11.34 s [gammaloop-workspace-check] Checking subprocess v0.2.15
  277. 11.35 s [gammaloop-workspace-check] Checking blake3 v1.8.5
  278. 11.38 s [gammaloop-workspace-check] Checking titlecase v2.2.1
  279. 11.41 s [gammaloop-workspace-check] Checking rust_lisp v0.18.0
  280. 11.42 s [gammaloop-workspace-check] Compiling vakint v0.1.2 (/build/source/crates/vakint)
  281. 11.43 s [gammaloop-workspace-check] Checking phf_shared v0.13.1
  282. 11.46 s [gammaloop-workspace-check] Checking version-compare v0.2.1
  283. 11.51 s [gammaloop-workspace-check] Checking xpct v0.5.1
  284. 11.58 s [gammaloop-workspace-check] Checking ryu v1.0.23
  285. 11.59 s [gammaloop-workspace-check] Checking castaway v0.2.4
  286. 11.60 s [gammaloop-workspace-check] Checking phf v0.13.1
  287. 11.60 s [gammaloop-workspace-check] Checking toml_datetime v0.7.5+spec-1.1.0
  288. 11.64 s [gammaloop-workspace-check] Checking strum v0.27.2
  289. 11.65 s [gammaloop-workspace-check] Checking unicode-truncate v2.0.1
  290. 11.67 s [gammaloop-workspace-check] Checking compact_str v0.9.0
  291. 11.69 s [gammaloop-workspace-check] Checking kasuari v0.4.12
  292. 11.70 s [gammaloop-workspace-check] Checking lru v0.16.4
  293. 11.73 s [gammaloop-workspace-check] Checking vte v0.15.0
  294. 11.73 s [gammaloop-workspace-check] Checking portable-atomic v1.13.1
  295. 11.75 s [gammaloop-workspace-check] Checking unit-prefix v0.5.2
  296. 11.76 s [gammaloop-workspace-check] Checking string-template-plus v0.4.3
  297. 11.81 s [gammaloop-workspace-check] Checking rand_distr v0.4.3
  298. 11.82 s [gammaloop-workspace-check] Checking simba v0.6.0
  299. 11.82 s [gammaloop-workspace-check] Checking toml v0.9.12+spec-1.1.0
  300. 11.82 s [gammaloop-workspace-check] Checking line-clipping v0.3.7
  301. 11.84 s [gammaloop-workspace-check] Checking vt100 v0.16.2
  302. 11.87 s [gammaloop-workspace-check] Compiling three-dimensional-reps v0.1.0 (/build/source/crates/three-dimensional-reps)
  303. 11.95 s [gammaloop-workspace-check] Checking gimli v0.32.3
  304. 11.96 s [gammaloop-workspace-check] Compiling rustpython-parser-core v0.4.0
  305. 11.97 s [gammaloop-workspace-check] Checking adler2 v2.0.1
  306. 12.00 s [gammaloop-workspace-check] Checking ratatui-core v0.1.0
  307. 12.02 s [gammaloop-workspace-check] Checking env_logger v0.11.10
  308. 12.04 s [gammaloop-workspace-check] Checking miniz_oxide v0.8.9
  309. 12.05 s [gammaloop-workspace-check] Checking thiserror v1.0.69
  310. 12.07 s [gammaloop-workspace-check] Checking derive_builder v0.11.2
  311. 12.07 s [gammaloop-workspace-check] Checking owo-colors v4.3.0
  312. 12.08 s [gammaloop-workspace-check] Checking object v0.37.3
  313. 12.11 s [gammaloop-workspace-check] Compiling rustpython-ast v0.4.0
  314. 12.12 s [gammaloop-workspace-check] Checking crossterm v0.29.0
  315. 12.18 s [gammaloop-workspace-check] Checking tracing-error v0.2.1
  316. 12.21 s [gammaloop-workspace-check] Checking typed-index-collections v3.5.0
  317. 12.22 s [gammaloop-workspace-check] Checking indicatif v0.18.4
  318. 12.23 s [gammaloop-workspace-check] Checking serde-big-array v0.5.1
  319. 12.28 s [gammaloop-workspace-check] Checking amd v0.2.2
  320. 12.32 s [gammaloop-workspace-check] Checking itertools v0.11.0
  321. 12.40 s [gammaloop-workspace-check] Checking rkyv v0.7.46
  322. 12.41 s [gammaloop-workspace-check] Compiling gammaloop-tracing-filter-macros v0.1.0 (/build/source/crates/gammaloop-tracing-filter-macros)
  323. 12.45 s [gammaloop-workspace-check] Checking option-ext v0.2.0
  324. 12.46 s [gammaloop-workspace-check] Checking rustc-demangle v0.1.27
  325. 12.50 s [gammaloop-workspace-check] Checking dirs-sys v0.5.0
  326. 12.62 s [gammaloop-workspace-check] Checking ref-cast v1.0.25
  327. 12.62 s [gammaloop-workspace-check] Checking nix v0.31.2
  328. 12.64 s [gammaloop-workspace-check] Checking integer-sqrt v0.1.5
  329. 12.65 s [gammaloop-workspace-check] Checking brotli-decompressor v4.0.3
  330. 12.68 s [gammaloop-workspace-check] Checking crossbeam-channel v0.5.15
  331. 12.68 s [gammaloop-workspace-check] Checking itertools v0.12.1
  332. 12.69 s [gammaloop-workspace-check] Checking symlink v0.1.0
  333. 12.70 s [gammaloop-workspace-check] Compiling gammalooprs v0.3.4 (/build/source/crates/gammalooprs)
  334. 12.74 s [gammaloop-workspace-check] Checking unsafe-libyaml v0.2.11
  335. 12.75 s [gammaloop-workspace-check] Checking ratatui-widgets v0.3.0
  336. 12.84 s [gammaloop-workspace-check] Checking color-spantrace v0.3.0
  337. 12.94 s [gammaloop-workspace-check] Checking ratatui-crossterm v0.1.0
  338. 12.97 s [gammaloop-workspace-check] Checking tracing-appender v0.2.5
  339. 12.98 s [gammaloop-workspace-check] Checking pathfinding v4.15.0
  340. 13.06 s [gammaloop-workspace-check] Checking include_dir v0.7.4
  341. 13.07 s [gammaloop-workspace-check] Checking ctrlc v3.5.2
  342. 13.13 s [gammaloop-workspace-check] Checking schemars v1.2.1
  343. 13.15 s [gammaloop-workspace-check] Checking clarabel v0.11.1
  344. 13.17 s [gammaloop-workspace-check] Checking tracing-indicatif v0.3.14
  345. 13.18 s [gammaloop-workspace-check] Checking slotmap v1.1.1
  346. 13.30 s [gammaloop-workspace-check] Checking dirs v6.0.0
  347. 13.31 s [gammaloop-workspace-check] Checking brotli v7.0.0
  348. 13.34 s [gammaloop-workspace-check] Checking serde_yaml v0.9.34+deprecated
  349. 13.36 s [gammaloop-workspace-check] Checking json5 v0.4.1
  350. 13.39 s [gammaloop-workspace-check] Checking vectorize v0.2.0
  351. 13.44 s [gammaloop-workspace-check] Checking ringbuffer v0.16.0
  352. 13.61 s [gammaloop-workspace-check] Checking ratatui-macros v0.7.0
  353. 13.63 s [gammaloop-workspace-check] Checking base62 v2.2.4
  354. 13.64 s [gammaloop-workspace-check] Checking addr2line v0.25.1
  355. 13.64 s [gammaloop-workspace-check] Checking ratatui v0.30.0
  356. 13.65 s [gammaloop-workspace-check] Checking rust-embed v8.11.0
  357. 13.71 s [gammaloop-workspace-check] Checking clap_complete v4.6.3
  358. 13.71 s [gammaloop-workspace-check] Checking fd-lock v4.0.4
  359. 13.77 s [gammaloop-workspace-check] Checking strip-ansi-escapes v0.2.1
  360. 13.80 s [gammaloop-workspace-check] Compiling gammaloop-api v0.1.0 (/build/source/crates/gammaloop-api)
  361. 13.82 s [gammaloop-workspace-check] Checking itertools v0.13.0
  362. 13.84 s [gammaloop-workspace-check] Checking strum v0.26.3
  363. 13.88 s [gammaloop-workspace-check] Checking sysinfo v0.33.1
  364. 13.91 s [gammaloop-workspace-check] Checking shlex v1.3.0
  365. 13.92 s [gammaloop-workspace-check] Checking futures-core v0.3.32
  366. 14.00 s [gammaloop-workspace-check] Checking slab v0.4.12
  367. 14.01 s [gammaloop-workspace-check] Checking futures-task v0.3.32
  368. 14.02 s [gammaloop-workspace-check] Checking sdd v3.0.10
  369. 14.02 s [gammaloop-workspace-check] Checking clap_complete_nushell v4.6.0
  370. 14.10 s [gammaloop-workspace-check] Compiling gammaloop-integration-tests v0.1.0 (/build/source/tests)
  371. 14.10 s [gammaloop-workspace-check] Checking futures-util v0.3.32
  372. 14.13 s [gammaloop-workspace-check] Compiling test-log-core v0.2.20
  373. 14.17 s [gammaloop-workspace-check] Compiling rustc_version v0.4.1
  374. 14.20 s [gammaloop-workspace-check] Compiling numerica v2.2.0 (https://github.com/alphal00p/symbolica?rev=a277a8dadbaae5a8d6605f2f381991a601e1f345#a277a8da)
  375. 14.37 s [gammaloop-workspace-check] Checking scc v2.4.0
  376. 14.41 s [gammaloop-workspace-check] Checking which v8.0.2
  377. 14.50 s [gammaloop-workspace-check] Checking bincode v1.3.3
  378. 14.57 s [gammaloop-workspace-check] Compiling gungraun-runner v0.18.2
  379. 14.63 s [gammaloop-workspace-check] Checking nalgebra v0.29.0
  380. 14.92 s [gammaloop-workspace-check] Compiling gungraun-macros v0.8.0
  381. 14.95 s [gammaloop-workspace-check] Checking backtrace v0.3.76
  382. 15.15 s [gammaloop-workspace-check] Checking reedline v0.42.0
  383. 15.37 s [gammaloop-workspace-check] Checking color-eyre v0.6.5
  384. 15.44 s [gammaloop-workspace-check] Checking proc-macro2 v1.0.106
  385. 15.47 s [gammaloop-workspace-check] Checking maplit v1.0.2
  386. 15.52 s [gammaloop-workspace-check] Checking futures-executor v0.3.32
  387. 15.56 s [gammaloop-workspace-check] Checking base64 v0.21.7
  388. 15.64 s [gammaloop-workspace-check] Checking serial_test v3.4.0
  389. 15.68 s [gammaloop-workspace-check] Compiling iai-callgrind-runner v0.14.2
  390. 15.73 s [gammaloop-workspace-check] Checking quote v1.0.45
  391. 15.80 s [gammaloop-workspace-check] Checking kurbo v0.13.0
  392. 15.81 s [gammaloop-workspace-check] Checking wait-timeout v0.2.1
  393. 15.83 s [gammaloop-workspace-check] Checking ron v0.8.1
  394. 15.85 s [gammaloop-workspace-check] Compiling iai-callgrind v0.14.2
  395. 15.90 s [gammaloop-workspace-check] Checking bit-vec v0.8.0
  396. 15.90 s [gammaloop-workspace-check] Checking quick-error v1.2.3
  397. 15.99 s [gammaloop-workspace-check] Checking rusty-fork v0.3.1
  398. 16.07 s [gammaloop-workspace-check] Checking bit-set v0.8.0
  399. 16.09 s [gammaloop-workspace-check] Checking syn v2.0.117
  400. 16.19 s [gammaloop-workspace-check] Compiling iai-callgrind-macros v0.5.1
  401. 16.24 s [gammaloop-workspace-check] Compiling test-log-macros v0.2.20
  402. 16.26 s [gammaloop-workspace-check] Checking rand_xorshift v0.4.0
  403. 16.36 s [gammaloop-workspace-check] Checking console v0.15.11
  404. 16.45 s [gammaloop-workspace-check] Checking unarray v0.1.4
  405. 16.50 s [gammaloop-workspace-check] Checking pathdiff v0.2.3
  406. 16.57 s [gammaloop-workspace-check] Checking kurvst v0.1.0 (/build/source/crates/kurvst)
  407. 16.58 s [gammaloop-workspace-check] Checking proptest v1.11.0
  408. 16.73 s [gammaloop-workspace-check] Checking similar-asserts v1.7.0
  409. 16.87 s [gammaloop-workspace-check] Checking clinnet v0.1.8 (/build/source/crates/clinnet)
  410. 17.19 s [gammaloop-workspace-check] Compiling graphica v2.1.0 (https://github.com/alphal00p/symbolica?rev=a277a8dadbaae5a8d6605f2f381991a601e1f345#a277a8da)
  411. 18.70 s [gammaloop-workspace-check] Checking test-log v0.2.20
  412. 19.71 s [gammaloop-workspace-check] Checking statrs v0.16.1
  413. 20.49 s [gammaloop-workspace-check] Checking momtrop v0.3.0
  414. 21.37 s [gammaloop-workspace-check] Checking gungraun v0.18.2
  415. 23.60 s [gammaloop-workspace-check] Compiling pyo3-macros v0.28.3
  416. 23.61 s [gammaloop-workspace-check] Compiling pyo3-stub-gen-derive v0.17.2
  417. 28.77 s [gammaloop-workspace-check] Checking pyo3-stub-gen v0.17.2
  418. 35.78 s [gammaloop-workspace-check] Checking symbolica-utils v0.1.0 (/build/source/crates/symbolica-utils)
  419. 35.78 s [gammaloop-workspace-check] Checking spenso-macros v0.3.2 (/build/source/crates/spenso-macros)
  420. 253.47 s [gammaloop-workspace-check] Compiling gammaloop-workspace-hack v0.1.0 (/build/source/crates/gammaloop-workspace-hack)
  421. 253.78 s [gammaloop-workspace-check] Checking linnet v0.17.0 (/build/source/crates/linnet)
  422. 258.09 s [gammaloop-workspace-check] Checking spenso v0.6.0 (/build/source/crates/spenso)
  423. 258.24 s [gammaloop-workspace-check] Checking linnet-py v0.1.0 (/build/source/crates/linnet-py)
  424. 258.24 s [gammaloop-workspace-check] Checking linnest v0.1.0 (/build/source/crates/linnest)
  425. 264.69 s [gammaloop-workspace-check] Checking idenso v0.3.0 (/build/source/crates/idenso)
  426. 264.69 s [gammaloop-workspace-check] Checking gammaloop-tracing-filter v0.1.0 (/build/source/crates/gammaloop-tracing-filter)
  427. 266.32 s [gammaloop-workspace-check] Checking spenso-hep-lib v0.1.7 (/build/source/crates/spenso-hep-lib)
  428. 266.68 s [gammaloop-workspace-check] Checking spynso3 v0.1.2 (/build/source/crates/spynso3)
  429. 325.92 s [gammaloop-workspace-check] error[E0609]: no field `lmb_channel_id` on type `CutInfo`
  430. 325.92 s [gammaloop-workspace-check] --> tests/tests/test_runs/utils.rs:568:36
  431. 325.92 s [gammaloop-workspace-check] |
  432. 325.92 s [gammaloop-workspace-check] 568 | event.cut_info.lmb_channel_id,
  433. 325.92 s [gammaloop-workspace-check] | ^^^^^^^^^^^^^^ unknown field
  434. 325.92 s [gammaloop-workspace-check] |
  435. 325.92 s [gammaloop-workspace-check] = note: available fields are: `particle_pdgs`, `cut_id`, `graph_id`, `graph_group_id`, `orientation_id` ... and 2 others
  436. 325.92 s [gammaloop-workspace-check]
  437. 325.92 s [gammaloop-workspace-check] error[E0609]: no field `lmb_channel_id` on type `CutInfo`
  438. 325.92 s [gammaloop-workspace-check] --> tests/tests/test_runs/utils.rs:580:36
  439. 325.92 s [gammaloop-workspace-check] |
  440. 325.92 s [gammaloop-workspace-check] 580 | event.cut_info.lmb_channel_id,
  441. 325.92 s [gammaloop-workspace-check] | ^^^^^^^^^^^^^^ unknown field
  442. 325.92 s [gammaloop-workspace-check] |
  443. 325.92 s [gammaloop-workspace-check] = note: available fields are: `particle_pdgs`, `cut_id`, `graph_id`, `graph_group_id`, `orientation_id` ... and 2 others
  444. 325.92 s [gammaloop-workspace-check]
  445. 326.58 s [gammaloop-workspace-check] For more information about this error, try `rustc --explain E0609`.
  446. 326.61 s [gammaloop-workspace-check] error: could not compile `gammaloop-integration-tests` (test "test_runs") due to 2 previous errors
  447. 327.24 s Progress: 0 of 1 built (1 failed)
  448. 327.24 s Failed to build gammaloop-workspace-check after 5m26s
  449. 327.61 s Cannot build '/nix/store/xdkjvkkvbc84s2zga6acfn9bhiw63pi9-gammaloop-workspace-check-0.1.0.drv'.
  450. 327.61 s Reason: builder failed with exit code 101.
  451. 327.61 s Output paths:
  452. 327.61 s /nix/store/2r14ihw1y440b1jmdnp3zy05ffqkcmy3-gammaloop-workspace-check-0.1.0
  453. 327.61 s Last 443 log lines:
  454. 327.61 s > Running phase: unpackPhase
  455. 327.61 s > unpacking source archive /nix/store/nc861jsvy8gxrlx0fiqzjyav6cmdsxqj-source
  456. 327.61 s > source root is source
  457. 327.61 s > Running phase: patchPhase
  458. 327.61 s > Executing configureCargoCommonVars
  459. 327.61 s > decompressing cargo artifacts from /nix/store/50vpxlcgfxf2d57i27v3d10zjwxxbm2r-gammaloop-workspace-deps-deps-0.1.0/target.tar.zst to target
  460. 327.61 s > Running phase: updateAutotoolsGnuConfigScriptsPhase
  461. 327.61 s > Running phase: configurePhase
  462. 327.61 s > will append /build/source/.cargo-home/config.toml with contents of /nix/store/5drf77x6km4ky7gwlrzdx9bbd6fz09g3-vendor-cargo-deps/config.toml
  463. 327.61 s > default configurePhase, nothing to do
  464. 327.61 s > Running phase: buildPhase
  465. 327.61 s > +++ command cargo --version
  466. 327.61 s > cargo 1.97.0 (c980f4866 2026-06-30)
  467. 327.61 s > +++ command cargo check --profile ci-optim --locked --workspace --features gammaloop-tracing-filter/clap,gammaloop-tracing-filter/symbolica,idenso/bincode,idenso/reference-cases,linnet/bincode,linnet/drawing,linnet/rkyv,linnet/serde,linnet/symbolica,spenso-macros/shadowing,spenso/shadowing,symbolica/tracing_max_level_info,three-dimensional-reps/display,three-dimensional-reps/eval,three-dimensional-reps/serde --all-targets
  468. 327.61 s > Checking cfg-if v1.0.4
  469. 327.61 s > Checking memchr v2.8.0
  470. 327.61 s > Checking once_cell v1.21.4
  471. 327.61 s > Checking either v1.15.0
  472. 327.61 s > Checking serde_core v1.0.228
  473. 327.61 s > Checking libc v0.2.186
  474. 327.61 s > Checking libm v0.2.16
  475. 327.61 s > Checking itoa v1.0.18
  476. 327.61 s > Checking log v0.4.29
  477. 327.61 s > Checking regex-syntax v0.8.10
  478. 327.61 s > Checking zerocopy v0.8.48
  479. 327.61 s > Checking crossbeam-utils v0.8.21
  480. 327.61 s > Checking equivalent v1.0.2
  481. 327.61 s > Checking zmij v1.0.21
  482. 327.61 s > Checking bytemuck v1.25.0
  483. 327.61 s > Checking lazy_static v1.5.0
  484. 327.61 s > Compiling target-lexicon v0.13.5
  485. 327.61 s > Checking arrayvec v0.7.6
  486. 327.61 s > Checking powerfmt v0.2.0
  487. 327.61 s > Checking itertools v0.14.0
  488. 327.61 s > Checking time-core v0.1.8
  489. 327.61 s > Checking num-conv v0.2.1
  490. 327.61 s > Checking pin-project-lite v0.2.17
  491. 327.61 s > Checking num_threads v0.1.7
  492. 327.61 s > Checking deranged v0.5.8
  493. 327.61 s > Checking safe_arch v0.7.4
  494. 327.61 s > Checking tracing-core v0.1.36
  495. 327.61 s > Checking allocator-api2 v0.2.21
  496. 327.61 s > Checking foldhash v0.2.0
  497. 327.61 s > Checking const-random v0.1.18
  498. 327.61 s > Checking static_assertions v1.1.0
  499. 327.61 s > Checking nu-ansi-term v0.50.3
  500. 327.61 s > Checking winnow v1.0.2
  501. 327.61 s > Checking unty v0.0.4
  502. 327.61 s > Checking aho-corasick v1.1.4
  503. 327.61 s > Checking crossbeam-epoch v0.9.18
  504. 327.61 s > Checking safe_arch v1.0.0
  505. 327.61 s > Checking wide v0.7.33
  506. 327.61 s > Checking hashbrown v0.16.1
  507. 327.61 s > Checking sharded-slab v0.1.7
  508. 327.61 s > Checking tracing-log v0.2.0
  509. 327.61 s > Checking crossbeam-deque v0.8.6
  510. 327.61 s > Checking tracing v0.1.44
  511. 327.61 s > Checking thread_local v1.1.9
  512. 327.61 s > Checking az v1.3.0
  513. 327.61 s > Checking rayon-core v1.13.0
  514. 327.61 s > Checking toml_writer v1.1.1+spec-1.1.0
  515. 327.61 s > Checking indenter v0.3.4
  516. 327.61 s > Checking wide v1.3.0
  517. 327.61 s > Checking num-traits v0.2.19
  518. 327.61 s > Compiling phf_shared v0.11.3
  519. 327.61 s > Checking anyhow v1.0.102
  520. 327.61 s > Checking dyn-clone v1.0.20
  521. 327.61 s > Checking utf8parse v0.2.2
  522. 327.61 s > Checking getrandom v0.3.4
  523. 327.61 s > Checking gmp-mpfr-sys v1.7.1
  524. 327.61 s > Checking alloc-no-stdlib v2.0.4
  525. 327.61 s > Checking rayon v1.12.0
  526. 327.61 s > Checking rawpointer v0.2.1
  527. 327.61 s > Checking alloc-stdlib v0.2.2
  528. 327.61 s > Checking time v0.3.47
  529. 327.61 s > Checking matrixmultiply v0.3.10
  530. 327.61 s > Checking anstyle-parse v1.0.0
  531. 327.61 s > Checking is_terminal_polyfill v1.70.2
  532. 327.61 s > Checking rand_core v0.9.5
  533. 327.61 s > Checking toml_parser v1.1.2+spec-1.1.0
  534. 327.61 s > Checking colorchoice v1.0.5
  535. 327.61 s > Checking colored v3.1.1
  536. 327.61 s > Checking anstyle v1.0.14
  537. 327.61 s > Checking anstyle-query v1.1.5
  538. 327.61 s > Checking serde v1.0.228
  539. 327.61 s > Checking serde_json v1.0.149
  540. 327.61 s > Checking bitflags v2.11.1
  541. 327.61 s > Checking regex-automata v0.4.14
  542. 327.61 s > Checking serde_spanned v1.1.1
  543. 327.61 s > Checking toml_datetime v1.1.1+spec-1.1.0
  544. 327.61 s > Compiling pyo3-build-config v0.28.3
  545. 327.61 s > Checking anstream v1.0.0
  546. 327.61 s > Checking approx v0.5.1
  547. 327.61 s > Checking num-integer v0.1.46
  548. 327.61 s > Compiling phf_generator v0.11.3
  549. 327.61 s > Checking eyre v0.6.12
  550. 327.61 s > Checking bitflags v1.3.2
  551. 327.61 s > Checking unicode-width v0.2.2
  552. 327.61 s > Checking toml v1.1.2+spec-1.1.0
  553. 327.61 s > Checking region v3.0.2
  554. 327.61 s > Compiling phf_codegen v0.11.3
  555. 327.61 s > Checking smallvec v1.15.1
  556. 327.61 s > Checking num-complex v0.4.6
  557. 327.61 s > Checking bincode v2.0.1
  558. 327.61 s > Checking tracing-serde v0.2.0
  559. 327.61 s > Checking brotli-decompressor v5.0.0
  560. 327.61 s > Checking wasmtime-jit-icache-coherence v34.0.2
  561. 327.61 s > Checking hugepage-rs v0.1.1
  562. 327.61 s > Checking spec_math v0.1.6
  563. 327.61 s > Checking inventory v0.3.24
  564. 327.61 s > Checking thiserror v2.0.18
  565. 327.61 s > Checking smartstring v1.0.1
  566. 327.61 s > Compiling getopts v0.2.24
  567. 327.61 s > Checking libloading v0.9.0
  568. 327.61 s > Checking byteorder v1.5.0
  569. 327.61 s > Checking simba v0.9.1
  570. 327.61 s > Checking bytes v1.11.1
  571. 327.61 s > Checking self_cell v1.2.2
  572. 327.61 s > Checking append-only-vec v0.1.8
  573. 327.61 s > Checking tinyjson v2.5.1
  574. 327.61 s > Compiling unicode_names2_generator v1.3.0
  575. 327.61 s > Compiling unic-char-range v0.9.0
  576. 327.61 s > Checking linux-raw-sys v0.12.1
  577. 327.61 s > Compiling unic-common v0.9.0
  578. 327.61 s > Compiling unic-char-property v0.9.0
  579. 327.61 s > Compiling unic-ucd-version v0.9.0
  580. 327.61 s > Compiling is-macro v0.3.7
  581. 327.61 s > Compiling rustpython-parser-vendored v0.4.0
  582. 327.61 s > Checking iana-time-zone v0.1.65
  583. 327.61 s > Compiling rustpython-parser v0.4.0
  584. 327.61 s > Checking chrono v0.4.44
  585. 327.61 s > Compiling phf v0.11.3
  586. 327.61 s > Checking rustc-hash v2.1.2
  587. 327.61 s > Compiling unic-ucd-ident v0.9.0
  588. 327.61 s > Compiling unic-emoji-char v0.9.0
  589. 327.61 s > Checking ndarray v0.17.2
  590. 327.61 s > Checking rustix v1.1.4
  591. 327.61 s > Checking brotli v8.0.2
  592. 327.61 s > Compiling lalrpop-util v0.20.2
  593. 327.61 s > Compiling rustc-hash v1.1.0
  594. 327.61 s > Checking rug v1.30.0
  595. 327.61 s > Checking unicode-segmentation v1.13.2
  596. 327.61 s > Compiling symbolica v2.2.0 (https://github.com/alphal00p/symbolica?rev=a277a8dadbaae5a8d6605f2f381991a601e1f345#a277a8da)
  597. 327.61 s > Checking typenum v1.20.0
  598. 327.61 s > Checking getrandom v0.2.17
  599. 327.61 s > Checking scopeguard v1.2.0
  600. 327.61 s > Checking lock_api v0.4.14
  601. 327.61 s > Checking parking_lot_core v0.9.12
  602. 327.61 s > Checking hashbrown v0.17.0
  603. 327.61 s > Checking unicode-ident v1.0.24
  604. 327.61 s > Checking parking_lot v0.12.5
  605. 327.61 s > Checking errno v0.3.14
  606. 327.61 s > Checking clap_lex v1.1.0
  607. 327.61 s > Checking unicase v2.9.0
  608. 327.61 s > Checking ppv-lite86 v0.2.21
  609. 327.61 s > Checking ahash v0.8.12
  610. 327.61 s > Checking strsim v0.11.1
  611. 327.61 s > Checking signal-hook-registry v1.4.8
  612. 327.61 s > Checking matchers v0.2.0
  613. 327.61 s > Checking regex v1.12.3
  614. 327.61 s > Checking generic-array v0.14.7
  615. 327.61 s > Checking vte v0.14.1
  616. 327.61 s > Checking tracing-subscriber v0.3.23
  617. 327.61 s > Checking same-file v1.0.6
  618. 327.61 s > Checking rand_chacha v0.9.0
  619. 327.61 s > Checking signal-hook v0.3.18
  620. 327.61 s > Checking indexmap v2.14.0
  621. 327.61 s > Checking walkdir v2.5.0
  622. 327.61 s > Checking half v2.7.1
  623. 327.61 s > Checking rand v0.9.4
  624. 327.61 s > Checking mio v1.2.0
  625. 327.61 s > Checking ciborium-io v0.2.2
  626. 327.61 s > Checking minimal-lexical v0.2.1
  627. 327.61 s > Checking ciborium-ll v0.2.2
  628. 327.61 s > Checking derive_more v2.1.1
  629. 327.61 s > Checking nom v7.1.3
  630. 327.61 s > Checking block-buffer v0.10.4
  631. 327.61 s > Checking crypto-common v0.1.7
  632. 327.61 s > Checking console v0.16.3
  633. 327.61 s > Checking num-bigint v0.4.6
  634. 327.61 s > Checking digest v0.10.7
  635. 327.61 s > Checking terminal_size v0.4.4
  636. 327.61 s > Checking signal-hook-mio v0.2.5
  637. 327.61 s > Checking clap_builder v4.6.0
  638. 327.61 s > Checking bstr v1.12.1
  639. 327.61 s > Checking symjit v2.21.0
  640. 327.61 s > Checking winnow v0.7.15
  641. 327.61 s > Checking linux-raw-sys v0.4.15
  642. 327.61 s > Checking cpufeatures v0.2.17
  643. 327.61 s > Checking sha2 v0.10.9
  644. 327.61 s > Checking rustix v0.38.44
  645. 327.61 s > Checking globset v0.4.18
  646. 327.61 s > Checking ciborium v0.2.2
  647. 327.61 s > Checking rand_core v0.6.4
  648. 327.61 s > Checking getrandom v0.4.2
  649. 327.61 s > Checking fnv v1.0.7
  650. 327.61 s > Checking fastrand v2.4.1
  651. 327.61 s > Checking xprec v0.2.2
  652. 327.61 s > Checking plotters-backend v0.3.7
  653. 327.61 s > Checking rust-embed-utils v8.11.0
  654. 327.61 s > Checking tempfile v3.27.0
  655. 327.61 s > Checking crossterm v0.28.1
  656. 327.61 s > Checking serde_spanned v0.6.9
  657. 327.61 s > Checking ansitok v0.3.0
  658. 327.61 s > Checking toml_datetime v0.6.11
  659. 327.61 s > Compiling unicode_names2 v1.3.0
  660. 327.61 s > Checking itertools v0.10.5
  661. 327.61 s > Checking plotters-svg v0.3.7
  662. 327.61 s > Checking cast v0.3.0
  663. 327.61 s > Checking tap v1.0.1
  664. 327.61 s > Checking toml_write v0.1.2
  665. 327.61 s > Checking plotters v0.3.7
  666. 327.61 s > Checking wyz v0.5.1
  667. 327.61 s > Checking rand_chacha v0.3.1
  668. 327.61 s > Checking ansi-str v0.9.0
  669. 327.61 s > Checking radium v0.7.0
  670. 327.61 s > Checking typeid v1.0.3
  671. 327.61 s > Checking similar v2.7.0
  672. 327.61 s > Checking tinytemplate v1.2.1
  673. 327.61 s > Checking is-terminal v0.4.17
  674. 327.61 s > Checking anes v0.1.6
  675. 327.61 s > Checking oorandom v11.1.5
  676. 327.61 s > Checking funty v2.0.0
  677. 327.61 s > Checking bytecount v0.6.9
  678. 327.61 s > Checking ron v0.12.1
  679. 327.61 s > Checking papergrid v0.17.0
  680. 327.61 s > Checking rand v0.8.6
  681. 327.61 s > Checking clap v4.6.1
  682. 327.61 s > Checking toml_edit v0.22.27
  683. 327.61 s > Checking testing_table v0.3.0
  684. 327.61 s > Checking toml_edit v0.25.11+spec-1.1.0
  685. 327.61 s > Checking bitvec v1.0.1
  686. 327.61 s > Checking criterion-plot v0.5.0
  687. 327.61 s > Checking uncased v0.9.10
  688. 327.61 s > Checking env_filter v1.0.1
  689. 327.61 s > Checking jiff v0.2.24
  690. 327.61 s > Checking ptr_meta v0.1.4
  691. 327.61 s > Checking simdutf8 v0.1.5
  692. 327.61 s > Checking ucd-trie v0.1.7
  693. 327.61 s > Checking criterion v0.5.1
  694. 327.61 s > Checking bytecheck v0.6.12
  695. 327.61 s > Checking pest v2.8.6
  696. 327.61 s > Checking ahash v0.7.8
  697. 327.61 s > Checking hashbrown v0.12.3
  698. 327.61 s > Checking rend v0.4.2
  699. 327.61 s > Checking tabled v0.20.0
  700. 327.61 s > Checking approx v0.4.0
  701. 327.61 s > Checking insta v1.47.2
  702. 327.61 s > Checking seahash v4.1.0
  703. 327.61 s > Checking cgmath v0.18.0
  704. 327.61 s > Compiling pyo3-ffi v0.28.3
  705. 327.61 s > Compiling pyo3-macros-backend v0.28.3
  706. 327.61 s > Compiling pyo3 v0.28.3
  707. 327.61 s > Compiling numpy v0.28.0
  708. 327.61 s > Checking toml v0.8.23
  709. 327.61 s > Checking dot-parser v0.5.1
  710. 327.61 s > Checking num-rational v0.4.2
  711. 327.61 s > Checking num-iter v0.1.45
  712. 327.61 s > Checking figment v0.10.19
  713. 327.61 s > Checking ref-ops v0.2.5
  714. 327.61 s > Checking rand_xoshiro v0.6.0
  715. 327.61 s > Checking num v0.4.3
  716. 327.61 s > Checking features v0.10.0
  717. 327.61 s > Checking gat-lending-iterator v0.1.8
  718. 327.61 s > Checking constcat v0.5.1
  719. 327.61 s > Checking colored v2.2.0
  720. 327.61 s > Checking arrayref v0.3.9
  721. 327.61 s > Checking cpufeatures v0.3.0
  722. 327.61 s > Checking constant_time_eq v0.4.2
  723. 327.61 s > Checking base64 v0.22.1
  724. 327.61 s > Checking joinery v2.1.0
  725. 327.61 s > Checking siphasher v1.0.2
  726. 327.61 s > Checking subprocess v0.2.15
  727. 327.61 s > Checking blake3 v1.8.5
  728. 327.61 s > Checking titlecase v2.2.1
  729. 327.61 s > Checking rust_lisp v0.18.0
  730. 327.61 s > Compiling vakint v0.1.2 (/build/source/crates/vakint)
  731. 327.61 s > Checking phf_shared v0.13.1
  732. 327.61 s > Checking version-compare v0.2.1
  733. 327.61 s > Checking xpct v0.5.1
  734. 327.61 s > Checking ryu v1.0.23
  735. 327.61 s > Checking castaway v0.2.4
  736. 327.61 s > Checking phf v0.13.1
  737. 327.61 s > Checking toml_datetime v0.7.5+spec-1.1.0
  738. 327.61 s > Checking strum v0.27.2
  739. 327.61 s > Checking unicode-truncate v2.0.1
  740. 327.61 s > Checking compact_str v0.9.0
  741. 327.61 s > Checking kasuari v0.4.12
  742. 327.61 s > Checking lru v0.16.4
  743. 327.61 s > Checking vte v0.15.0
  744. 327.61 s > Checking portable-atomic v1.13.1
  745. 327.61 s > Checking unit-prefix v0.5.2
  746. 327.61 s > Checking string-template-plus v0.4.3
  747. 327.61 s > Checking rand_distr v0.4.3
  748. 327.61 s > Checking simba v0.6.0
  749. 327.61 s > Checking toml v0.9.12+spec-1.1.0
  750. 327.61 s > Checking line-clipping v0.3.7
  751. 327.61 s > Checking vt100 v0.16.2
  752. 327.61 s > Compiling three-dimensional-reps v0.1.0 (/build/source/crates/three-dimensional-reps)
  753. 327.61 s > Checking gimli v0.32.3
  754. 327.61 s > Compiling rustpython-parser-core v0.4.0
  755. 327.61 s > Checking adler2 v2.0.1
  756. 327.61 s > Checking ratatui-core v0.1.0
  757. 327.61 s > Checking env_logger v0.11.10
  758. 327.61 s > Checking miniz_oxide v0.8.9
  759. 327.61 s > Checking thiserror v1.0.69
  760. 327.61 s > Checking derive_builder v0.11.2
  761. 327.61 s > Checking owo-colors v4.3.0
  762. 327.61 s > Checking object v0.37.3
  763. 327.61 s > Compiling rustpython-ast v0.4.0
  764. 327.61 s > Checking crossterm v0.29.0
  765. 327.61 s > Checking tracing-error v0.2.1
  766. 327.61 s > Checking typed-index-collections v3.5.0
  767. 327.61 s > Checking indicatif v0.18.4
  768. 327.61 s > Checking serde-big-array v0.5.1
  769. 327.61 s > Checking amd v0.2.2
  770. 327.61 s > Checking itertools v0.11.0
  771. 327.61 s > Checking rkyv v0.7.46
  772. 327.61 s > Compiling gammaloop-tracing-filter-macros v0.1.0 (/build/source/crates/gammaloop-tracing-filter-macros)
  773. 327.61 s > Checking option-ext v0.2.0
  774. 327.61 s > Checking rustc-demangle v0.1.27
  775. 327.61 s > Checking dirs-sys v0.5.0
  776. 327.61 s > Checking ref-cast v1.0.25
  777. 327.61 s > Checking nix v0.31.2
  778. 327.61 s > Checking integer-sqrt v0.1.5
  779. 327.61 s > Checking brotli-decompressor v4.0.3
  780. 327.61 s > Checking crossbeam-channel v0.5.15
  781. 327.61 s > Checking itertools v0.12.1
  782. 327.61 s > Checking symlink v0.1.0
  783. 327.61 s > Compiling gammalooprs v0.3.4 (/build/source/crates/gammalooprs)
  784. 327.61 s > Checking unsafe-libyaml v0.2.11
  785. 327.61 s > Checking ratatui-widgets v0.3.0
  786. 327.61 s > Checking color-spantrace v0.3.0
  787. 327.61 s > Checking ratatui-crossterm v0.1.0
  788. 327.61 s > Checking tracing-appender v0.2.5
  789. 327.61 s > Checking pathfinding v4.15.0
  790. 327.61 s > Checking include_dir v0.7.4
  791. 327.61 s > Checking ctrlc v3.5.2
  792. 327.61 s > Checking schemars v1.2.1
  793. 327.61 s > Checking clarabel v0.11.1
  794. 327.61 s > Checking tracing-indicatif v0.3.14
  795. 327.61 s > Checking slotmap v1.1.1
  796. 327.61 s > Checking dirs v6.0.0
  797. 327.61 s > Checking brotli v7.0.0
  798. 327.61 s > Checking serde_yaml v0.9.34+deprecated
  799. 327.61 s > Checking json5 v0.4.1
  800. 327.61 s > Checking vectorize v0.2.0
  801. 327.61 s > Checking ringbuffer v0.16.0
  802. 327.61 s > Checking ratatui-macros v0.7.0
  803. 327.61 s > Checking base62 v2.2.4
  804. 327.61 s > Checking addr2line v0.25.1
  805. 327.61 s > Checking ratatui v0.30.0
  806. 327.61 s > Checking rust-embed v8.11.0
  807. 327.61 s > Checking clap_complete v4.6.3
  808. 327.61 s > Checking fd-lock v4.0.4
  809. 327.61 s > Checking strip-ansi-escapes v0.2.1
  810. 327.61 s > Compiling gammaloop-api v0.1.0 (/build/source/crates/gammaloop-api)
  811. 327.61 s > Checking itertools v0.13.0
  812. 327.61 s > Checking strum v0.26.3
  813. 327.61 s > Checking sysinfo v0.33.1
  814. 327.61 s > Checking shlex v1.3.0
  815. 327.61 s > Checking futures-core v0.3.32
  816. 327.61 s > Checking slab v0.4.12
  817. 327.61 s > Checking futures-task v0.3.32
  818. 327.61 s > Checking sdd v3.0.10
  819. 327.61 s > Checking clap_complete_nushell v4.6.0
  820. 327.61 s > Compiling gammaloop-integration-tests v0.1.0 (/build/source/tests)
  821. 327.61 s > Checking futures-util v0.3.32
  822. 327.61 s > Compiling test-log-core v0.2.20
  823. 327.61 s > Compiling rustc_version v0.4.1
  824. 327.61 s > Compiling numerica v2.2.0 (https://github.com/alphal00p/symbolica?rev=a277a8dadbaae5a8d6605f2f381991a601e1f345#a277a8da)
  825. 327.61 s > Checking scc v2.4.0
  826. 327.61 s > Checking which v8.0.2
  827. 327.61 s > Checking bincode v1.3.3
  828. 327.61 s > Compiling gungraun-runner v0.18.2
  829. 327.61 s > Checking nalgebra v0.29.0
  830. 327.61 s > Compiling gungraun-macros v0.8.0
  831. 327.61 s > Checking backtrace v0.3.76
  832. 327.61 s > Checking reedline v0.42.0
  833. 327.61 s > Checking color-eyre v0.6.5
  834. 327.61 s > Checking proc-macro2 v1.0.106
  835. 327.61 s > Checking maplit v1.0.2
  836. 327.61 s > Checking futures-executor v0.3.32
  837. 327.61 s > Checking base64 v0.21.7
  838. 327.61 s > Checking serial_test v3.4.0
  839. 327.61 s > Compiling iai-callgrind-runner v0.14.2
  840. 327.61 s > Checking quote v1.0.45
  841. 327.61 s > Checking kurbo v0.13.0
  842. 327.61 s > Checking wait-timeout v0.2.1
  843. 327.61 s > Checking ron v0.8.1
  844. 327.61 s > Compiling iai-callgrind v0.14.2
  845. 327.61 s > Checking bit-vec v0.8.0
  846. 327.61 s > Checking quick-error v1.2.3
  847. 327.61 s > Checking rusty-fork v0.3.1
  848. 327.61 s > Checking bit-set v0.8.0
  849. 327.61 s > Checking syn v2.0.117
  850. 327.61 s > Compiling iai-callgrind-macros v0.5.1
  851. 327.61 s > Compiling test-log-macros v0.2.20
  852. 327.61 s > Checking rand_xorshift v0.4.0
  853. 327.61 s > Checking console v0.15.11
  854. 327.61 s > Checking unarray v0.1.4
  855. 327.61 s > Checking pathdiff v0.2.3
  856. 327.61 s > Checking kurvst v0.1.0 (/build/source/crates/kurvst)
  857. 327.61 s > Checking proptest v1.11.0
  858. 327.61 s > Checking similar-asserts v1.7.0
  859. 327.61 s > Checking clinnet v0.1.8 (/build/source/crates/clinnet)
  860. 327.61 s > Compiling graphica v2.1.0 (https://github.com/alphal00p/symbolica?rev=a277a8dadbaae5a8d6605f2f381991a601e1f345#a277a8da)
  861. 327.61 s > Checking test-log v0.2.20
  862. 327.61 s > Checking statrs v0.16.1
  863. 327.61 s > Checking momtrop v0.3.0
  864. 327.61 s > Checking gungraun v0.18.2
  865. 327.61 s > Compiling pyo3-macros v0.28.3
  866. 327.61 s > Compiling pyo3-stub-gen-derive v0.17.2
  867. 327.61 s > Checking pyo3-stub-gen v0.17.2
  868. 327.61 s > Checking symbolica-utils v0.1.0 (/build/source/crates/symbolica-utils)
  869. 327.61 s > Checking spenso-macros v0.3.2 (/build/source/crates/spenso-macros)
  870. 327.61 s > Compiling gammaloop-workspace-hack v0.1.0 (/build/source/crates/gammaloop-workspace-hack)
  871. 327.61 s > Checking linnet v0.17.0 (/build/source/crates/linnet)
  872. 327.61 s > Checking spenso v0.6.0 (/build/source/crates/spenso)
  873. 327.61 s > Checking linnet-py v0.1.0 (/build/source/crates/linnet-py)
  874. 327.61 s > Checking linnest v0.1.0 (/build/source/crates/linnest)
  875. 327.61 s > Checking idenso v0.3.0 (/build/source/crates/idenso)
  876. 327.61 s > Checking gammaloop-tracing-filter v0.1.0 (/build/source/crates/gammaloop-tracing-filter)
  877. 327.61 s > Checking spenso-hep-lib v0.1.7 (/build/source/crates/spenso-hep-lib)
  878. 327.61 s > Checking spynso3 v0.1.2 (/build/source/crates/spynso3)
  879. 327.61 s > error[E0609]: no field `lmb_channel_id` on type `CutInfo`
  880. 327.61 s > --> tests/tests/test_runs/utils.rs:568:36
  881. 327.61 s > |
  882. 327.61 s > 568 | event.cut_info.lmb_channel_id,
  883. 327.61 s > | ^^^^^^^^^^^^^^ unknown field
  884. 327.61 s > |
  885. 327.61 s > = note: available fields are: `particle_pdgs`, `cut_id`, `graph_id`, `graph_group_id`, `orientation_id` ... and 2 others
  886. 327.61 s >
  887. 327.61 s > error[E0609]: no field `lmb_channel_id` on type `CutInfo`
  888. 327.61 s > --> tests/tests/test_runs/utils.rs:580:36
  889. 327.61 s > |
  890. 327.61 s > 580 | event.cut_info.lmb_channel_id,
  891. 327.61 s > | ^^^^^^^^^^^^^^ unknown field
  892. 327.61 s > |
  893. 327.61 s > = note: available fields are: `particle_pdgs`, `cut_id`, `graph_id`, `graph_group_id`, `orientation_id` ... and 2 others
  894. 327.61 s >
  895. 327.61 s > For more information about this error, try `rustc --explain E0609`.
  896. 327.61 s > error: could not compile `gammaloop-integration-tests` (test "test_runs") due to 2 previous errors
  897. 327.61 s For full logs, run:
  898. 327.61 s nix log /nix/store/xdkjvkkvbc84s2zga6acfn9bhiw63pi9-gammaloop-workspace-check-0.1.0.drv
  899. 327.97 s Build failed.