0.01 s
$ /nix/store/9ypz3flqsrl5xl495mm8h645gadjsxi1-coreutils-9.11/bin/timeout --kill-after=15s 7200s /nix/store/23zk8sgzamrbmj1fday15szf7f2279s8-nix-2.34.7/bin/nix --extra-experimental-features nix-command --extra-experimental-features flakes --log-format internal-json build --no-link --print-out-paths git+https://github.com/alphal00p/gammaloop?ref=advanced_sampling&rev=a04bbb8fe052dc2bc0f6b53f7756da11bf97f924&shallow=1#packages.x86_64-linux.crate-test-binaries-gammaloop-integration-tests --print-build-logs
0.88 s
error (ignored): SQLite database '/var/cache/nix-ci-worker/eval-cache-v6/b5d64031b06347e2cd689972e2b4125949b7ea7a9b47c7a4dca442bc999a959a.sqlite ' is busy
6.94 s
8.43 s
Building /nix/store/r56whqs3zj9clz5fj8bc4m0bwgy8zlg2-gammaloop-crate-test-binaries-gammaloop-integration-tests-b8cda0d438c96d4f-deps-0.1.0.drv
8.58 s
[gammaloop-crate-test-binaries-gammaloop-integration-tests-b8cda0d438c96d4f-deps] Phase: unpackPhase
8.58 s
[gammaloop-crate-test-binaries-gammaloop-integration-tests-b8cda0d438c96d4f-deps] unpacking source archive /nix/store/mihhxhg81q7j5z719niswnivgvyvfkc5-source
9.86 s
[gammaloop-crate-test-binaries-gammaloop-integration-tests-b8cda0d438c96d4f-deps] source root is source
9.91 s
[gammaloop-crate-test-binaries-gammaloop-integration-tests-b8cda0d438c96d4f-deps] Phase: patchPhase
10.07 s
[gammaloop-crate-test-binaries-gammaloop-integration-tests-b8cda0d438c96d4f-deps] Executing configureCargoCommonVars
10.08 s
[gammaloop-crate-test-binaries-gammaloop-integration-tests-b8cda0d438c96d4f-deps] copying cargo artifacts from /nix/store/548rf7h75y5ys59fazvil5ylvwiwvqka-gammaloop-crate-test-binaries-gammaloop-integration-tests-b8cda0d438c96d4f-inputs/target to target
10.08 s
[gammaloop-crate-test-binaries-gammaloop-integration-tests-b8cda0d438c96d4f-deps] will deep copy artifacts (instead of symlinking) as requested
22.81 s
[gammaloop-crate-test-binaries-gammaloop-integration-tests-b8cda0d438c96d4f-deps] Phase: updateAutotoolsGnuConfigScriptsPhase
22.86 s
[gammaloop-crate-test-binaries-gammaloop-integration-tests-b8cda0d438c96d4f-deps] Phase: configurePhase
22.87 s
[gammaloop-crate-test-binaries-gammaloop-integration-tests-b8cda0d438c96d4f-deps] will append /build/source/.cargo-home/config.toml with contents of /nix/store/5drf77x6km4ky7gwlrzdx9bbd6fz09g3-vendor-cargo-deps/config.toml
22.87 s
[gammaloop-crate-test-binaries-gammaloop-integration-tests-b8cda0d438c96d4f-deps] default configurePhase, nothing to do
22.87 s
[gammaloop-crate-test-binaries-gammaloop-integration-tests-b8cda0d438c96d4f-deps] Phase: buildPhase
22.88 s
[gammaloop-crate-test-binaries-gammaloop-integration-tests-b8cda0d438c96d4f-deps] +++ command cargo --version
22.89 s
[gammaloop-crate-test-binaries-gammaloop-integration-tests-b8cda0d438c96d4f-deps] cargo 1.97.0 (c980f4866 2026-06-30)
22.89 s
[gammaloop-crate-test-binaries-gammaloop-integration-tests-b8cda0d438c96d4f-deps] +++ command cargo test --profile ci-optim --no-run --offline -p gammaloop-integration-tests
24.93 s
[gammaloop-crate-test-binaries-gammaloop-integration-tests-b8cda0d438c96d4f-deps] Compiling gammaloop-integration-tests v0.1.0 (/build/source/tests)
29.10 s
[gammaloop-crate-test-binaries-gammaloop-integration-tests-b8cda0d438c96d4f-deps] error[E0609] : no field `lmb_channel_id` on type `CutInfo`
29.10 s
[gammaloop-crate-test-binaries-gammaloop-integration-tests-b8cda0d438c96d4f-deps] --> tests/tests/test_runs/utils.rs:568:36
29.10 s
[gammaloop-crate-test-binaries-gammaloop-integration-tests-b8cda0d438c96d4f-deps] |
29.10 s
[gammaloop-crate-test-binaries-gammaloop-integration-tests-b8cda0d438c96d4f-deps] 568 | event.cut_info.lmb_channel_id,
29.10 s
[gammaloop-crate-test-binaries-gammaloop-integration-tests-b8cda0d438c96d4f-deps] | ^^^^^^^^^^^^^^ unknown field
29.10 s
[gammaloop-crate-test-binaries-gammaloop-integration-tests-b8cda0d438c96d4f-deps] |
29.10 s
[gammaloop-crate-test-binaries-gammaloop-integration-tests-b8cda0d438c96d4f-deps] = note : available fields are: `particle_pdgs`, `cut_id`, `graph_id`, `graph_group_id`, `orientation_id` ... and 2 others
29.10 s
[gammaloop-crate-test-binaries-gammaloop-integration-tests-b8cda0d438c96d4f-deps]
29.15 s
[gammaloop-crate-test-binaries-gammaloop-integration-tests-b8cda0d438c96d4f-deps] error[E0609] : no field `lmb_channel_id` on type `CutInfo`
29.15 s
[gammaloop-crate-test-binaries-gammaloop-integration-tests-b8cda0d438c96d4f-deps] --> tests/tests/test_runs/utils.rs:580:36
29.15 s
[gammaloop-crate-test-binaries-gammaloop-integration-tests-b8cda0d438c96d4f-deps] |
29.15 s
[gammaloop-crate-test-binaries-gammaloop-integration-tests-b8cda0d438c96d4f-deps] 580 | event.cut_info.lmb_channel_id,
29.15 s
[gammaloop-crate-test-binaries-gammaloop-integration-tests-b8cda0d438c96d4f-deps] | ^^^^^^^^^^^^^^ unknown field
29.15 s
[gammaloop-crate-test-binaries-gammaloop-integration-tests-b8cda0d438c96d4f-deps] |
29.16 s
[gammaloop-crate-test-binaries-gammaloop-integration-tests-b8cda0d438c96d4f-deps] = note : available fields are: `particle_pdgs`, `cut_id`, `graph_id`, `graph_group_id`, `orientation_id` ... and 2 others
29.16 s
[gammaloop-crate-test-binaries-gammaloop-integration-tests-b8cda0d438c96d4f-deps]
30.15 s
[gammaloop-crate-test-binaries-gammaloop-integration-tests-b8cda0d438c96d4f-deps] For more information about this error, try `rustc --explain E0609`.
30.33 s
[gammaloop-crate-test-binaries-gammaloop-integration-tests-b8cda0d438c96d4f-deps] error : could not compile `gammaloop-integration-tests` (test "test_runs") due to 2 previous errors
30.33 s
[gammaloop-crate-test-binaries-gammaloop-integration-tests-b8cda0d438c96d4f-deps] warning : build failed, waiting for other jobs to finish...
94.93 s
Progress: 0 of 2 built (1 failed)
94.93 s
Failed to build gammaloop-crate-test-binaries-gammaloop-integration-tests-b8cda0d438c96d4f-deps after 1m26s
94.93 s
error: Cannot build '/nix/store/r56whqs3zj9clz5fj8bc4m0bwgy8zlg2-gammaloop-crate-test-binaries-gammaloop-integration-tests-b8cda0d438c96d4f-deps-0.1.0.drv '.
94.93 s
Reason: builder failed with exit code 101 .
94.93 s
Output paths:
94.93 s
/nix/store/p7igf7a2rhg1ma117x5c7x9xx66jxvwc-gammaloop-crate-test-binaries-gammaloop-integration-tests-b8cda0d438c96d4f-deps-0.1.0
94.93 s
Last 35 log lines:
94.93 s
> Running phase: unpackPhase
94.93 s
> unpacking source archive /nix/store/mihhxhg81q7j5z719niswnivgvyvfkc5-source
94.93 s
> source root is source
94.93 s
> Running phase: patchPhase
94.93 s
> Executing configureCargoCommonVars
94.93 s
> copying cargo artifacts from /nix/store/548rf7h75y5ys59fazvil5ylvwiwvqka-gammaloop-crate-test-binaries-gammaloop-integration-tests-b8cda0d438c96d4f-inputs/target to target
94.93 s
> will deep copy artifacts (instead of symlinking) as requested
94.93 s
> Running phase: updateAutotoolsGnuConfigScriptsPhase
94.93 s
> Running phase: configurePhase
94.93 s
> will append /build/source/.cargo-home/config.toml with contents of /nix/store/5drf77x6km4ky7gwlrzdx9bbd6fz09g3-vendor-cargo-deps/config.toml
94.93 s
> default configurePhase, nothing to do
94.93 s
> Running phase: buildPhase
94.93 s
> +++ command cargo --version
94.93 s
> cargo 1.97.0 (c980f4866 2026-06-30)
94.93 s
> +++ command cargo test --profile ci-optim --no-run --offline -p gammaloop-integration-tests
94.93 s
> Compiling gammaloop-integration-tests v0.1.0 (/build/source/tests)
94.93 s
> error[E0609] : no field `lmb_channel_id` on type `CutInfo`
94.93 s
> --> tests/tests/test_runs/utils.rs:568:36
94.93 s
> |
94.93 s
> 568 | event.cut_info.lmb_channel_id,
94.93 s
> | ^^^^^^^^^^^^^^ unknown field
94.93 s
> |
94.93 s
> = note : available fields are: `particle_pdgs`, `cut_id`, `graph_id`, `graph_group_id`, `orientation_id` ... and 2 others
94.93 s
>
94.93 s
> error[E0609] : no field `lmb_channel_id` on type `CutInfo`
94.93 s
> --> tests/tests/test_runs/utils.rs:580:36
94.93 s
> |
94.93 s
> 580 | event.cut_info.lmb_channel_id,
94.93 s
> | ^^^^^^^^^^^^^^ unknown field
94.93 s
> |
94.93 s
> = note : available fields are: `particle_pdgs`, `cut_id`, `graph_id`, `graph_group_id`, `orientation_id` ... and 2 others
94.93 s
>
94.93 s
> For more information about this error, try `rustc --explain E0609`.
94.93 s
> error : could not compile `gammaloop-integration-tests` (test "test_runs") due to 2 previous errors
94.93 s
> warning : build failed, waiting for other jobs to finish...
94.93 s
For full logs, run:
94.93 s
nix log /nix/store/r56whqs3zj9clz5fj8bc4m0bwgy8zlg2-gammaloop-crate-test-binaries-gammaloop-integration-tests-b8cda0d438c96d4f-deps-0.1.0.drv
94.93 s
error: Cannot build '/nix/store/ggac0br4kz2da22hnrlvqq35i99ny5xp-nix-ci-artifact-barrier-crate-test-binaries-gammaloop-integration-tests.drv '.
94.93 s
Reason: 1 dependency failed .
94.93 s
Output paths:
94.93 s
/nix/store/ngkg2ip6sz1zgfppcl7ssv5imscng70q-nix-ci-artifact-barrier-crate-test-binaries-gammaloop-integration-tests
94.94 s
Build failed due to failed dependency
94.98 s
Build failed.