1. 0.00 s $ /nix/store/9ypz3flqsrl5xl495mm8h645gadjsxi1-coreutils-9.11/bin/timeout --kill-after=15s 7200s /nix/store/23zk8sgzamrbmj1fday15szf7f2279s8-nix-2.34.7/bin/nix --extra-experimental-features nix-command --extra-experimental-features flakes --log-format internal-json build --no-link --print-out-paths git+https://github.com/alphal00p/gammaloop?ref=advanced_sampling&rev=ad713af8ba0173320df0aef4e53935ec4cf8a238&shallow=1#checks.x86_64-linux.gammaloop-check --print-build-logs
  2. 1.93 s
  3. 2.41 s Building /nix/store/2f1j2lkyg12g36flfbgvv1q9204gpqa0-gammaloop-workspace-check-0.1.0.drv
  4. 2.48 s [gammaloop-workspace-check] Phase: unpackPhase
  5. 2.48 s [gammaloop-workspace-check] unpacking source archive /nix/store/s2z31bfagqssyfp9l6l2s0lp69bdgr0x-source
  6. 2.63 s [gammaloop-workspace-check] source root is source
  7. 2.66 s [gammaloop-workspace-check] Phase: patchPhase
  8. 2.66 s [gammaloop-workspace-check] Executing configureCargoCommonVars
  9. 2.66 s [gammaloop-workspace-check] decompressing cargo artifacts from /nix/store/50vpxlcgfxf2d57i27v3d10zjwxxbm2r-gammaloop-workspace-deps-deps-0.1.0/target.tar.zst to target
  10. 4.10 s [gammaloop-workspace-check] Phase: updateAutotoolsGnuConfigScriptsPhase
  11. 4.14 s [gammaloop-workspace-check] Phase: configurePhase
  12. 4.15 s [gammaloop-workspace-check] will append /build/source/.cargo-home/config.toml with contents of /nix/store/5drf77x6km4ky7gwlrzdx9bbd6fz09g3-vendor-cargo-deps/config.toml
  13. 4.15 s [gammaloop-workspace-check] default configurePhase, nothing to do
  14. 4.15 s [gammaloop-workspace-check] Phase: buildPhase
  15. 4.15 s [gammaloop-workspace-check] +++ command cargo --version
  16. 4.16 s [gammaloop-workspace-check] cargo 1.97.0 (c980f4866 2026-06-30)
  17. 4.18 s [gammaloop-workspace-check] +++ command cargo check --profile ci-optim --locked --workspace --features gammaloop-tracing-filter/clap,gammaloop-tracing-filter/symbolica,idenso/bincode,idenso/reference-cases,linnet/bincode,linnet/drawing,linnet/rkyv,linnet/serde,linnet/symbolica,spenso-macros/shadowing,spenso/shadowing,symbolica/tracing_max_level_info,three-dimensional-reps/display,three-dimensional-reps/eval,three-dimensional-reps/serde --all-targets
  18. 4.78 s [gammaloop-workspace-check] Checking cfg-if v1.0.4
  19. 4.78 s [gammaloop-workspace-check] Checking memchr v2.8.0
  20. 4.78 s [gammaloop-workspace-check] Checking once_cell v1.21.4
  21. 4.79 s [gammaloop-workspace-check] Checking either v1.15.0
  22. 4.80 s [gammaloop-workspace-check] Checking serde_core v1.0.228
  23. 4.80 s [gammaloop-workspace-check] Checking libc v0.2.186
  24. 4.80 s [gammaloop-workspace-check] Checking libm v0.2.16
  25. 4.81 s [gammaloop-workspace-check] Checking itoa v1.0.18
  26. 4.81 s [gammaloop-workspace-check] Checking log v0.4.29
  27. 4.81 s [gammaloop-workspace-check] Checking regex-syntax v0.8.10
  28. 4.82 s [gammaloop-workspace-check] Checking zerocopy v0.8.48
  29. 4.84 s [gammaloop-workspace-check] Checking crossbeam-utils v0.8.21
  30. 4.84 s [gammaloop-workspace-check] Checking equivalent v1.0.2
  31. 4.85 s [gammaloop-workspace-check] Checking zmij v1.0.21
  32. 4.86 s [gammaloop-workspace-check] Checking lazy_static v1.5.0
  33. 4.86 s [gammaloop-workspace-check] Checking bytemuck v1.25.0
  34. 4.86 s [gammaloop-workspace-check] Compiling target-lexicon v0.13.5
  35. 4.91 s [gammaloop-workspace-check] Checking arrayvec v0.7.6
  36. 4.91 s [gammaloop-workspace-check] Checking powerfmt v0.2.0
  37. 4.94 s [gammaloop-workspace-check] Checking num-conv v0.2.1
  38. 4.97 s [gammaloop-workspace-check] Checking num_threads v0.1.7
  39. 5.01 s [gammaloop-workspace-check] Checking itertools v0.14.0
  40. 5.04 s [gammaloop-workspace-check] Checking time-core v0.1.8
  41. 5.08 s [gammaloop-workspace-check] Checking pin-project-lite v0.2.17
  42. 5.08 s [gammaloop-workspace-check] Checking tracing-core v0.1.36
  43. 5.10 s [gammaloop-workspace-check] Checking safe_arch v0.7.4
  44. 5.10 s [gammaloop-workspace-check] Checking allocator-api2 v0.2.21
  45. 5.12 s [gammaloop-workspace-check] Checking deranged v0.5.8
  46. 5.12 s [gammaloop-workspace-check] Checking foldhash v0.2.0
  47. 5.16 s [gammaloop-workspace-check] Checking const-random v0.1.18
  48. 5.17 s [gammaloop-workspace-check] Checking aho-corasick v1.1.4
  49. 5.21 s [gammaloop-workspace-check] Checking nu-ansi-term v0.50.3
  50. 5.25 s [gammaloop-workspace-check] Checking static_assertions v1.1.0
  51. 5.25 s [gammaloop-workspace-check] Checking winnow v1.0.2
  52. 5.30 s [gammaloop-workspace-check] Checking unty v0.0.4
  53. 5.35 s [gammaloop-workspace-check] Checking safe_arch v1.0.0
  54. 5.44 s [gammaloop-workspace-check] Checking crossbeam-epoch v0.9.18
  55. 5.47 s [gammaloop-workspace-check] Checking sharded-slab v0.1.7
  56. 5.52 s [gammaloop-workspace-check] Checking tracing v0.1.44
  57. 5.58 s [gammaloop-workspace-check] Checking hashbrown v0.16.1
  58. 5.59 s [gammaloop-workspace-check] Checking crossbeam-deque v0.8.6
  59. 5.61 s [gammaloop-workspace-check] Checking wide v0.7.33
  60. 5.69 s [gammaloop-workspace-check] Checking rayon-core v1.13.0
  61. 5.72 s [gammaloop-workspace-check] Checking tracing-log v0.2.0
  62. 5.84 s [gammaloop-workspace-check] Checking thread_local v1.1.9
  63. 6.01 s [gammaloop-workspace-check] Checking toml_writer v1.1.1+spec-1.1.0
  64. 6.09 s [gammaloop-workspace-check] Checking indenter v0.3.4
  65. 6.13 s [gammaloop-workspace-check] Checking num-traits v0.2.19
  66. 6.17 s [gammaloop-workspace-check] Checking az v1.3.0
  67. 6.22 s [gammaloop-workspace-check] Checking wide v1.3.0
  68. 6.31 s [gammaloop-workspace-check] Compiling phf_shared v0.11.3
  69. 6.38 s [gammaloop-workspace-check] Checking toml_parser v1.1.2+spec-1.1.0
  70. 6.41 s [gammaloop-workspace-check] Checking rayon v1.12.0
  71. 6.53 s [gammaloop-workspace-check] Checking anyhow v1.0.102
  72. 6.63 s [gammaloop-workspace-check] Checking alloc-no-stdlib v2.0.4
  73. 6.64 s [gammaloop-workspace-check] Checking dyn-clone v1.0.20
  74. 6.70 s [gammaloop-workspace-check] Checking getrandom v0.3.4
  75. 6.71 s [gammaloop-workspace-check] Checking gmp-mpfr-sys v1.7.1
  76. 6.75 s [gammaloop-workspace-check] Checking approx v0.5.1
  77. 6.81 s [gammaloop-workspace-check] Checking num-integer v0.1.46
  78. 6.88 s [gammaloop-workspace-check] Checking rawpointer v0.2.1
  79. 6.89 s [gammaloop-workspace-check] Checking utf8parse v0.2.2
  80. 6.89 s [gammaloop-workspace-check] Checking alloc-stdlib v0.2.2
  81. 6.91 s [gammaloop-workspace-check] Checking anstyle v1.0.14
  82. 6.94 s [gammaloop-workspace-check] Checking matrixmultiply v0.3.10
  83. 6.96 s [gammaloop-workspace-check] Checking anstyle-parse v1.0.0
  84. 7.01 s [gammaloop-workspace-check] Checking colored v3.1.1
  85. 7.18 s [gammaloop-workspace-check] Checking anstyle-query v1.1.5
  86. 7.20 s [gammaloop-workspace-check] Checking rand_core v0.9.5
  87. 7.22 s [gammaloop-workspace-check] Checking is_terminal_polyfill v1.70.2
  88. 7.24 s [gammaloop-workspace-check] Compiling pyo3-build-config v0.28.3
  89. 7.26 s [gammaloop-workspace-check] Checking colorchoice v1.0.5
  90. 7.26 s [gammaloop-workspace-check] Compiling phf_generator v0.11.3
  91. 7.26 s [gammaloop-workspace-check] Checking eyre v0.6.12
  92. 7.31 s [gammaloop-workspace-check] Checking bitflags v1.3.2
  93. 7.31 s [gammaloop-workspace-check] Checking unicode-width v0.2.2
  94. 7.35 s [gammaloop-workspace-check] Checking brotli-decompressor v5.0.0
  95. 7.37 s [gammaloop-workspace-check] Checking region v3.0.2
  96. 7.40 s [gammaloop-workspace-check] Checking time v0.3.47
  97. 7.41 s [gammaloop-workspace-check] Compiling phf_codegen v0.11.3
  98. 7.48 s [gammaloop-workspace-check] Checking serde v1.0.228
  99. 7.49 s [gammaloop-workspace-check] Checking serde_json v1.0.149
  100. 7.53 s [gammaloop-workspace-check] Checking bitflags v2.11.1
  101. 7.56 s [gammaloop-workspace-check] Checking serde_spanned v1.1.1
  102. 7.63 s [gammaloop-workspace-check] Checking toml_datetime v1.1.1+spec-1.1.0
  103. 7.66 s [gammaloop-workspace-check] Checking regex-automata v0.4.14
  104. 7.69 s [gammaloop-workspace-check] Checking anstream v1.0.0
  105. 7.69 s [gammaloop-workspace-check] Checking wasmtime-jit-icache-coherence v34.0.2
  106. 7.73 s [gammaloop-workspace-check] Checking hugepage-rs v0.1.1
  107. 7.76 s [gammaloop-workspace-check] Checking spec_math v0.1.6
  108. 7.85 s [gammaloop-workspace-check] Checking inventory v0.3.24
  109. 7.86 s [gammaloop-workspace-check] Checking thiserror v2.0.18
  110. 7.89 s [gammaloop-workspace-check] Checking toml v1.1.2+spec-1.1.0
  111. 7.92 s [gammaloop-workspace-check] Compiling getopts v0.2.24
  112. 7.94 s [gammaloop-workspace-check] Checking libloading v0.9.0
  113. 7.95 s [gammaloop-workspace-check] Checking self_cell v1.2.2
  114. 7.97 s [gammaloop-workspace-check] Checking bytes v1.11.1
  115. 7.98 s [gammaloop-workspace-check] Checking tinyjson v2.5.1
  116. 8.05 s [gammaloop-workspace-check] Checking append-only-vec v0.1.8
  117. 8.11 s [gammaloop-workspace-check] Checking byteorder v1.5.0
  118. 8.14 s [gammaloop-workspace-check] Compiling unic-common v0.9.0
  119. 8.16 s [gammaloop-workspace-check] Checking smallvec v1.15.1
  120. 8.16 s [gammaloop-workspace-check] Checking num-complex v0.4.6
  121. 8.27 s [gammaloop-workspace-check] Checking tracing-serde v0.2.0
  122. 8.53 s [gammaloop-workspace-check] Checking bincode v2.0.1
  123. 8.63 s [gammaloop-workspace-check] Checking brotli v8.0.2
  124. 8.68 s [gammaloop-workspace-check] Checking simba v0.9.1
  125. 8.73 s [gammaloop-workspace-check] Checking smartstring v1.0.1
  126. 8.81 s [gammaloop-workspace-check] Compiling unicode_names2_generator v1.3.0
  127. 8.82 s [gammaloop-workspace-check] Compiling unic-char-range v0.9.0
  128. 8.86 s [gammaloop-workspace-check] Checking linux-raw-sys v0.12.1
  129. 8.88 s [gammaloop-workspace-check] Compiling unic-ucd-version v0.9.0
  130. 8.98 s [gammaloop-workspace-check] Compiling is-macro v0.3.7
  131. 9.03 s [gammaloop-workspace-check] Compiling rustpython-parser-vendored v0.4.0
  132. 9.16 s [gammaloop-workspace-check] Compiling unic-char-property v0.9.0
  133. 9.18 s [gammaloop-workspace-check] Checking iana-time-zone v0.1.65
  134. 9.21 s [gammaloop-workspace-check] Compiling rustpython-parser v0.4.0
  135. 9.29 s [gammaloop-workspace-check] Compiling phf v0.11.3
  136. 9.37 s [gammaloop-workspace-check] Checking chrono v0.4.44
  137. 9.49 s [gammaloop-workspace-check] Checking rustix v1.1.4
  138. 9.65 s [gammaloop-workspace-check] Checking rustc-hash v2.1.2
  139. 9.67 s [gammaloop-workspace-check] Compiling unic-ucd-ident v0.9.0
  140. 9.75 s [gammaloop-workspace-check] Compiling unic-emoji-char v0.9.0
  141. 9.80 s [gammaloop-workspace-check] Checking ndarray v0.17.2
  142. 9.86 s [gammaloop-workspace-check] Compiling lalrpop-util v0.20.2
  143. 9.89 s [gammaloop-workspace-check] Compiling rustc-hash v1.1.0
  144. 10.00 s [gammaloop-workspace-check] Checking rug v1.30.0
  145. 10.06 s [gammaloop-workspace-check] Compiling symbolica v2.2.0 (https://github.com/alphal00p/symbolica?rev=a277a8dadbaae5a8d6605f2f381991a601e1f345#a277a8da)
  146. 10.06 s [gammaloop-workspace-check] Checking unicode-segmentation v1.13.2
  147. 10.13 s [gammaloop-workspace-check] Checking typenum v1.20.0
  148. 10.48 s [gammaloop-workspace-check] Checking getrandom v0.2.17
  149. 10.59 s [gammaloop-workspace-check] Checking scopeguard v1.2.0
  150. 10.67 s [gammaloop-workspace-check] Checking lock_api v0.4.14
  151. 10.80 s [gammaloop-workspace-check] Checking parking_lot_core v0.9.12
  152. 10.81 s [gammaloop-workspace-check] Checking hashbrown v0.17.0
  153. 10.90 s [gammaloop-workspace-check] Checking unicode-ident v1.0.24
  154. 11.07 s [gammaloop-workspace-check] Checking generic-array v0.14.7
  155. 11.09 s [gammaloop-workspace-check] Checking errno v0.3.14
  156. 11.21 s [gammaloop-workspace-check] Checking parking_lot v0.12.5
  157. 11.23 s [gammaloop-workspace-check] Checking clap_lex v1.1.0
  158. 11.40 s [gammaloop-workspace-check] Checking unicase v2.9.0
  159. 11.44 s [gammaloop-workspace-check] Checking strsim v0.11.1
  160. 11.52 s [gammaloop-workspace-check] Checking signal-hook-registry v1.4.8
  161. 11.60 s [gammaloop-workspace-check] Checking vte v0.14.1
  162. 11.65 s [gammaloop-workspace-check] Checking same-file v1.0.6
  163. 11.71 s [gammaloop-workspace-check] Checking indexmap v2.14.0
  164. 11.81 s [gammaloop-workspace-check] Checking walkdir v2.5.0
  165. 11.82 s [gammaloop-workspace-check] Checking block-buffer v0.10.4
  166. 11.90 s [gammaloop-workspace-check] Checking crypto-common v0.1.7
  167. 11.91 s [gammaloop-workspace-check] Checking terminal_size v0.4.4
  168. 11.98 s [gammaloop-workspace-check] Checking clap_builder v4.6.0
  169. 11.98 s [gammaloop-workspace-check] Checking mio v1.2.0
  170. 12.00 s [gammaloop-workspace-check] Checking ciborium-io v0.2.2
  171. 12.05 s [gammaloop-workspace-check] Checking signal-hook v0.3.18
  172. 12.06 s [gammaloop-workspace-check] Checking minimal-lexical v0.2.1
  173. 12.17 s [gammaloop-workspace-check] Checking digest v0.10.7
  174. 12.27 s [gammaloop-workspace-check] Checking derive_more v2.1.1
  175. 12.31 s [gammaloop-workspace-check] Checking signal-hook-mio v0.2.5
  176. 12.41 s [gammaloop-workspace-check] Checking num-bigint v0.4.6
  177. 12.42 s [gammaloop-workspace-check] Checking console v0.16.3
  178. 12.43 s [gammaloop-workspace-check] Checking bstr v1.12.1
  179. 12.43 s [gammaloop-workspace-check] Checking nom v7.1.3
  180. 12.49 s [gammaloop-workspace-check] Checking ppv-lite86 v0.2.21
  181. 12.72 s [gammaloop-workspace-check] Checking ahash v0.8.12
  182. 12.82 s [gammaloop-workspace-check] Checking half v2.7.1
  183. 12.88 s [gammaloop-workspace-check] Checking linux-raw-sys v0.4.15
  184. 12.93 s [gammaloop-workspace-check] Checking cpufeatures v0.2.17
  185. 12.99 s [gammaloop-workspace-check] Checking winnow v0.7.15
  186. 13.12 s [gammaloop-workspace-check] Checking ciborium-ll v0.2.2
  187. 13.15 s [gammaloop-workspace-check] Checking rand_chacha v0.9.0
  188. 13.46 s [gammaloop-workspace-check] Checking ciborium v0.2.2
  189. 13.47 s [gammaloop-workspace-check] Checking rustix v0.38.44
  190. 13.67 s [gammaloop-workspace-check] Checking rand v0.9.4
  191. 13.67 s [gammaloop-workspace-check] Checking matchers v0.2.0
  192. 13.77 s [gammaloop-workspace-check] Checking tracing-subscriber v0.3.23
  193. 14.05 s [gammaloop-workspace-check] Checking regex v1.12.3
  194. 14.31 s [gammaloop-workspace-check] Checking globset v0.4.18
  195. 14.31 s [gammaloop-workspace-check] Checking sha2 v0.10.9
  196. 14.37 s [gammaloop-workspace-check] Checking symjit v2.21.0
  197. 14.45 s [gammaloop-workspace-check] Checking rand_core v0.6.4
  198. 14.53 s [gammaloop-workspace-check] Checking getrandom v0.4.2
  199. 14.53 s [gammaloop-workspace-check] Checking fastrand v2.4.1
  200. 14.60 s [gammaloop-workspace-check] Checking fnv v1.0.7
  201. 14.65 s [gammaloop-workspace-check] Checking plotters-backend v0.3.7
  202. 14.65 s [gammaloop-workspace-check] Checking crossterm v0.28.1
  203. 14.65 s [gammaloop-workspace-check] Compiling unicode_names2 v1.3.0
  204. 14.73 s [gammaloop-workspace-check] Checking tempfile v3.27.0
  205. 14.86 s [gammaloop-workspace-check] Checking rust-embed-utils v8.11.0
  206. 15.06 s [gammaloop-workspace-check] Checking serde_spanned v0.6.9
  207. 15.20 s [gammaloop-workspace-check] Checking toml_datetime v0.6.11
  208. 15.22 s [gammaloop-workspace-check] Checking xprec v0.2.2
  209. 15.22 s [gammaloop-workspace-check] Checking itertools v0.10.5
  210. 15.24 s [gammaloop-workspace-check] Checking tap v1.0.1
  211. 15.30 s [gammaloop-workspace-check] Checking plotters-svg v0.3.7
  212. 15.31 s [gammaloop-workspace-check] Checking toml_write v0.1.2
  213. 15.32 s [gammaloop-workspace-check] Checking clap v4.6.1
  214. 15.40 s [gammaloop-workspace-check] Checking cast v0.3.0
  215. 15.43 s [gammaloop-workspace-check] Checking wyz v0.5.1
  216. 15.46 s [gammaloop-workspace-check] Checking toml_edit v0.22.27
  217. 15.48 s [gammaloop-workspace-check] Checking rand_chacha v0.3.1
  218. 15.50 s [gammaloop-workspace-check] Checking ansitok v0.3.0
  219. 15.51 s [gammaloop-workspace-check] Checking plotters v0.3.7
  220. 15.54 s [gammaloop-workspace-check] Checking radium v0.7.0
  221. 15.57 s [gammaloop-workspace-check] Checking typeid v1.0.3
  222. 15.63 s [gammaloop-workspace-check] Checking similar v2.7.0
  223. 15.69 s [gammaloop-workspace-check] Checking tinytemplate v1.2.1
  224. 15.73 s [gammaloop-workspace-check] Checking is-terminal v0.4.17
  225. 15.79 s [gammaloop-workspace-check] Checking bytecount v0.6.9
  226. 15.80 s [gammaloop-workspace-check] Checking anes v0.1.6
  227. 15.85 s [gammaloop-workspace-check] Checking funty v2.0.0
  228. 15.92 s [gammaloop-workspace-check] Checking oorandom v11.1.5
  229. 16.00 s [gammaloop-workspace-check] Checking rand v0.8.6
  230. 16.05 s [gammaloop-workspace-check] Checking ansi-str v0.9.0
  231. 16.08 s [gammaloop-workspace-check] Checking testing_table v0.3.0
  232. 16.13 s [gammaloop-workspace-check] Checking ron v0.12.1
  233. 16.39 s [gammaloop-workspace-check] Checking bitvec v1.0.1
  234. 16.43 s [gammaloop-workspace-check] Checking papergrid v0.17.0
  235. 16.44 s [gammaloop-workspace-check] Checking env_filter v1.0.1
  236. 16.54 s [gammaloop-workspace-check] Checking toml_edit v0.25.11+spec-1.1.0
  237. 16.69 s [gammaloop-workspace-check] Checking uncased v0.9.10
  238. 16.80 s [gammaloop-workspace-check] Checking jiff v0.2.24
  239. 17.14 s [gammaloop-workspace-check] Checking ptr_meta v0.1.4
  240. 17.17 s [gammaloop-workspace-check] Checking ucd-trie v0.1.7
  241. 17.21 s [gammaloop-workspace-check] Checking simdutf8 v0.1.5
  242. 17.30 s [gammaloop-workspace-check] Checking tabled v0.20.0
  243. 17.32 s [gammaloop-workspace-check] Checking pest v2.8.6
  244. 17.33 s [gammaloop-workspace-check] Checking bytecheck v0.6.12
  245. 17.44 s [gammaloop-workspace-check] Checking ahash v0.7.8
  246. 17.56 s [gammaloop-workspace-check] Checking insta v1.47.2
  247. 17.59 s [gammaloop-workspace-check] Checking hashbrown v0.12.3
  248. 17.75 s [gammaloop-workspace-check] Checking approx v0.4.0
  249. 17.85 s [gammaloop-workspace-check] Checking seahash v4.1.0
  250. 17.91 s [gammaloop-workspace-check] Checking rend v0.4.2
  251. 18.05 s [gammaloop-workspace-check] Checking cgmath v0.18.0
  252. 18.31 s [gammaloop-workspace-check] Checking num-rational v0.4.2
  253. 18.38 s [gammaloop-workspace-check] Checking num-iter v0.1.45
  254. 18.47 s [gammaloop-workspace-check] Checking ref-ops v0.2.5
  255. 18.49 s [gammaloop-workspace-check] Checking criterion-plot v0.5.0
  256. 18.64 s [gammaloop-workspace-check] Checking rand_xoshiro v0.6.0
  257. 18.68 s [gammaloop-workspace-check] Checking dot-parser v0.5.1
  258. 18.69 s [gammaloop-workspace-check] Checking num v0.4.3
  259. 18.74 s [gammaloop-workspace-check] Checking features v0.10.0
  260. 18.80 s [gammaloop-workspace-check] Checking constcat v0.5.1
  261. 18.81 s [gammaloop-workspace-check] Checking gat-lending-iterator v0.1.8
  262. 18.84 s [gammaloop-workspace-check] Checking criterion v0.5.1
  263. 18.85 s [gammaloop-workspace-check] Checking colored v2.2.0
  264. 18.91 s [gammaloop-workspace-check] Checking constant_time_eq v0.4.2
  265. 18.97 s [gammaloop-workspace-check] Checking cpufeatures v0.3.0
  266. 18.99 s [gammaloop-workspace-check] Checking toml v0.8.23
  267. 18.99 s [gammaloop-workspace-check] Checking arrayref v0.3.9
  268. 18.99 s [gammaloop-workspace-check] Compiling pyo3-ffi v0.28.3
  269. 19.02 s [gammaloop-workspace-check] Compiling pyo3-macros-backend v0.28.3
  270. 19.05 s [gammaloop-workspace-check] Compiling pyo3 v0.28.3
  271. 19.06 s [gammaloop-workspace-check] Compiling numpy v0.28.0
  272. 19.07 s [gammaloop-workspace-check] Checking blake3 v1.8.5
  273. 19.17 s [gammaloop-workspace-check] Checking base64 v0.22.1
  274. 19.47 s [gammaloop-workspace-check] Checking siphasher v1.0.2
  275. 19.48 s [gammaloop-workspace-check] Checking joinery v2.1.0
  276. 19.48 s [gammaloop-workspace-check] Checking subprocess v0.2.15
  277. 19.51 s [gammaloop-workspace-check] Checking rust_lisp v0.18.0
  278. 19.53 s [gammaloop-workspace-check] Compiling vakint v0.1.2 (/build/source/crates/vakint)
  279. 19.70 s [gammaloop-workspace-check] Checking titlecase v2.2.1
  280. 19.71 s [gammaloop-workspace-check] Checking phf_shared v0.13.1
  281. 19.76 s [gammaloop-workspace-check] Checking figment v0.10.19
  282. 19.82 s [gammaloop-workspace-check] Checking version-compare v0.2.1
  283. 19.84 s [gammaloop-workspace-check] Checking xpct v0.5.1
  284. 19.84 s [gammaloop-workspace-check] Checking ryu v1.0.23
  285. 19.94 s [gammaloop-workspace-check] Checking castaway v0.2.4
  286. 19.98 s [gammaloop-workspace-check] Checking toml_datetime v0.7.5+spec-1.1.0
  287. 20.00 s [gammaloop-workspace-check] Checking strum v0.27.2
  288. 20.07 s [gammaloop-workspace-check] Checking compact_str v0.9.0
  289. 20.12 s [gammaloop-workspace-check] Checking phf v0.13.1
  290. 20.13 s [gammaloop-workspace-check] Checking unicode-truncate v2.0.1
  291. 20.20 s [gammaloop-workspace-check] Checking kasuari v0.4.12
  292. 20.23 s [gammaloop-workspace-check] Checking lru v0.16.4
  293. 20.26 s [gammaloop-workspace-check] Checking toml v0.9.12+spec-1.1.0
  294. 20.31 s [gammaloop-workspace-check] Checking vte v0.15.0
  295. 20.39 s [gammaloop-workspace-check] Checking vt100 v0.16.2
  296. 20.41 s [gammaloop-workspace-check] Checking portable-atomic v1.13.1
  297. 20.52 s [gammaloop-workspace-check] Checking string-template-plus v0.4.3
  298. 20.68 s [gammaloop-workspace-check] Checking unit-prefix v0.5.2
  299. 20.72 s [gammaloop-workspace-check] Checking rand_distr v0.4.3
  300. 20.74 s [gammaloop-workspace-check] Checking simba v0.6.0
  301. 20.98 s [gammaloop-workspace-check] Checking ratatui-core v0.1.0
  302. 21.01 s [gammaloop-workspace-check] Checking indicatif v0.18.4
  303. 21.11 s [gammaloop-workspace-check] Checking line-clipping v0.3.7
  304. 21.21 s [gammaloop-workspace-check] Checking gimli v0.32.3
  305. 21.28 s [gammaloop-workspace-check] Checking adler2 v2.0.1
  306. 21.34 s [gammaloop-workspace-check] Compiling three-dimensional-reps v0.1.0 (/build/source/crates/three-dimensional-reps)
  307. 21.37 s [gammaloop-workspace-check] Checking miniz_oxide v0.8.9
  308. 21.40 s [gammaloop-workspace-check] Checking thiserror v1.0.69
  309. 21.54 s [gammaloop-workspace-check] Checking derive_builder v0.11.2
  310. 21.58 s [gammaloop-workspace-check] Checking crossterm v0.29.0
  311. 21.59 s [gammaloop-workspace-check] Checking env_logger v0.11.10
  312. 21.64 s [gammaloop-workspace-check] Checking object v0.37.3
  313. 21.64 s [gammaloop-workspace-check] Checking owo-colors v4.3.0
  314. 21.77 s [gammaloop-workspace-check] Checking tracing-error v0.2.1
  315. 21.87 s [gammaloop-workspace-check] Checking typed-index-collections v3.5.0
  316. 21.88 s [gammaloop-workspace-check] Checking serde-big-array v0.5.1
  317. 21.89 s [gammaloop-workspace-check] Checking amd v0.2.2
  318. 21.96 s [gammaloop-workspace-check] Checking itertools v0.11.0
  319. 22.00 s [gammaloop-workspace-check] Compiling gammaloop-tracing-filter-macros v0.1.0 (/build/source/crates/gammaloop-tracing-filter-macros)
  320. 22.12 s [gammaloop-workspace-check] Checking rustc-demangle v0.1.27
  321. 22.18 s [gammaloop-workspace-check] Checking option-ext v0.2.0
  322. 22.23 s [gammaloop-workspace-check] Checking ref-cast v1.0.25
  323. 22.25 s [gammaloop-workspace-check] Checking dirs-sys v0.5.0
  324. 22.29 s [gammaloop-workspace-check] Checking nix v0.31.2
  325. 22.33 s [gammaloop-workspace-check] Checking brotli-decompressor v4.0.3
  326. 22.36 s [gammaloop-workspace-check] Checking integer-sqrt v0.1.5
  327. 22.43 s [gammaloop-workspace-check] Checking crossbeam-channel v0.5.15
  328. 22.44 s [gammaloop-workspace-check] Checking itertools v0.12.1
  329. 22.49 s [gammaloop-workspace-check] Checking symlink v0.1.0
  330. 22.54 s [gammaloop-workspace-check] Checking unsafe-libyaml v0.2.11
  331. 22.58 s [gammaloop-workspace-check] Compiling rustpython-parser-core v0.4.0
  332. 22.63 s [gammaloop-workspace-check] Checking color-spantrace v0.3.0
  333. 22.68 s [gammaloop-workspace-check] Checking ratatui-widgets v0.3.0
  334. 22.73 s [gammaloop-workspace-check] Checking ratatui-crossterm v0.1.0
  335. 22.83 s [gammaloop-workspace-check] Compiling rustpython-ast v0.4.0
  336. 22.87 s [gammaloop-workspace-check] Compiling gammalooprs v0.3.4 (/build/source/crates/gammalooprs)
  337. 22.98 s [gammaloop-workspace-check] Checking tracing-appender v0.2.5
  338. 23.00 s [gammaloop-workspace-check] Checking clarabel v0.11.1
  339. 23.05 s [gammaloop-workspace-check] Checking include_dir v0.7.4
  340. 23.13 s [gammaloop-workspace-check] Checking pathfinding v4.15.0
  341. 23.22 s [gammaloop-workspace-check] Checking rkyv v0.7.46
  342. 23.24 s [gammaloop-workspace-check] Checking dirs v6.0.0
  343. 23.29 s [gammaloop-workspace-check] Checking ctrlc v3.5.2
  344. 23.30 s [gammaloop-workspace-check] Checking schemars v1.2.1
  345. 23.33 s [gammaloop-workspace-check] Checking slotmap v1.1.1
  346. 23.41 s [gammaloop-workspace-check] Checking tracing-indicatif v0.3.14
  347. 23.49 s [gammaloop-workspace-check] Checking serde_yaml v0.9.34+deprecated
  348. 23.64 s [gammaloop-workspace-check] Checking brotli v7.0.0
  349. 23.69 s [gammaloop-workspace-check] Checking json5 v0.4.1
  350. 23.86 s [gammaloop-workspace-check] Checking vectorize v0.2.0
  351. 23.96 s [gammaloop-workspace-check] Checking ringbuffer v0.16.0
  352. 24.16 s [gammaloop-workspace-check] Checking base62 v2.2.4
  353. 24.27 s [gammaloop-workspace-check] Checking ratatui-macros v0.7.0
  354. 24.29 s [gammaloop-workspace-check] Checking rust-embed v8.11.0
  355. 24.34 s [gammaloop-workspace-check] Checking ratatui v0.30.0
  356. 24.37 s [gammaloop-workspace-check] Checking clap_complete v4.6.3
  357. 24.38 s [gammaloop-workspace-check] Checking fd-lock v4.0.4
  358. 24.39 s [gammaloop-workspace-check] Checking strip-ansi-escapes v0.2.1
  359. 24.43 s [gammaloop-workspace-check] Compiling gammaloop-api v0.1.0 (/build/source/crates/gammaloop-api)
  360. 24.46 s [gammaloop-workspace-check] Checking itertools v0.13.0
  361. 24.50 s [gammaloop-workspace-check] Checking strum v0.26.3
  362. 24.57 s [gammaloop-workspace-check] Checking sysinfo v0.33.1
  363. 24.66 s [gammaloop-workspace-check] Checking shlex v1.3.0
  364. 24.86 s [gammaloop-workspace-check] Checking futures-task v0.3.32
  365. 24.94 s [gammaloop-workspace-check] Checking slab v0.4.12
  366. 25.02 s [gammaloop-workspace-check] Checking clap_complete_nushell v4.6.0
  367. 25.04 s [gammaloop-workspace-check] Checking futures-core v0.3.32
  368. 25.08 s [gammaloop-workspace-check] Checking addr2line v0.25.1
  369. 25.10 s [gammaloop-workspace-check] Checking sdd v3.0.10
  370. 25.16 s [gammaloop-workspace-check] Checking futures-util v0.3.32
  371. 25.19 s [gammaloop-workspace-check] Compiling gammaloop-integration-tests v0.1.0 (/build/source/tests)
  372. 25.25 s [gammaloop-workspace-check] Compiling test-log-core v0.2.20
  373. 25.28 s [gammaloop-workspace-check] Checking scc v2.4.0
  374. 25.44 s [gammaloop-workspace-check] Compiling rustc_version v0.4.1
  375. 25.60 s [gammaloop-workspace-check] Checking which v8.0.2
  376. 25.75 s [gammaloop-workspace-check] Checking bincode v1.3.3
  377. 25.84 s [gammaloop-workspace-check] Compiling gungraun-runner v0.18.2
  378. 26.28 s [gammaloop-workspace-check] Checking proc-macro2 v1.0.106
  379. 26.42 s [gammaloop-workspace-check] Checking reedline v0.42.0
  380. 26.62 s [gammaloop-workspace-check] Compiling gungraun-macros v0.8.0
  381. 26.83 s [gammaloop-workspace-check] Checking quote v1.0.45
  382. 26.93 s [gammaloop-workspace-check] Checking backtrace v0.3.76
  383. 26.97 s [gammaloop-workspace-check] Checking base64 v0.21.7
  384. 26.98 s [gammaloop-workspace-check] Checking nalgebra v0.29.0
  385. 27.25 s [gammaloop-workspace-check] Checking color-eyre v0.6.5
  386. 27.27 s [gammaloop-workspace-check] Checking maplit v1.0.2
  387. 27.33 s [gammaloop-workspace-check] Checking ron v0.8.1
  388. 27.38 s [gammaloop-workspace-check] Compiling iai-callgrind-runner v0.14.2
  389. 27.82 s [gammaloop-workspace-check] Compiling numerica v2.2.0 (https://github.com/alphal00p/symbolica?rev=a277a8dadbaae5a8d6605f2f381991a601e1f345#a277a8da)
  390. 27.95 s [gammaloop-workspace-check] Checking futures-executor v0.3.32
  391. 28.08 s [gammaloop-workspace-check] Checking kurbo v0.13.0
  392. 28.12 s [gammaloop-workspace-check] Checking serial_test v3.4.0
  393. 28.23 s [gammaloop-workspace-check] Checking wait-timeout v0.2.1
  394. 28.34 s [gammaloop-workspace-check] Compiling iai-callgrind v0.14.2
  395. 28.38 s [gammaloop-workspace-check] Checking bit-vec v0.8.0
  396. 28.63 s [gammaloop-workspace-check] Checking quick-error v1.2.3
  397. 28.65 s [gammaloop-workspace-check] Checking bit-set v0.8.0
  398. 28.78 s [gammaloop-workspace-check] Checking syn v2.0.117
  399. 28.81 s [gammaloop-workspace-check] Checking rusty-fork v0.3.1
  400. 29.04 s [gammaloop-workspace-check] Compiling iai-callgrind-macros v0.5.1
  401. 29.07 s [gammaloop-workspace-check] Checking rand_xorshift v0.4.0
  402. 29.13 s [gammaloop-workspace-check] Compiling test-log-macros v0.2.20
  403. 29.18 s [gammaloop-workspace-check] Checking console v0.15.11
  404. 29.24 s [gammaloop-workspace-check] Checking unarray v0.1.4
  405. 29.34 s [gammaloop-workspace-check] Checking pathdiff v0.2.3
  406. 29.42 s [gammaloop-workspace-check] Checking proptest v1.11.0
  407. 29.66 s [gammaloop-workspace-check] Checking kurvst v0.1.0 (/build/source/crates/kurvst)
  408. 29.70 s [gammaloop-workspace-check] Checking similar-asserts v1.7.0
  409. 29.88 s [gammaloop-workspace-check] Checking clinnet v0.1.8 (/build/source/crates/clinnet)
  410. 32.33 s [gammaloop-workspace-check] Checking test-log v0.2.20
  411. 35.08 s [gammaloop-workspace-check] Compiling graphica v2.1.0 (https://github.com/alphal00p/symbolica?rev=a277a8dadbaae5a8d6605f2f381991a601e1f345#a277a8da)
  412. 36.41 s [gammaloop-workspace-check] Checking statrs v0.16.1
  413. 36.68 s [gammaloop-workspace-check] Checking gungraun v0.18.2
  414. 37.28 s [gammaloop-workspace-check] Checking momtrop v0.3.0
  415. 42.18 s [gammaloop-workspace-check] Compiling pyo3-macros v0.28.3
  416. 42.54 s [gammaloop-workspace-check] Compiling pyo3-stub-gen-derive v0.17.2
  417. 48.89 s [gammaloop-workspace-check] Checking pyo3-stub-gen v0.17.2
  418. 55.68 s [gammaloop-workspace-check] Checking symbolica-utils v0.1.0 (/build/source/crates/symbolica-utils)
  419. 55.68 s [gammaloop-workspace-check] Checking spenso-macros v0.3.2 (/build/source/crates/spenso-macros)
  420. 220.31 s [gammaloop-workspace-check] Compiling gammaloop-workspace-hack v0.1.0 (/build/source/crates/gammaloop-workspace-hack)
  421. 220.57 s [gammaloop-workspace-check] Checking linnet v0.17.0 (/build/source/crates/linnet)
  422. 223.93 s [gammaloop-workspace-check] Checking spenso v0.6.0 (/build/source/crates/spenso)
  423. 223.94 s [gammaloop-workspace-check] Checking linnet-py v0.1.0 (/build/source/crates/linnet-py)
  424. 223.94 s [gammaloop-workspace-check] Checking linnest v0.1.0 (/build/source/crates/linnest)
  425. 228.53 s [gammaloop-workspace-check] Checking idenso v0.3.0 (/build/source/crates/idenso)
  426. 228.53 s [gammaloop-workspace-check] Checking gammaloop-tracing-filter v0.1.0 (/build/source/crates/gammaloop-tracing-filter)
  427. 230.02 s [gammaloop-workspace-check] Checking spenso-hep-lib v0.1.7 (/build/source/crates/spenso-hep-lib)
  428. 230.24 s [gammaloop-workspace-check] Checking spynso3 v0.1.2 (/build/source/crates/spynso3)
  429. 258.03 s [gammaloop-workspace-check] error[E0560]: struct `CutInfo` has no field named `lmb_channel_id`
  430. 258.03 s [gammaloop-workspace-check] --> tests/tests/test_differential.rs:86:13
  431. 258.03 s [gammaloop-workspace-check] |
  432. 258.03 s [gammaloop-workspace-check] 86 | lmb_channel_id: None,
  433. 258.03 s [gammaloop-workspace-check] | ^^^^^^^^^^^^^^ `CutInfo` does not have this field
  434. 258.03 s [gammaloop-workspace-check] |
  435. 258.03 s [gammaloop-workspace-check] = note: available fields are: `sampling_channel_id`, `sampling_channel_edge_ids`
  436. 258.03 s [gammaloop-workspace-check]
  437. 258.03 s [gammaloop-workspace-check] error[E0560]: struct `CutInfo` has no field named `lmb_channel_edge_ids`
  438. 258.03 s [gammaloop-workspace-check] --> tests/tests/test_differential.rs:87:13
  439. 258.03 s [gammaloop-workspace-check] |
  440. 258.03 s [gammaloop-workspace-check] 87 | lmb_channel_edge_ids: None,
  441. 258.03 s [gammaloop-workspace-check] | ^^^^^^^^^^^^^^^^^^^^ `CutInfo` does not have this field
  442. 258.03 s [gammaloop-workspace-check] |
  443. 258.03 s [gammaloop-workspace-check] = note: available fields are: `sampling_channel_id`, `sampling_channel_edge_ids`
  444. 258.03 s [gammaloop-workspace-check]
  445. 258.04 s [gammaloop-workspace-check] error[E0063]: missing field `reference_moments` in initializer of `GraphEvaluationResult<_>`
  446. 258.04 s [gammaloop-workspace-check] --> tests/tests/test_differential.rs:532:19
  447. 258.04 s [gammaloop-workspace-check] |
  448. 258.04 s [gammaloop-workspace-check] 532 | let mut lhs = GraphEvaluationResult {
  449. 258.04 s [gammaloop-workspace-check] | ^^^^^^^^^^^^^^^^^^^^^ missing `reference_moments`
  450. 258.04 s [gammaloop-workspace-check]
  451. 258.04 s [gammaloop-workspace-check] error[E0063]: missing field `reference_moments` in initializer of `GraphEvaluationResult<_>`
  452. 258.04 s [gammaloop-workspace-check] --> tests/tests/test_differential.rs:539:15
  453. 258.04 s [gammaloop-workspace-check] |
  454. 258.04 s [gammaloop-workspace-check] 539 | let rhs = GraphEvaluationResult {
  455. 258.04 s [gammaloop-workspace-check] | ^^^^^^^^^^^^^^^^^^^^^ missing `reference_moments`
  456. 258.04 s [gammaloop-workspace-check]
  457. 258.05 s [gammaloop-workspace-check] error[E0609]: no field `lmb_channel_edge_ids` on type `CutInfo`
  458. 258.05 s [gammaloop-workspace-check] --> tests/tests/test_evaluation_api.rs:311:10
  459. 258.05 s [gammaloop-workspace-check] |
  460. 258.05 s [gammaloop-workspace-check] 311 | .lmb_channel_edge_ids
  461. 258.05 s [gammaloop-workspace-check] | ^^^^^^^^^^^^^^^^^^^^ unknown field
  462. 258.05 s [gammaloop-workspace-check] |
  463. 258.05 s [gammaloop-workspace-check] = note: available fields are: `particle_pdgs`, `cut_id`, `graph_id`, `graph_group_id`, `orientation_id` ... and 2 others
  464. 258.05 s [gammaloop-workspace-check]
  465. 258.07 s [gammaloop-workspace-check] error[E0609]: no field `lmb_channel_edge_ids` on type `CutInfo`
  466. 258.07 s [gammaloop-workspace-check] --> tests/tests/test_evaluation_api.rs:591:26
  467. 258.07 s [gammaloop-workspace-check] |
  468. 258.07 s [gammaloop-workspace-check] 591 | .lmb_channel_edge_ids
  469. 258.07 s [gammaloop-workspace-check] | ^^^^^^^^^^^^^^^^^^^^ unknown field
  470. 258.07 s [gammaloop-workspace-check] |
  471. 258.07 s [gammaloop-workspace-check] = note: available fields are: `particle_pdgs`, `cut_id`, `graph_id`, `graph_group_id`, `orientation_id` ... and 2 others
  472. 258.07 s [gammaloop-workspace-check]
  473. 258.09 s [gammaloop-workspace-check] Some errors have detailed explanations: E0063, E0560.
  474. 258.09 s [gammaloop-workspace-check] For more information about an error, try `rustc --explain E0063`.
  475. 258.09 s [gammaloop-workspace-check] error: could not compile `gammaloop-integration-tests` (test "test_differential") due to 4 previous errors
  476. 258.09 s [gammaloop-workspace-check] warning: build failed, waiting for other jobs to finish...
  477. 258.10 s [gammaloop-workspace-check] error[E0609]: no field `lmb_channel_edge_ids` on type `CutInfo`
  478. 258.10 s [gammaloop-workspace-check] --> tests/tests/test_evaluation_api.rs:1177:18
  479. 258.10 s [gammaloop-workspace-check] |
  480. 258.10 s [gammaloop-workspace-check] 1177 | .lmb_channel_edge_ids
  481. 258.10 s [gammaloop-workspace-check] | ^^^^^^^^^^^^^^^^^^^^ unknown field
  482. 258.10 s [gammaloop-workspace-check] |
  483. 258.10 s [gammaloop-workspace-check] = note: available fields are: `particle_pdgs`, `cut_id`, `graph_id`, `graph_group_id`, `orientation_id` ... and 2 others
  484. 258.10 s [gammaloop-workspace-check]
  485. 258.17 s [gammaloop-workspace-check] error[E0609]: no field `lmb_channel_edge_ids` on type `CutInfo`
  486. 258.17 s [gammaloop-workspace-check] --> tests/tests/test_evaluation_api.rs:1222:22
  487. 258.17 s [gammaloop-workspace-check] |
  488. 258.17 s [gammaloop-workspace-check] 1222 | .lmb_channel_edge_ids
  489. 258.17 s [gammaloop-workspace-check] | ^^^^^^^^^^^^^^^^^^^^ unknown field
  490. 258.17 s [gammaloop-workspace-check] |
  491. 258.17 s [gammaloop-workspace-check] = note: available fields are: `particle_pdgs`, `cut_id`, `graph_id`, `graph_group_id`, `orientation_id` ... and 2 others
  492. 258.17 s [gammaloop-workspace-check]
  493. 258.17 s [gammaloop-workspace-check] error[E0609]: no field `lmb_channel_edge_ids` on type `CutInfo`
  494. 258.17 s [gammaloop-workspace-check] --> tests/tests/test_evaluation_api.rs:1281:14
  495. 258.17 s [gammaloop-workspace-check] |
  496. 258.17 s [gammaloop-workspace-check] 1281 | .lmb_channel_edge_ids
  497. 258.17 s [gammaloop-workspace-check] | ^^^^^^^^^^^^^^^^^^^^ unknown field
  498. 258.17 s [gammaloop-workspace-check] |
  499. 258.17 s [gammaloop-workspace-check] = note: available fields are: `particle_pdgs`, `cut_id`, `graph_id`, `graph_group_id`, `orientation_id` ... and 2 others
  500. 258.17 s [gammaloop-workspace-check]
  501. 258.20 s [gammaloop-workspace-check] error[E0609]: no field `lmb_channel_edge_ids` on type `CutInfo`
  502. 258.20 s [gammaloop-workspace-check] --> tests/tests/test_evaluation_api.rs:1428:18
  503. 258.20 s [gammaloop-workspace-check] |
  504. 258.20 s [gammaloop-workspace-check] 1428 | .lmb_channel_edge_ids
  505. 258.20 s [gammaloop-workspace-check] | ^^^^^^^^^^^^^^^^^^^^ unknown field
  506. 258.20 s [gammaloop-workspace-check] |
  507. 258.20 s [gammaloop-workspace-check] = note: available fields are: `particle_pdgs`, `cut_id`, `graph_id`, `graph_group_id`, `orientation_id` ... and 2 others
  508. 258.20 s [gammaloop-workspace-check]
  509. 258.27 s [gammaloop-workspace-check] For more information about this error, try `rustc --explain E0609`.
  510. 258.29 s [gammaloop-workspace-check] error: could not compile `gammaloop-integration-tests` (test "test_evaluation_api") due to 6 previous errors
  511. 258.70 s [gammaloop-workspace-check] error[E0609]: no field `lmb_channel_id` on type `CutInfo`
  512. 258.70 s [gammaloop-workspace-check] --> tests/tests/test_runs/utils.rs:568:36
  513. 258.70 s [gammaloop-workspace-check] |
  514. 258.70 s [gammaloop-workspace-check] 568 | event.cut_info.lmb_channel_id,
  515. 258.70 s [gammaloop-workspace-check] | ^^^^^^^^^^^^^^ unknown field
  516. 258.70 s [gammaloop-workspace-check] |
  517. 258.70 s [gammaloop-workspace-check] = note: available fields are: `particle_pdgs`, `cut_id`, `graph_id`, `graph_group_id`, `orientation_id` ... and 2 others
  518. 258.70 s [gammaloop-workspace-check]
  519. 258.70 s [gammaloop-workspace-check] error[E0609]: no field `lmb_channel_id` on type `CutInfo`
  520. 258.70 s [gammaloop-workspace-check] --> tests/tests/test_runs/utils.rs:580:36
  521. 258.70 s [gammaloop-workspace-check] |
  522. 258.70 s [gammaloop-workspace-check] 580 | event.cut_info.lmb_channel_id,
  523. 258.70 s [gammaloop-workspace-check] | ^^^^^^^^^^^^^^ unknown field
  524. 258.70 s [gammaloop-workspace-check] |
  525. 258.70 s [gammaloop-workspace-check] = note: available fields are: `particle_pdgs`, `cut_id`, `graph_id`, `graph_group_id`, `orientation_id` ... and 2 others
  526. 258.70 s [gammaloop-workspace-check]
  527. 259.10 s [gammaloop-workspace-check] error: could not compile `gammaloop-integration-tests` (test "test_runs") due to 2 previous errors
  528. 259.60 s Progress: 0 of 1 built (1 failed)
  529. 259.60 s Failed to build gammaloop-workspace-check after 4m17s
  530. 259.60 s Cannot build '/nix/store/2f1j2lkyg12g36flfbgvv1q9204gpqa0-gammaloop-workspace-check-0.1.0.drv'.
  531. 259.60 s Reason: builder failed with exit code 101.
  532. 259.60 s Output paths:
  533. 259.60 s /nix/store/8ijafqa7ipzzclcid7n6jgdwkfr2bh7s-gammaloop-workspace-check-0.1.0
  534. 259.60 s Last 524 log lines:
  535. 259.60 s > Running phase: unpackPhase
  536. 259.60 s > unpacking source archive /nix/store/s2z31bfagqssyfp9l6l2s0lp69bdgr0x-source
  537. 259.60 s > source root is source
  538. 259.60 s > Running phase: patchPhase
  539. 259.60 s > Executing configureCargoCommonVars
  540. 259.60 s > decompressing cargo artifacts from /nix/store/50vpxlcgfxf2d57i27v3d10zjwxxbm2r-gammaloop-workspace-deps-deps-0.1.0/target.tar.zst to target
  541. 259.60 s > Running phase: updateAutotoolsGnuConfigScriptsPhase
  542. 259.60 s > Running phase: configurePhase
  543. 259.60 s > will append /build/source/.cargo-home/config.toml with contents of /nix/store/5drf77x6km4ky7gwlrzdx9bbd6fz09g3-vendor-cargo-deps/config.toml
  544. 259.60 s > default configurePhase, nothing to do
  545. 259.60 s > Running phase: buildPhase
  546. 259.60 s > +++ command cargo --version
  547. 259.60 s > cargo 1.97.0 (c980f4866 2026-06-30)
  548. 259.60 s > +++ command cargo check --profile ci-optim --locked --workspace --features gammaloop-tracing-filter/clap,gammaloop-tracing-filter/symbolica,idenso/bincode,idenso/reference-cases,linnet/bincode,linnet/drawing,linnet/rkyv,linnet/serde,linnet/symbolica,spenso-macros/shadowing,spenso/shadowing,symbolica/tracing_max_level_info,three-dimensional-reps/display,three-dimensional-reps/eval,three-dimensional-reps/serde --all-targets
  549. 259.60 s > Checking cfg-if v1.0.4
  550. 259.60 s > Checking memchr v2.8.0
  551. 259.60 s > Checking once_cell v1.21.4
  552. 259.60 s > Checking either v1.15.0
  553. 259.60 s > Checking serde_core v1.0.228
  554. 259.60 s > Checking libc v0.2.186
  555. 259.60 s > Checking libm v0.2.16
  556. 259.60 s > Checking itoa v1.0.18
  557. 259.60 s > Checking log v0.4.29
  558. 259.60 s > Checking regex-syntax v0.8.10
  559. 259.60 s > Checking zerocopy v0.8.48
  560. 259.60 s > Checking crossbeam-utils v0.8.21
  561. 259.60 s > Checking equivalent v1.0.2
  562. 259.60 s > Checking zmij v1.0.21
  563. 259.60 s > Checking lazy_static v1.5.0
  564. 259.60 s > Checking bytemuck v1.25.0
  565. 259.60 s > Compiling target-lexicon v0.13.5
  566. 259.60 s > Checking arrayvec v0.7.6
  567. 259.60 s > Checking powerfmt v0.2.0
  568. 259.60 s > Checking num-conv v0.2.1
  569. 259.60 s > Checking num_threads v0.1.7
  570. 259.60 s > Checking itertools v0.14.0
  571. 259.60 s > Checking time-core v0.1.8
  572. 259.60 s > Checking pin-project-lite v0.2.17
  573. 259.60 s > Checking tracing-core v0.1.36
  574. 259.60 s > Checking safe_arch v0.7.4
  575. 259.60 s > Checking allocator-api2 v0.2.21
  576. 259.60 s > Checking deranged v0.5.8
  577. 259.60 s > Checking foldhash v0.2.0
  578. 259.60 s > Checking const-random v0.1.18
  579. 259.60 s > Checking aho-corasick v1.1.4
  580. 259.60 s > Checking nu-ansi-term v0.50.3
  581. 259.60 s > Checking static_assertions v1.1.0
  582. 259.60 s > Checking winnow v1.0.2
  583. 259.60 s > Checking unty v0.0.4
  584. 259.60 s > Checking safe_arch v1.0.0
  585. 259.60 s > Checking crossbeam-epoch v0.9.18
  586. 259.60 s > Checking sharded-slab v0.1.7
  587. 259.60 s > Checking tracing v0.1.44
  588. 259.60 s > Checking hashbrown v0.16.1
  589. 259.60 s > Checking crossbeam-deque v0.8.6
  590. 259.60 s > Checking wide v0.7.33
  591. 259.60 s > Checking rayon-core v1.13.0
  592. 259.60 s > Checking tracing-log v0.2.0
  593. 259.60 s > Checking thread_local v1.1.9
  594. 259.60 s > Checking toml_writer v1.1.1+spec-1.1.0
  595. 259.60 s > Checking indenter v0.3.4
  596. 259.60 s > Checking num-traits v0.2.19
  597. 259.60 s > Checking az v1.3.0
  598. 259.60 s > Checking wide v1.3.0
  599. 259.60 s > Compiling phf_shared v0.11.3
  600. 259.60 s > Checking toml_parser v1.1.2+spec-1.1.0
  601. 259.60 s > Checking rayon v1.12.0
  602. 259.60 s > Checking anyhow v1.0.102
  603. 259.60 s > Checking alloc-no-stdlib v2.0.4
  604. 259.60 s > Checking dyn-clone v1.0.20
  605. 259.60 s > Checking getrandom v0.3.4
  606. 259.60 s > Checking gmp-mpfr-sys v1.7.1
  607. 259.60 s > Checking approx v0.5.1
  608. 259.60 s > Checking num-integer v0.1.46
  609. 259.60 s > Checking rawpointer v0.2.1
  610. 259.60 s > Checking utf8parse v0.2.2
  611. 259.60 s > Checking alloc-stdlib v0.2.2
  612. 259.60 s > Checking anstyle v1.0.14
  613. 259.60 s > Checking matrixmultiply v0.3.10
  614. 259.60 s > Checking anstyle-parse v1.0.0
  615. 259.60 s > Checking colored v3.1.1
  616. 259.60 s > Checking anstyle-query v1.1.5
  617. 259.60 s > Checking rand_core v0.9.5
  618. 259.60 s > Checking is_terminal_polyfill v1.70.2
  619. 259.60 s > Compiling pyo3-build-config v0.28.3
  620. 259.60 s > Checking colorchoice v1.0.5
  621. 259.60 s > Compiling phf_generator v0.11.3
  622. 259.60 s > Checking eyre v0.6.12
  623. 259.60 s > Checking bitflags v1.3.2
  624. 259.60 s > Checking unicode-width v0.2.2
  625. 259.60 s > Checking brotli-decompressor v5.0.0
  626. 259.60 s > Checking region v3.0.2
  627. 259.60 s > Checking time v0.3.47
  628. 259.60 s > Compiling phf_codegen v0.11.3
  629. 259.60 s > Checking serde v1.0.228
  630. 259.60 s > Checking serde_json v1.0.149
  631. 259.60 s > Checking bitflags v2.11.1
  632. 259.60 s > Checking serde_spanned v1.1.1
  633. 259.60 s > Checking toml_datetime v1.1.1+spec-1.1.0
  634. 259.60 s > Checking regex-automata v0.4.14
  635. 259.60 s > Checking anstream v1.0.0
  636. 259.60 s > Checking wasmtime-jit-icache-coherence v34.0.2
  637. 259.60 s > Checking hugepage-rs v0.1.1
  638. 259.60 s > Checking spec_math v0.1.6
  639. 259.60 s > Checking inventory v0.3.24
  640. 259.60 s > Checking thiserror v2.0.18
  641. 259.60 s > Checking toml v1.1.2+spec-1.1.0
  642. 259.60 s > Compiling getopts v0.2.24
  643. 259.60 s > Checking libloading v0.9.0
  644. 259.60 s > Checking self_cell v1.2.2
  645. 259.60 s > Checking bytes v1.11.1
  646. 259.60 s > Checking tinyjson v2.5.1
  647. 259.60 s > Checking append-only-vec v0.1.8
  648. 259.60 s > Checking byteorder v1.5.0
  649. 259.60 s > Compiling unic-common v0.9.0
  650. 259.60 s > Checking smallvec v1.15.1
  651. 259.60 s > Checking num-complex v0.4.6
  652. 259.60 s > Checking tracing-serde v0.2.0
  653. 259.60 s > Checking bincode v2.0.1
  654. 259.60 s > Checking brotli v8.0.2
  655. 259.60 s > Checking simba v0.9.1
  656. 259.60 s > Checking smartstring v1.0.1
  657. 259.60 s > Compiling unicode_names2_generator v1.3.0
  658. 259.60 s > Compiling unic-char-range v0.9.0
  659. 259.60 s > Checking linux-raw-sys v0.12.1
  660. 259.60 s > Compiling unic-ucd-version v0.9.0
  661. 259.60 s > Compiling is-macro v0.3.7
  662. 259.60 s > Compiling rustpython-parser-vendored v0.4.0
  663. 259.60 s > Compiling unic-char-property v0.9.0
  664. 259.60 s > Checking iana-time-zone v0.1.65
  665. 259.60 s > Compiling rustpython-parser v0.4.0
  666. 259.60 s > Compiling phf v0.11.3
  667. 259.60 s > Checking chrono v0.4.44
  668. 259.60 s > Checking rustix v1.1.4
  669. 259.60 s > Checking rustc-hash v2.1.2
  670. 259.60 s > Compiling unic-ucd-ident v0.9.0
  671. 259.60 s > Compiling unic-emoji-char v0.9.0
  672. 259.60 s > Checking ndarray v0.17.2
  673. 259.60 s > Compiling lalrpop-util v0.20.2
  674. 259.60 s > Compiling rustc-hash v1.1.0
  675. 259.60 s > Checking rug v1.30.0
  676. 259.60 s > Compiling symbolica v2.2.0 (https://github.com/alphal00p/symbolica?rev=a277a8dadbaae5a8d6605f2f381991a601e1f345#a277a8da)
  677. 259.60 s > Checking unicode-segmentation v1.13.2
  678. 259.60 s > Checking typenum v1.20.0
  679. 259.60 s > Checking getrandom v0.2.17
  680. 259.60 s > Checking scopeguard v1.2.0
  681. 259.60 s > Checking lock_api v0.4.14
  682. 259.60 s > Checking parking_lot_core v0.9.12
  683. 259.60 s > Checking hashbrown v0.17.0
  684. 259.60 s > Checking unicode-ident v1.0.24
  685. 259.60 s > Checking generic-array v0.14.7
  686. 259.60 s > Checking errno v0.3.14
  687. 259.60 s > Checking parking_lot v0.12.5
  688. 259.60 s > Checking clap_lex v1.1.0
  689. 259.60 s > Checking unicase v2.9.0
  690. 259.60 s > Checking strsim v0.11.1
  691. 259.60 s > Checking signal-hook-registry v1.4.8
  692. 259.60 s > Checking vte v0.14.1
  693. 259.60 s > Checking same-file v1.0.6
  694. 259.60 s > Checking indexmap v2.14.0
  695. 259.60 s > Checking walkdir v2.5.0
  696. 259.60 s > Checking block-buffer v0.10.4
  697. 259.60 s > Checking crypto-common v0.1.7
  698. 259.60 s > Checking terminal_size v0.4.4
  699. 259.60 s > Checking clap_builder v4.6.0
  700. 259.60 s > Checking mio v1.2.0
  701. 259.60 s > Checking ciborium-io v0.2.2
  702. 259.60 s > Checking signal-hook v0.3.18
  703. 259.60 s > Checking minimal-lexical v0.2.1
  704. 259.60 s > Checking digest v0.10.7
  705. 259.60 s > Checking derive_more v2.1.1
  706. 259.60 s > Checking signal-hook-mio v0.2.5
  707. 259.60 s > Checking num-bigint v0.4.6
  708. 259.60 s > Checking console v0.16.3
  709. 259.60 s > Checking bstr v1.12.1
  710. 259.60 s > Checking nom v7.1.3
  711. 259.60 s > Checking ppv-lite86 v0.2.21
  712. 259.60 s > Checking ahash v0.8.12
  713. 259.60 s > Checking half v2.7.1
  714. 259.60 s > Checking linux-raw-sys v0.4.15
  715. 259.60 s > Checking cpufeatures v0.2.17
  716. 259.60 s > Checking winnow v0.7.15
  717. 259.60 s > Checking ciborium-ll v0.2.2
  718. 259.60 s > Checking rand_chacha v0.9.0
  719. 259.60 s > Checking ciborium v0.2.2
  720. 259.60 s > Checking rustix v0.38.44
  721. 259.60 s > Checking rand v0.9.4
  722. 259.60 s > Checking matchers v0.2.0
  723. 259.60 s > Checking tracing-subscriber v0.3.23
  724. 259.60 s > Checking regex v1.12.3
  725. 259.60 s > Checking globset v0.4.18
  726. 259.60 s > Checking sha2 v0.10.9
  727. 259.60 s > Checking symjit v2.21.0
  728. 259.60 s > Checking rand_core v0.6.4
  729. 259.60 s > Checking getrandom v0.4.2
  730. 259.60 s > Checking fastrand v2.4.1
  731. 259.60 s > Checking fnv v1.0.7
  732. 259.60 s > Checking plotters-backend v0.3.7
  733. 259.60 s > Checking crossterm v0.28.1
  734. 259.60 s > Compiling unicode_names2 v1.3.0
  735. 259.60 s > Checking tempfile v3.27.0
  736. 259.60 s > Checking rust-embed-utils v8.11.0
  737. 259.60 s > Checking serde_spanned v0.6.9
  738. 259.60 s > Checking toml_datetime v0.6.11
  739. 259.60 s > Checking xprec v0.2.2
  740. 259.60 s > Checking itertools v0.10.5
  741. 259.60 s > Checking tap v1.0.1
  742. 259.60 s > Checking plotters-svg v0.3.7
  743. 259.60 s > Checking toml_write v0.1.2
  744. 259.60 s > Checking clap v4.6.1
  745. 259.60 s > Checking cast v0.3.0
  746. 259.60 s > Checking wyz v0.5.1
  747. 259.60 s > Checking toml_edit v0.22.27
  748. 259.60 s > Checking rand_chacha v0.3.1
  749. 259.60 s > Checking ansitok v0.3.0
  750. 259.60 s > Checking plotters v0.3.7
  751. 259.60 s > Checking radium v0.7.0
  752. 259.60 s > Checking typeid v1.0.3
  753. 259.60 s > Checking similar v2.7.0
  754. 259.60 s > Checking tinytemplate v1.2.1
  755. 259.60 s > Checking is-terminal v0.4.17
  756. 259.60 s > Checking bytecount v0.6.9
  757. 259.60 s > Checking anes v0.1.6
  758. 259.60 s > Checking funty v2.0.0
  759. 259.60 s > Checking oorandom v11.1.5
  760. 259.60 s > Checking rand v0.8.6
  761. 259.60 s > Checking ansi-str v0.9.0
  762. 259.60 s > Checking testing_table v0.3.0
  763. 259.60 s > Checking ron v0.12.1
  764. 259.60 s > Checking bitvec v1.0.1
  765. 259.60 s > Checking papergrid v0.17.0
  766. 259.60 s > Checking env_filter v1.0.1
  767. 259.60 s > Checking toml_edit v0.25.11+spec-1.1.0
  768. 259.60 s > Checking uncased v0.9.10
  769. 259.60 s > Checking jiff v0.2.24
  770. 259.60 s > Checking ptr_meta v0.1.4
  771. 259.60 s > Checking ucd-trie v0.1.7
  772. 259.60 s > Checking simdutf8 v0.1.5
  773. 259.60 s > Checking tabled v0.20.0
  774. 259.60 s > Checking pest v2.8.6
  775. 259.60 s > Checking bytecheck v0.6.12
  776. 259.60 s > Checking ahash v0.7.8
  777. 259.60 s > Checking insta v1.47.2
  778. 259.60 s > Checking hashbrown v0.12.3
  779. 259.60 s > Checking approx v0.4.0
  780. 259.60 s > Checking seahash v4.1.0
  781. 259.60 s > Checking rend v0.4.2
  782. 259.60 s > Checking cgmath v0.18.0
  783. 259.60 s > Checking num-rational v0.4.2
  784. 259.60 s > Checking num-iter v0.1.45
  785. 259.60 s > Checking ref-ops v0.2.5
  786. 259.60 s > Checking criterion-plot v0.5.0
  787. 259.60 s > Checking rand_xoshiro v0.6.0
  788. 259.60 s > Checking dot-parser v0.5.1
  789. 259.60 s > Checking num v0.4.3
  790. 259.60 s > Checking features v0.10.0
  791. 259.60 s > Checking constcat v0.5.1
  792. 259.60 s > Checking gat-lending-iterator v0.1.8
  793. 259.60 s > Checking criterion v0.5.1
  794. 259.60 s > Checking colored v2.2.0
  795. 259.60 s > Checking constant_time_eq v0.4.2
  796. 259.60 s > Checking cpufeatures v0.3.0
  797. 259.60 s > Checking toml v0.8.23
  798. 259.60 s > Checking arrayref v0.3.9
  799. 259.60 s > Compiling pyo3-ffi v0.28.3
  800. 259.60 s > Compiling pyo3-macros-backend v0.28.3
  801. 259.60 s > Compiling pyo3 v0.28.3
  802. 259.60 s > Compiling numpy v0.28.0
  803. 259.60 s > Checking blake3 v1.8.5
  804. 259.60 s > Checking base64 v0.22.1
  805. 259.60 s > Checking siphasher v1.0.2
  806. 259.60 s > Checking joinery v2.1.0
  807. 259.60 s > Checking subprocess v0.2.15
  808. 259.60 s > Checking rust_lisp v0.18.0
  809. 259.60 s > Compiling vakint v0.1.2 (/build/source/crates/vakint)
  810. 259.60 s > Checking titlecase v2.2.1
  811. 259.60 s > Checking phf_shared v0.13.1
  812. 259.60 s > Checking figment v0.10.19
  813. 259.60 s > Checking version-compare v0.2.1
  814. 259.60 s > Checking xpct v0.5.1
  815. 259.60 s > Checking ryu v1.0.23
  816. 259.60 s > Checking castaway v0.2.4
  817. 259.60 s > Checking toml_datetime v0.7.5+spec-1.1.0
  818. 259.60 s > Checking strum v0.27.2
  819. 259.60 s > Checking compact_str v0.9.0
  820. 259.60 s > Checking phf v0.13.1
  821. 259.60 s > Checking unicode-truncate v2.0.1
  822. 259.60 s > Checking kasuari v0.4.12
  823. 259.60 s > Checking lru v0.16.4
  824. 259.60 s > Checking toml v0.9.12+spec-1.1.0
  825. 259.60 s > Checking vte v0.15.0
  826. 259.60 s > Checking vt100 v0.16.2
  827. 259.60 s > Checking portable-atomic v1.13.1
  828. 259.60 s > Checking string-template-plus v0.4.3
  829. 259.60 s > Checking unit-prefix v0.5.2
  830. 259.60 s > Checking rand_distr v0.4.3
  831. 259.60 s > Checking simba v0.6.0
  832. 259.60 s > Checking ratatui-core v0.1.0
  833. 259.60 s > Checking indicatif v0.18.4
  834. 259.60 s > Checking line-clipping v0.3.7
  835. 259.60 s > Checking gimli v0.32.3
  836. 259.60 s > Checking adler2 v2.0.1
  837. 259.60 s > Compiling three-dimensional-reps v0.1.0 (/build/source/crates/three-dimensional-reps)
  838. 259.60 s > Checking miniz_oxide v0.8.9
  839. 259.60 s > Checking thiserror v1.0.69
  840. 259.60 s > Checking derive_builder v0.11.2
  841. 259.60 s > Checking crossterm v0.29.0
  842. 259.60 s > Checking env_logger v0.11.10
  843. 259.60 s > Checking object v0.37.3
  844. 259.60 s > Checking owo-colors v4.3.0
  845. 259.60 s > Checking tracing-error v0.2.1
  846. 259.60 s > Checking typed-index-collections v3.5.0
  847. 259.60 s > Checking serde-big-array v0.5.1
  848. 259.60 s > Checking amd v0.2.2
  849. 259.60 s > Checking itertools v0.11.0
  850. 259.60 s > Compiling gammaloop-tracing-filter-macros v0.1.0 (/build/source/crates/gammaloop-tracing-filter-macros)
  851. 259.60 s > Checking rustc-demangle v0.1.27
  852. 259.60 s > Checking option-ext v0.2.0
  853. 259.60 s > Checking ref-cast v1.0.25
  854. 259.60 s > Checking dirs-sys v0.5.0
  855. 259.60 s > Checking nix v0.31.2
  856. 259.60 s > Checking brotli-decompressor v4.0.3
  857. 259.60 s > Checking integer-sqrt v0.1.5
  858. 259.60 s > Checking crossbeam-channel v0.5.15
  859. 259.60 s > Checking itertools v0.12.1
  860. 259.60 s > Checking symlink v0.1.0
  861. 259.60 s > Checking unsafe-libyaml v0.2.11
  862. 259.60 s > Compiling rustpython-parser-core v0.4.0
  863. 259.60 s > Checking color-spantrace v0.3.0
  864. 259.60 s > Checking ratatui-widgets v0.3.0
  865. 259.60 s > Checking ratatui-crossterm v0.1.0
  866. 259.60 s > Compiling rustpython-ast v0.4.0
  867. 259.60 s > Compiling gammalooprs v0.3.4 (/build/source/crates/gammalooprs)
  868. 259.60 s > Checking tracing-appender v0.2.5
  869. 259.60 s > Checking clarabel v0.11.1
  870. 259.60 s > Checking include_dir v0.7.4
  871. 259.60 s > Checking pathfinding v4.15.0
  872. 259.60 s > Checking rkyv v0.7.46
  873. 259.60 s > Checking dirs v6.0.0
  874. 259.60 s > Checking ctrlc v3.5.2
  875. 259.60 s > Checking schemars v1.2.1
  876. 259.60 s > Checking slotmap v1.1.1
  877. 259.60 s > Checking tracing-indicatif v0.3.14
  878. 259.60 s > Checking serde_yaml v0.9.34+deprecated
  879. 259.60 s > Checking brotli v7.0.0
  880. 259.60 s > Checking json5 v0.4.1
  881. 259.60 s > Checking vectorize v0.2.0
  882. 259.60 s > Checking ringbuffer v0.16.0
  883. 259.60 s > Checking base62 v2.2.4
  884. 259.60 s > Checking ratatui-macros v0.7.0
  885. 259.60 s > Checking rust-embed v8.11.0
  886. 259.60 s > Checking ratatui v0.30.0
  887. 259.60 s > Checking clap_complete v4.6.3
  888. 259.60 s > Checking fd-lock v4.0.4
  889. 259.60 s > Checking strip-ansi-escapes v0.2.1
  890. 259.60 s > Compiling gammaloop-api v0.1.0 (/build/source/crates/gammaloop-api)
  891. 259.60 s > Checking itertools v0.13.0
  892. 259.60 s > Checking strum v0.26.3
  893. 259.60 s > Checking sysinfo v0.33.1
  894. 259.60 s > Checking shlex v1.3.0
  895. 259.60 s > Checking futures-task v0.3.32
  896. 259.60 s > Checking slab v0.4.12
  897. 259.60 s > Checking clap_complete_nushell v4.6.0
  898. 259.60 s > Checking futures-core v0.3.32
  899. 259.60 s > Checking addr2line v0.25.1
  900. 259.60 s > Checking sdd v3.0.10
  901. 259.60 s > Checking futures-util v0.3.32
  902. 259.60 s > Compiling gammaloop-integration-tests v0.1.0 (/build/source/tests)
  903. 259.60 s > Compiling test-log-core v0.2.20
  904. 259.60 s > Checking scc v2.4.0
  905. 259.60 s > Compiling rustc_version v0.4.1
  906. 259.60 s > Checking which v8.0.2
  907. 259.60 s > Checking bincode v1.3.3
  908. 259.60 s > Compiling gungraun-runner v0.18.2
  909. 259.60 s > Checking proc-macro2 v1.0.106
  910. 259.60 s > Checking reedline v0.42.0
  911. 259.60 s > Compiling gungraun-macros v0.8.0
  912. 259.60 s > Checking quote v1.0.45
  913. 259.60 s > Checking backtrace v0.3.76
  914. 259.60 s > Checking base64 v0.21.7
  915. 259.60 s > Checking nalgebra v0.29.0
  916. 259.60 s > Checking color-eyre v0.6.5
  917. 259.60 s > Checking maplit v1.0.2
  918. 259.60 s > Checking ron v0.8.1
  919. 259.60 s > Compiling iai-callgrind-runner v0.14.2
  920. 259.60 s > Compiling numerica v2.2.0 (https://github.com/alphal00p/symbolica?rev=a277a8dadbaae5a8d6605f2f381991a601e1f345#a277a8da)
  921. 259.60 s > Checking futures-executor v0.3.32
  922. 259.60 s > Checking kurbo v0.13.0
  923. 259.60 s > Checking serial_test v3.4.0
  924. 259.60 s > Checking wait-timeout v0.2.1
  925. 259.60 s > Compiling iai-callgrind v0.14.2
  926. 259.60 s > Checking bit-vec v0.8.0
  927. 259.60 s > Checking quick-error v1.2.3
  928. 259.60 s > Checking bit-set v0.8.0
  929. 259.60 s > Checking syn v2.0.117
  930. 259.60 s > Checking rusty-fork v0.3.1
  931. 259.60 s > Compiling iai-callgrind-macros v0.5.1
  932. 259.60 s > Checking rand_xorshift v0.4.0
  933. 259.60 s > Compiling test-log-macros v0.2.20
  934. 259.60 s > Checking console v0.15.11
  935. 259.60 s > Checking unarray v0.1.4
  936. 259.60 s > Checking pathdiff v0.2.3
  937. 259.60 s > Checking proptest v1.11.0
  938. 259.60 s > Checking kurvst v0.1.0 (/build/source/crates/kurvst)
  939. 259.60 s > Checking similar-asserts v1.7.0
  940. 259.60 s > Checking clinnet v0.1.8 (/build/source/crates/clinnet)
  941. 259.60 s > Checking test-log v0.2.20
  942. 259.60 s > Compiling graphica v2.1.0 (https://github.com/alphal00p/symbolica?rev=a277a8dadbaae5a8d6605f2f381991a601e1f345#a277a8da)
  943. 259.60 s > Checking statrs v0.16.1
  944. 259.60 s > Checking gungraun v0.18.2
  945. 259.60 s > Checking momtrop v0.3.0
  946. 259.60 s > Compiling pyo3-macros v0.28.3
  947. 259.60 s > Compiling pyo3-stub-gen-derive v0.17.2
  948. 259.60 s > Checking pyo3-stub-gen v0.17.2
  949. 259.60 s > Checking symbolica-utils v0.1.0 (/build/source/crates/symbolica-utils)
  950. 259.60 s > Checking spenso-macros v0.3.2 (/build/source/crates/spenso-macros)
  951. 259.60 s > Compiling gammaloop-workspace-hack v0.1.0 (/build/source/crates/gammaloop-workspace-hack)
  952. 259.60 s > Checking linnet v0.17.0 (/build/source/crates/linnet)
  953. 259.60 s > Checking spenso v0.6.0 (/build/source/crates/spenso)
  954. 259.60 s > Checking linnet-py v0.1.0 (/build/source/crates/linnet-py)
  955. 259.60 s > Checking linnest v0.1.0 (/build/source/crates/linnest)
  956. 259.60 s > Checking idenso v0.3.0 (/build/source/crates/idenso)
  957. 259.60 s > Checking gammaloop-tracing-filter v0.1.0 (/build/source/crates/gammaloop-tracing-filter)
  958. 259.60 s > Checking spenso-hep-lib v0.1.7 (/build/source/crates/spenso-hep-lib)
  959. 259.60 s > Checking spynso3 v0.1.2 (/build/source/crates/spynso3)
  960. 259.60 s > error[E0560]: struct `CutInfo` has no field named `lmb_channel_id`
  961. 259.60 s > --> tests/tests/test_differential.rs:86:13
  962. 259.60 s > |
  963. 259.60 s > 86 | lmb_channel_id: None,
  964. 259.60 s > | ^^^^^^^^^^^^^^ `CutInfo` does not have this field
  965. 259.60 s > |
  966. 259.60 s > = note: available fields are: `sampling_channel_id`, `sampling_channel_edge_ids`
  967. 259.60 s >
  968. 259.60 s > error[E0560]: struct `CutInfo` has no field named `lmb_channel_edge_ids`
  969. 259.60 s > --> tests/tests/test_differential.rs:87:13
  970. 259.60 s > |
  971. 259.60 s > 87 | lmb_channel_edge_ids: None,
  972. 259.60 s > | ^^^^^^^^^^^^^^^^^^^^ `CutInfo` does not have this field
  973. 259.60 s > |
  974. 259.60 s > = note: available fields are: `sampling_channel_id`, `sampling_channel_edge_ids`
  975. 259.60 s >
  976. 259.60 s > error[E0063]: missing field `reference_moments` in initializer of `GraphEvaluationResult<_>`
  977. 259.60 s > --> tests/tests/test_differential.rs:532:19
  978. 259.60 s > |
  979. 259.60 s > 532 | let mut lhs = GraphEvaluationResult {
  980. 259.60 s > | ^^^^^^^^^^^^^^^^^^^^^ missing `reference_moments`
  981. 259.60 s >
  982. 259.60 s > error[E0063]: missing field `reference_moments` in initializer of `GraphEvaluationResult<_>`
  983. 259.60 s > --> tests/tests/test_differential.rs:539:15
  984. 259.60 s > |
  985. 259.60 s > 539 | let rhs = GraphEvaluationResult {
  986. 259.60 s > | ^^^^^^^^^^^^^^^^^^^^^ missing `reference_moments`
  987. 259.60 s >
  988. 259.60 s > error[E0609]: no field `lmb_channel_edge_ids` on type `CutInfo`
  989. 259.60 s > --> tests/tests/test_evaluation_api.rs:311:10
  990. 259.60 s > |
  991. 259.60 s > 311 | .lmb_channel_edge_ids
  992. 259.60 s > | ^^^^^^^^^^^^^^^^^^^^ unknown field
  993. 259.60 s > |
  994. 259.60 s > = note: available fields are: `particle_pdgs`, `cut_id`, `graph_id`, `graph_group_id`, `orientation_id` ... and 2 others
  995. 259.60 s >
  996. 259.60 s > error[E0609]: no field `lmb_channel_edge_ids` on type `CutInfo`
  997. 259.60 s > --> tests/tests/test_evaluation_api.rs:591:26
  998. 259.60 s > |
  999. 259.60 s > 591 | .lmb_channel_edge_ids
  1000. 259.60 s > | ^^^^^^^^^^^^^^^^^^^^ unknown field
  1001. 259.60 s > |
  1002. 259.60 s > = note: available fields are: `particle_pdgs`, `cut_id`, `graph_id`, `graph_group_id`, `orientation_id` ... and 2 others
  1003. 259.60 s >
  1004. 259.60 s > Some errors have detailed explanations: E0063, E0560.
  1005. 259.60 s > For more information about an error, try `rustc --explain E0063`.
  1006. 259.60 s > error: could not compile `gammaloop-integration-tests` (test "test_differential") due to 4 previous errors
  1007. 259.60 s > warning: build failed, waiting for other jobs to finish...
  1008. 259.60 s > error[E0609]: no field `lmb_channel_edge_ids` on type `CutInfo`
  1009. 259.60 s > --> tests/tests/test_evaluation_api.rs:1177:18
  1010. 259.60 s > |
  1011. 259.60 s > 1177 | .lmb_channel_edge_ids
  1012. 259.60 s > | ^^^^^^^^^^^^^^^^^^^^ unknown field
  1013. 259.60 s > |
  1014. 259.60 s > = note: available fields are: `particle_pdgs`, `cut_id`, `graph_id`, `graph_group_id`, `orientation_id` ... and 2 others
  1015. 259.60 s >
  1016. 259.60 s > error[E0609]: no field `lmb_channel_edge_ids` on type `CutInfo`
  1017. 259.60 s > --> tests/tests/test_evaluation_api.rs:1222:22
  1018. 259.60 s > |
  1019. 259.60 s > 1222 | .lmb_channel_edge_ids
  1020. 259.60 s > | ^^^^^^^^^^^^^^^^^^^^ unknown field
  1021. 259.60 s > |
  1022. 259.60 s > = note: available fields are: `particle_pdgs`, `cut_id`, `graph_id`, `graph_group_id`, `orientation_id` ... and 2 others
  1023. 259.60 s >
  1024. 259.60 s > error[E0609]: no field `lmb_channel_edge_ids` on type `CutInfo`
  1025. 259.60 s > --> tests/tests/test_evaluation_api.rs:1281:14
  1026. 259.60 s > |
  1027. 259.60 s > 1281 | .lmb_channel_edge_ids
  1028. 259.60 s > | ^^^^^^^^^^^^^^^^^^^^ unknown field
  1029. 259.60 s > |
  1030. 259.60 s > = note: available fields are: `particle_pdgs`, `cut_id`, `graph_id`, `graph_group_id`, `orientation_id` ... and 2 others
  1031. 259.60 s >
  1032. 259.60 s > error[E0609]: no field `lmb_channel_edge_ids` on type `CutInfo`
  1033. 259.60 s > --> tests/tests/test_evaluation_api.rs:1428:18
  1034. 259.60 s > |
  1035. 259.60 s > 1428 | .lmb_channel_edge_ids
  1036. 259.60 s > | ^^^^^^^^^^^^^^^^^^^^ unknown field
  1037. 259.60 s > |
  1038. 259.60 s > = note: available fields are: `particle_pdgs`, `cut_id`, `graph_id`, `graph_group_id`, `orientation_id` ... and 2 others
  1039. 259.60 s >
  1040. 259.60 s > For more information about this error, try `rustc --explain E0609`.
  1041. 259.60 s > error: could not compile `gammaloop-integration-tests` (test "test_evaluation_api") due to 6 previous errors
  1042. 259.60 s > error[E0609]: no field `lmb_channel_id` on type `CutInfo`
  1043. 259.60 s > --> tests/tests/test_runs/utils.rs:568:36
  1044. 259.60 s > |
  1045. 259.60 s > 568 | event.cut_info.lmb_channel_id,
  1046. 259.60 s > | ^^^^^^^^^^^^^^ unknown field
  1047. 259.60 s > |
  1048. 259.60 s > = note: available fields are: `particle_pdgs`, `cut_id`, `graph_id`, `graph_group_id`, `orientation_id` ... and 2 others
  1049. 259.60 s >
  1050. 259.60 s > error[E0609]: no field `lmb_channel_id` on type `CutInfo`
  1051. 259.60 s > --> tests/tests/test_runs/utils.rs:580:36
  1052. 259.60 s > |
  1053. 259.60 s > 580 | event.cut_info.lmb_channel_id,
  1054. 259.60 s > | ^^^^^^^^^^^^^^ unknown field
  1055. 259.60 s > |
  1056. 259.60 s > = note: available fields are: `particle_pdgs`, `cut_id`, `graph_id`, `graph_group_id`, `orientation_id` ... and 2 others
  1057. 259.60 s >
  1058. 259.60 s > error: could not compile `gammaloop-integration-tests` (test "test_runs") due to 2 previous errors
  1059. 259.60 s For full logs, run:
  1060. 259.60 s nix log /nix/store/2f1j2lkyg12g36flfbgvv1q9204gpqa0-gammaloop-workspace-check-0.1.0.drv
  1061. 259.63 s Build failed.