1. 0.00 s $ /nix/store/9ypz3flqsrl5xl495mm8h645gadjsxi1-coreutils-9.11/bin/timeout --kill-after=15s 7200s /nix/store/23zk8sgzamrbmj1fday15szf7f2279s8-nix-2.34.7/bin/nix --extra-experimental-features nix-command --extra-experimental-features flakes --log-format internal-json build --no-link --print-out-paths git+https://github.com/alphal00p/gammaloop?ref=advanced_sampling&rev=ad713af8ba0173320df0aef4e53935ec4cf8a238&shallow=1#packages.x86_64-linux.crate-test-binaries-python-api-gammaloop-integration-tests --print-build-logs
  2. 10.23 s
  3. 10.87 s Downloading cached gammaloop-python-module from https://cache.nix-ci.com
  4. 10.87 s Downloading cached gammaloop-crate-test-dependencies-d6e55b48f8214f9c-inputs from https://cache.nix-ci.com
  5. 12.11 s Downloaded cached gammaloop-python-module (146.4 MiB) in 1.2s
  6. 12.11 s Progress: 0 of 4 built, 1 of 4 downloaded from cache (1 downloading)
  7. 30.25 s Downloaded cached gammaloop-crate-test-dependencies-d6e55b48f8214f9c-inputs (3.1 GiB) in 19.3s
  8. 30.25 s Progress: 0 of 3 built, 2 of 4 downloaded from cache
  9. 30.25 s Downloading cached gammaloop-crate-test-dependencies-d6e55b48f8214f9c-deps from https://cache.nix-ci.com
  10. 30.42 s Downloaded cached gammaloop-crate-test-dependencies-d6e55b48f8214f9c-deps (29.9 MiB) in 169ms
  11. 30.42 s Progress: 0 of 3 built, 3 of 4 downloaded from cache
  12. 30.43 s Downloading cached gammaloop-crate-test-binaries-gammaloop-integration-tests-d6e55b48f8214f9c-inputs from https://cache.nix-ci.com
  13. 52.76 s Downloaded cached gammaloop-crate-test-binaries-gammaloop-integration-tests-d6e55b48f8214f9c-inputs (3.2 GiB) in 22.3s
  14. 52.76 s Progress: 0 of 3 built, 4 of 4 downloaded from cache
  15. 52.96 s Building /nix/store/y9lln3gy6zafqrqybglp5alj2wykf6r9-gammaloop-crate-test-binaries-gammaloop-integration-tests-d6e55b48f8214f9c-deps-0.1.0.drv
  16. 53.04 s [gammaloop-crate-test-binaries-gammaloop-integration-tests-d6e55b48f8214f9c-deps] Phase: unpackPhase
  17. 53.04 s [gammaloop-crate-test-binaries-gammaloop-integration-tests-d6e55b48f8214f9c-deps] unpacking source archive /nix/store/a2mf5ss32qm0vv8qxhcf041bxajmsxnq-source
  18. 53.11 s [gammaloop-crate-test-binaries-gammaloop-integration-tests-d6e55b48f8214f9c-deps] source root is source
  19. 53.13 s [gammaloop-crate-test-binaries-gammaloop-integration-tests-d6e55b48f8214f9c-deps] Phase: patchPhase
  20. 53.24 s [gammaloop-crate-test-binaries-gammaloop-integration-tests-d6e55b48f8214f9c-deps] Executing configureCargoCommonVars
  21. 53.24 s [gammaloop-crate-test-binaries-gammaloop-integration-tests-d6e55b48f8214f9c-deps] copying cargo artifacts from /nix/store/mfb414248p3fii27bb1l8z3309p80la0-gammaloop-crate-test-binaries-gammaloop-integration-tests-d6e55b48f8214f9c-inputs/target to target
  22. 53.24 s [gammaloop-crate-test-binaries-gammaloop-integration-tests-d6e55b48f8214f9c-deps] will deep copy artifacts (instead of symlinking) as requested
  23. 55.28 s [gammaloop-crate-test-binaries-gammaloop-integration-tests-d6e55b48f8214f9c-deps] Phase: updateAutotoolsGnuConfigScriptsPhase
  24. 55.38 s [gammaloop-crate-test-binaries-gammaloop-integration-tests-d6e55b48f8214f9c-deps] Phase: configurePhase
  25. 55.40 s [gammaloop-crate-test-binaries-gammaloop-integration-tests-d6e55b48f8214f9c-deps] will append /build/source/.cargo-home/config.toml with contents of /nix/store/5drf77x6km4ky7gwlrzdx9bbd6fz09g3-vendor-cargo-deps/config.toml
  26. 55.40 s [gammaloop-crate-test-binaries-gammaloop-integration-tests-d6e55b48f8214f9c-deps] default configurePhase, nothing to do
  27. 55.41 s [gammaloop-crate-test-binaries-gammaloop-integration-tests-d6e55b48f8214f9c-deps] Phase: buildPhase
  28. 55.41 s [gammaloop-crate-test-binaries-gammaloop-integration-tests-d6e55b48f8214f9c-deps] +++ command cargo --version
  29. 55.42 s [gammaloop-crate-test-binaries-gammaloop-integration-tests-d6e55b48f8214f9c-deps] cargo 1.97.0 (c980f4866 2026-06-30)
  30. 55.42 s [gammaloop-crate-test-binaries-gammaloop-integration-tests-d6e55b48f8214f9c-deps] +++ command cargo test --profile ci-optim --no-run --offline -p gammaloop-integration-tests --features gammaloop-integration-tests/python-api-tests
  31. 57.48 s [gammaloop-crate-test-binaries-gammaloop-integration-tests-d6e55b48f8214f9c-deps] Compiling gammaloop-integration-tests v0.1.0 (/build/source/tests)
  32. 57.65 s [gammaloop-crate-test-binaries-gammaloop-integration-tests-d6e55b48f8214f9c-deps] error[E0560]: struct `CutInfo` has no field named `lmb_channel_id`
  33. 57.65 s [gammaloop-crate-test-binaries-gammaloop-integration-tests-d6e55b48f8214f9c-deps] --> tests/tests/test_differential.rs:86:13
  34. 57.65 s [gammaloop-crate-test-binaries-gammaloop-integration-tests-d6e55b48f8214f9c-deps] |
  35. 57.65 s [gammaloop-crate-test-binaries-gammaloop-integration-tests-d6e55b48f8214f9c-deps] 86 | lmb_channel_id: None,
  36. 57.65 s [gammaloop-crate-test-binaries-gammaloop-integration-tests-d6e55b48f8214f9c-deps] | ^^^^^^^^^^^^^^ `CutInfo` does not have this field
  37. 57.65 s [gammaloop-crate-test-binaries-gammaloop-integration-tests-d6e55b48f8214f9c-deps] |
  38. 57.65 s [gammaloop-crate-test-binaries-gammaloop-integration-tests-d6e55b48f8214f9c-deps] = note: available fields are: `sampling_channel_id`, `sampling_channel_edge_ids`
  39. 57.65 s [gammaloop-crate-test-binaries-gammaloop-integration-tests-d6e55b48f8214f9c-deps]
  40. 57.65 s [gammaloop-crate-test-binaries-gammaloop-integration-tests-d6e55b48f8214f9c-deps] error[E0560]: struct `CutInfo` has no field named `lmb_channel_edge_ids`
  41. 57.65 s [gammaloop-crate-test-binaries-gammaloop-integration-tests-d6e55b48f8214f9c-deps] --> tests/tests/test_differential.rs:87:13
  42. 57.65 s [gammaloop-crate-test-binaries-gammaloop-integration-tests-d6e55b48f8214f9c-deps] |
  43. 57.65 s [gammaloop-crate-test-binaries-gammaloop-integration-tests-d6e55b48f8214f9c-deps] 87 | lmb_channel_edge_ids: None,
  44. 57.65 s [gammaloop-crate-test-binaries-gammaloop-integration-tests-d6e55b48f8214f9c-deps] | ^^^^^^^^^^^^^^^^^^^^ `CutInfo` does not have this field
  45. 57.65 s [gammaloop-crate-test-binaries-gammaloop-integration-tests-d6e55b48f8214f9c-deps] |
  46. 57.65 s [gammaloop-crate-test-binaries-gammaloop-integration-tests-d6e55b48f8214f9c-deps] = note: available fields are: `sampling_channel_id`, `sampling_channel_edge_ids`
  47. 57.65 s [gammaloop-crate-test-binaries-gammaloop-integration-tests-d6e55b48f8214f9c-deps]
  48. 57.67 s [gammaloop-crate-test-binaries-gammaloop-integration-tests-d6e55b48f8214f9c-deps] error[E0063]: missing field `reference_moments` in initializer of `GraphEvaluationResult<_>`
  49. 57.67 s [gammaloop-crate-test-binaries-gammaloop-integration-tests-d6e55b48f8214f9c-deps] --> tests/tests/test_differential.rs:532:19
  50. 57.67 s [gammaloop-crate-test-binaries-gammaloop-integration-tests-d6e55b48f8214f9c-deps] |
  51. 57.67 s [gammaloop-crate-test-binaries-gammaloop-integration-tests-d6e55b48f8214f9c-deps] 532 | let mut lhs = GraphEvaluationResult {
  52. 57.67 s [gammaloop-crate-test-binaries-gammaloop-integration-tests-d6e55b48f8214f9c-deps] | ^^^^^^^^^^^^^^^^^^^^^ missing `reference_moments`
  53. 57.67 s [gammaloop-crate-test-binaries-gammaloop-integration-tests-d6e55b48f8214f9c-deps]
  54. 57.67 s [gammaloop-crate-test-binaries-gammaloop-integration-tests-d6e55b48f8214f9c-deps] error[E0063]: missing field `reference_moments` in initializer of `GraphEvaluationResult<_>`
  55. 57.67 s [gammaloop-crate-test-binaries-gammaloop-integration-tests-d6e55b48f8214f9c-deps] --> tests/tests/test_differential.rs:539:15
  56. 57.67 s [gammaloop-crate-test-binaries-gammaloop-integration-tests-d6e55b48f8214f9c-deps] |
  57. 57.67 s [gammaloop-crate-test-binaries-gammaloop-integration-tests-d6e55b48f8214f9c-deps] 539 | let rhs = GraphEvaluationResult {
  58. 57.67 s [gammaloop-crate-test-binaries-gammaloop-integration-tests-d6e55b48f8214f9c-deps] | ^^^^^^^^^^^^^^^^^^^^^ missing `reference_moments`
  59. 57.67 s [gammaloop-crate-test-binaries-gammaloop-integration-tests-d6e55b48f8214f9c-deps]
  60. 57.71 s [gammaloop-crate-test-binaries-gammaloop-integration-tests-d6e55b48f8214f9c-deps] error[E0609]: no field `lmb_channel_edge_ids` on type `CutInfo`
  61. 57.71 s [gammaloop-crate-test-binaries-gammaloop-integration-tests-d6e55b48f8214f9c-deps] --> tests/tests/test_evaluation_api.rs:311:10
  62. 57.71 s [gammaloop-crate-test-binaries-gammaloop-integration-tests-d6e55b48f8214f9c-deps] |
  63. 57.71 s [gammaloop-crate-test-binaries-gammaloop-integration-tests-d6e55b48f8214f9c-deps] 311 | .lmb_channel_edge_ids
  64. 57.71 s [gammaloop-crate-test-binaries-gammaloop-integration-tests-d6e55b48f8214f9c-deps] | ^^^^^^^^^^^^^^^^^^^^ unknown field
  65. 57.71 s [gammaloop-crate-test-binaries-gammaloop-integration-tests-d6e55b48f8214f9c-deps] |
  66. 57.71 s [gammaloop-crate-test-binaries-gammaloop-integration-tests-d6e55b48f8214f9c-deps] = note: available fields are: `particle_pdgs`, `cut_id`, `graph_id`, `graph_group_id`, `orientation_id` ... and 2 others
  67. 57.71 s [gammaloop-crate-test-binaries-gammaloop-integration-tests-d6e55b48f8214f9c-deps]
  68. 57.75 s [gammaloop-crate-test-binaries-gammaloop-integration-tests-d6e55b48f8214f9c-deps] error[E0609]: no field `lmb_channel_edge_ids` on type `CutInfo`
  69. 57.75 s [gammaloop-crate-test-binaries-gammaloop-integration-tests-d6e55b48f8214f9c-deps] --> tests/tests/test_evaluation_api.rs:591:26
  70. 57.75 s [gammaloop-crate-test-binaries-gammaloop-integration-tests-d6e55b48f8214f9c-deps] |
  71. 57.75 s [gammaloop-crate-test-binaries-gammaloop-integration-tests-d6e55b48f8214f9c-deps] 591 | .lmb_channel_edge_ids
  72. 57.75 s [gammaloop-crate-test-binaries-gammaloop-integration-tests-d6e55b48f8214f9c-deps] | ^^^^^^^^^^^^^^^^^^^^ unknown field
  73. 57.75 s [gammaloop-crate-test-binaries-gammaloop-integration-tests-d6e55b48f8214f9c-deps] |
  74. 57.75 s [gammaloop-crate-test-binaries-gammaloop-integration-tests-d6e55b48f8214f9c-deps] = note: available fields are: `particle_pdgs`, `cut_id`, `graph_id`, `graph_group_id`, `orientation_id` ... and 2 others
  75. 57.75 s [gammaloop-crate-test-binaries-gammaloop-integration-tests-d6e55b48f8214f9c-deps]
  76. 57.76 s [gammaloop-crate-test-binaries-gammaloop-integration-tests-d6e55b48f8214f9c-deps] Some errors have detailed explanations: E0063, E0560.
  77. 57.76 s [gammaloop-crate-test-binaries-gammaloop-integration-tests-d6e55b48f8214f9c-deps] For more information about an error, try `rustc --explain E0063`.
  78. 57.78 s [gammaloop-crate-test-binaries-gammaloop-integration-tests-d6e55b48f8214f9c-deps] error: could not compile `gammaloop-integration-tests` (test "test_differential") due to 4 previous errors
  79. 57.78 s [gammaloop-crate-test-binaries-gammaloop-integration-tests-d6e55b48f8214f9c-deps] warning: build failed, waiting for other jobs to finish...
  80. 57.81 s [gammaloop-crate-test-binaries-gammaloop-integration-tests-d6e55b48f8214f9c-deps] error[E0609]: no field `lmb_channel_edge_ids` on type `CutInfo`
  81. 57.81 s [gammaloop-crate-test-binaries-gammaloop-integration-tests-d6e55b48f8214f9c-deps] --> tests/tests/test_evaluation_api.rs:1177:18
  82. 57.81 s [gammaloop-crate-test-binaries-gammaloop-integration-tests-d6e55b48f8214f9c-deps] |
  83. 57.81 s [gammaloop-crate-test-binaries-gammaloop-integration-tests-d6e55b48f8214f9c-deps] 1177 | .lmb_channel_edge_ids
  84. 57.81 s [gammaloop-crate-test-binaries-gammaloop-integration-tests-d6e55b48f8214f9c-deps] | ^^^^^^^^^^^^^^^^^^^^ unknown field
  85. 57.81 s [gammaloop-crate-test-binaries-gammaloop-integration-tests-d6e55b48f8214f9c-deps] |
  86. 57.81 s [gammaloop-crate-test-binaries-gammaloop-integration-tests-d6e55b48f8214f9c-deps] = note: available fields are: `particle_pdgs`, `cut_id`, `graph_id`, `graph_group_id`, `orientation_id` ... and 2 others
  87. 57.81 s [gammaloop-crate-test-binaries-gammaloop-integration-tests-d6e55b48f8214f9c-deps]
  88. 58.00 s [gammaloop-crate-test-binaries-gammaloop-integration-tests-d6e55b48f8214f9c-deps] error[E0609]: no field `lmb_channel_edge_ids` on type `CutInfo`
  89. 58.00 s [gammaloop-crate-test-binaries-gammaloop-integration-tests-d6e55b48f8214f9c-deps] --> tests/tests/test_evaluation_api.rs:1222:22
  90. 58.00 s [gammaloop-crate-test-binaries-gammaloop-integration-tests-d6e55b48f8214f9c-deps] |
  91. 58.00 s [gammaloop-crate-test-binaries-gammaloop-integration-tests-d6e55b48f8214f9c-deps] 1222 | .lmb_channel_edge_ids
  92. 58.00 s [gammaloop-crate-test-binaries-gammaloop-integration-tests-d6e55b48f8214f9c-deps] | ^^^^^^^^^^^^^^^^^^^^ unknown field
  93. 58.00 s [gammaloop-crate-test-binaries-gammaloop-integration-tests-d6e55b48f8214f9c-deps] |
  94. 58.00 s [gammaloop-crate-test-binaries-gammaloop-integration-tests-d6e55b48f8214f9c-deps] = note: available fields are: `particle_pdgs`, `cut_id`, `graph_id`, `graph_group_id`, `orientation_id` ... and 2 others
  95. 58.00 s [gammaloop-crate-test-binaries-gammaloop-integration-tests-d6e55b48f8214f9c-deps]
  96. 58.01 s [gammaloop-crate-test-binaries-gammaloop-integration-tests-d6e55b48f8214f9c-deps] error[E0609]: no field `lmb_channel_edge_ids` on type `CutInfo`
  97. 58.01 s [gammaloop-crate-test-binaries-gammaloop-integration-tests-d6e55b48f8214f9c-deps] --> tests/tests/test_evaluation_api.rs:1281:14
  98. 58.01 s [gammaloop-crate-test-binaries-gammaloop-integration-tests-d6e55b48f8214f9c-deps] |
  99. 58.01 s [gammaloop-crate-test-binaries-gammaloop-integration-tests-d6e55b48f8214f9c-deps] 1281 | .lmb_channel_edge_ids
  100. 58.01 s [gammaloop-crate-test-binaries-gammaloop-integration-tests-d6e55b48f8214f9c-deps] | ^^^^^^^^^^^^^^^^^^^^ unknown field
  101. 58.01 s [gammaloop-crate-test-binaries-gammaloop-integration-tests-d6e55b48f8214f9c-deps] |
  102. 58.01 s [gammaloop-crate-test-binaries-gammaloop-integration-tests-d6e55b48f8214f9c-deps] = note: available fields are: `particle_pdgs`, `cut_id`, `graph_id`, `graph_group_id`, `orientation_id` ... and 2 others
  103. 58.01 s [gammaloop-crate-test-binaries-gammaloop-integration-tests-d6e55b48f8214f9c-deps]
  104. 58.11 s [gammaloop-crate-test-binaries-gammaloop-integration-tests-d6e55b48f8214f9c-deps] error[E0609]: no field `lmb_channel_edge_ids` on type `CutInfo`
  105. 58.11 s [gammaloop-crate-test-binaries-gammaloop-integration-tests-d6e55b48f8214f9c-deps] --> tests/tests/test_evaluation_api.rs:1428:18
  106. 58.11 s [gammaloop-crate-test-binaries-gammaloop-integration-tests-d6e55b48f8214f9c-deps] |
  107. 58.11 s [gammaloop-crate-test-binaries-gammaloop-integration-tests-d6e55b48f8214f9c-deps] 1428 | .lmb_channel_edge_ids
  108. 58.11 s [gammaloop-crate-test-binaries-gammaloop-integration-tests-d6e55b48f8214f9c-deps] | ^^^^^^^^^^^^^^^^^^^^ unknown field
  109. 58.11 s [gammaloop-crate-test-binaries-gammaloop-integration-tests-d6e55b48f8214f9c-deps] |
  110. 58.11 s [gammaloop-crate-test-binaries-gammaloop-integration-tests-d6e55b48f8214f9c-deps] = note: available fields are: `particle_pdgs`, `cut_id`, `graph_id`, `graph_group_id`, `orientation_id` ... and 2 others
  111. 58.11 s [gammaloop-crate-test-binaries-gammaloop-integration-tests-d6e55b48f8214f9c-deps]
  112. 58.35 s [gammaloop-crate-test-binaries-gammaloop-integration-tests-d6e55b48f8214f9c-deps] For more information about this error, try `rustc --explain E0609`.
  113. 58.38 s [gammaloop-crate-test-binaries-gammaloop-integration-tests-d6e55b48f8214f9c-deps] error: could not compile `gammaloop-integration-tests` (test "test_evaluation_api") due to 6 previous errors
  114. 59.52 s [gammaloop-crate-test-binaries-gammaloop-integration-tests-d6e55b48f8214f9c-deps] error[E0609]: no field `lmb_channel_id` on type `CutInfo`
  115. 59.52 s [gammaloop-crate-test-binaries-gammaloop-integration-tests-d6e55b48f8214f9c-deps] --> tests/tests/test_runs/utils.rs:568:36
  116. 59.52 s [gammaloop-crate-test-binaries-gammaloop-integration-tests-d6e55b48f8214f9c-deps] |
  117. 59.52 s [gammaloop-crate-test-binaries-gammaloop-integration-tests-d6e55b48f8214f9c-deps] 568 | event.cut_info.lmb_channel_id,
  118. 59.52 s [gammaloop-crate-test-binaries-gammaloop-integration-tests-d6e55b48f8214f9c-deps] | ^^^^^^^^^^^^^^ unknown field
  119. 59.52 s [gammaloop-crate-test-binaries-gammaloop-integration-tests-d6e55b48f8214f9c-deps] |
  120. 59.52 s [gammaloop-crate-test-binaries-gammaloop-integration-tests-d6e55b48f8214f9c-deps] = note: available fields are: `particle_pdgs`, `cut_id`, `graph_id`, `graph_group_id`, `orientation_id` ... and 2 others
  121. 59.52 s [gammaloop-crate-test-binaries-gammaloop-integration-tests-d6e55b48f8214f9c-deps]
  122. 59.52 s [gammaloop-crate-test-binaries-gammaloop-integration-tests-d6e55b48f8214f9c-deps] error[E0609]: no field `lmb_channel_id` on type `CutInfo`
  123. 59.52 s [gammaloop-crate-test-binaries-gammaloop-integration-tests-d6e55b48f8214f9c-deps] --> tests/tests/test_runs/utils.rs:580:36
  124. 59.52 s [gammaloop-crate-test-binaries-gammaloop-integration-tests-d6e55b48f8214f9c-deps] |
  125. 59.52 s [gammaloop-crate-test-binaries-gammaloop-integration-tests-d6e55b48f8214f9c-deps] 580 | event.cut_info.lmb_channel_id,
  126. 59.52 s [gammaloop-crate-test-binaries-gammaloop-integration-tests-d6e55b48f8214f9c-deps] | ^^^^^^^^^^^^^^ unknown field
  127. 59.52 s [gammaloop-crate-test-binaries-gammaloop-integration-tests-d6e55b48f8214f9c-deps] |
  128. 59.52 s [gammaloop-crate-test-binaries-gammaloop-integration-tests-d6e55b48f8214f9c-deps] = note: available fields are: `particle_pdgs`, `cut_id`, `graph_id`, `graph_group_id`, `orientation_id` ... and 2 others
  129. 59.52 s [gammaloop-crate-test-binaries-gammaloop-integration-tests-d6e55b48f8214f9c-deps]
  130. 60.69 s [gammaloop-crate-test-binaries-gammaloop-integration-tests-d6e55b48f8214f9c-deps] error: could not compile `gammaloop-integration-tests` (test "test_runs") due to 2 previous errors
  131. 125.92 s Progress: 0 of 2 built (1 failed), 4 of 4 downloaded from cache
  132. 125.92 s Failed to build gammaloop-crate-test-binaries-gammaloop-integration-tests-d6e55b48f8214f9c-deps after 1m12s
  133. 125.93 s error: Cannot build '/nix/store/y9lln3gy6zafqrqybglp5alj2wykf6r9-gammaloop-crate-test-binaries-gammaloop-integration-tests-d6e55b48f8214f9c-deps-0.1.0.drv'.
  134. 125.93 s Reason: builder failed with exit code 101.
  135. 125.93 s Output paths:
  136. 125.93 s /nix/store/p97fy69k7fjn19pkl3jw963frbgdzgl8-gammaloop-crate-test-binaries-gammaloop-integration-tests-d6e55b48f8214f9c-deps-0.1.0
  137. 125.93 s Last 115 log lines:
  138. 125.93 s > Running phase: unpackPhase
  139. 125.93 s > unpacking source archive /nix/store/a2mf5ss32qm0vv8qxhcf041bxajmsxnq-source
  140. 125.93 s > source root is source
  141. 125.93 s > Running phase: patchPhase
  142. 125.93 s > Executing configureCargoCommonVars
  143. 125.93 s > copying cargo artifacts from /nix/store/mfb414248p3fii27bb1l8z3309p80la0-gammaloop-crate-test-binaries-gammaloop-integration-tests-d6e55b48f8214f9c-inputs/target to target
  144. 125.93 s > will deep copy artifacts (instead of symlinking) as requested
  145. 125.93 s > Running phase: updateAutotoolsGnuConfigScriptsPhase
  146. 125.93 s > Running phase: configurePhase
  147. 125.93 s > will append /build/source/.cargo-home/config.toml with contents of /nix/store/5drf77x6km4ky7gwlrzdx9bbd6fz09g3-vendor-cargo-deps/config.toml
  148. 125.93 s > default configurePhase, nothing to do
  149. 125.93 s > Running phase: buildPhase
  150. 125.93 s > +++ command cargo --version
  151. 125.93 s > cargo 1.97.0 (c980f4866 2026-06-30)
  152. 125.93 s > +++ command cargo test --profile ci-optim --no-run --offline -p gammaloop-integration-tests --features gammaloop-integration-tests/python-api-tests
  153. 125.93 s > Compiling gammaloop-integration-tests v0.1.0 (/build/source/tests)
  154. 125.93 s > error[E0560]: struct `CutInfo` has no field named `lmb_channel_id`
  155. 125.93 s > --> tests/tests/test_differential.rs:86:13
  156. 125.93 s > |
  157. 125.93 s > 86 | lmb_channel_id: None,
  158. 125.93 s > | ^^^^^^^^^^^^^^ `CutInfo` does not have this field
  159. 125.93 s > |
  160. 125.93 s > = note: available fields are: `sampling_channel_id`, `sampling_channel_edge_ids`
  161. 125.93 s >
  162. 125.93 s > error[E0560]: struct `CutInfo` has no field named `lmb_channel_edge_ids`
  163. 125.93 s > --> tests/tests/test_differential.rs:87:13
  164. 125.93 s > |
  165. 125.93 s > 87 | lmb_channel_edge_ids: None,
  166. 125.93 s > | ^^^^^^^^^^^^^^^^^^^^ `CutInfo` does not have this field
  167. 125.93 s > |
  168. 125.93 s > = note: available fields are: `sampling_channel_id`, `sampling_channel_edge_ids`
  169. 125.93 s >
  170. 125.93 s > error[E0063]: missing field `reference_moments` in initializer of `GraphEvaluationResult<_>`
  171. 125.93 s > --> tests/tests/test_differential.rs:532:19
  172. 125.93 s > |
  173. 125.93 s > 532 | let mut lhs = GraphEvaluationResult {
  174. 125.93 s > | ^^^^^^^^^^^^^^^^^^^^^ missing `reference_moments`
  175. 125.93 s >
  176. 125.93 s > error[E0063]: missing field `reference_moments` in initializer of `GraphEvaluationResult<_>`
  177. 125.93 s > --> tests/tests/test_differential.rs:539:15
  178. 125.93 s > |
  179. 125.93 s > 539 | let rhs = GraphEvaluationResult {
  180. 125.93 s > | ^^^^^^^^^^^^^^^^^^^^^ missing `reference_moments`
  181. 125.93 s >
  182. 125.93 s > error[E0609]: no field `lmb_channel_edge_ids` on type `CutInfo`
  183. 125.93 s > --> tests/tests/test_evaluation_api.rs:311:10
  184. 125.93 s > |
  185. 125.93 s > 311 | .lmb_channel_edge_ids
  186. 125.93 s > | ^^^^^^^^^^^^^^^^^^^^ unknown field
  187. 125.93 s > |
  188. 125.93 s > = note: available fields are: `particle_pdgs`, `cut_id`, `graph_id`, `graph_group_id`, `orientation_id` ... and 2 others
  189. 125.93 s >
  190. 125.93 s > error[E0609]: no field `lmb_channel_edge_ids` on type `CutInfo`
  191. 125.93 s > --> tests/tests/test_evaluation_api.rs:591:26
  192. 125.93 s > |
  193. 125.93 s > 591 | .lmb_channel_edge_ids
  194. 125.93 s > | ^^^^^^^^^^^^^^^^^^^^ unknown field
  195. 125.93 s > |
  196. 125.93 s > = note: available fields are: `particle_pdgs`, `cut_id`, `graph_id`, `graph_group_id`, `orientation_id` ... and 2 others
  197. 125.93 s >
  198. 125.93 s > Some errors have detailed explanations: E0063, E0560.
  199. 125.93 s > For more information about an error, try `rustc --explain E0063`.
  200. 125.93 s > error: could not compile `gammaloop-integration-tests` (test "test_differential") due to 4 previous errors
  201. 125.93 s > warning: build failed, waiting for other jobs to finish...
  202. 125.93 s > error[E0609]: no field `lmb_channel_edge_ids` on type `CutInfo`
  203. 125.93 s > --> tests/tests/test_evaluation_api.rs:1177:18
  204. 125.93 s > |
  205. 125.93 s > 1177 | .lmb_channel_edge_ids
  206. 125.93 s > | ^^^^^^^^^^^^^^^^^^^^ unknown field
  207. 125.93 s > |
  208. 125.93 s > = note: available fields are: `particle_pdgs`, `cut_id`, `graph_id`, `graph_group_id`, `orientation_id` ... and 2 others
  209. 125.93 s >
  210. 125.93 s > error[E0609]: no field `lmb_channel_edge_ids` on type `CutInfo`
  211. 125.93 s > --> tests/tests/test_evaluation_api.rs:1222:22
  212. 125.93 s > |
  213. 125.93 s > 1222 | .lmb_channel_edge_ids
  214. 125.93 s > | ^^^^^^^^^^^^^^^^^^^^ unknown field
  215. 125.93 s > |
  216. 125.93 s > = note: available fields are: `particle_pdgs`, `cut_id`, `graph_id`, `graph_group_id`, `orientation_id` ... and 2 others
  217. 125.93 s >
  218. 125.93 s > error[E0609]: no field `lmb_channel_edge_ids` on type `CutInfo`
  219. 125.93 s > --> tests/tests/test_evaluation_api.rs:1281:14
  220. 125.93 s > |
  221. 125.93 s > 1281 | .lmb_channel_edge_ids
  222. 125.93 s > | ^^^^^^^^^^^^^^^^^^^^ unknown field
  223. 125.93 s > |
  224. 125.93 s > = note: available fields are: `particle_pdgs`, `cut_id`, `graph_id`, `graph_group_id`, `orientation_id` ... and 2 others
  225. 125.93 s >
  226. 125.93 s > error[E0609]: no field `lmb_channel_edge_ids` on type `CutInfo`
  227. 125.93 s > --> tests/tests/test_evaluation_api.rs:1428:18
  228. 125.93 s > |
  229. 125.93 s > 1428 | .lmb_channel_edge_ids
  230. 125.93 s > | ^^^^^^^^^^^^^^^^^^^^ unknown field
  231. 125.93 s > |
  232. 125.93 s > = note: available fields are: `particle_pdgs`, `cut_id`, `graph_id`, `graph_group_id`, `orientation_id` ... and 2 others
  233. 125.93 s >
  234. 125.93 s > For more information about this error, try `rustc --explain E0609`.
  235. 125.93 s > error: could not compile `gammaloop-integration-tests` (test "test_evaluation_api") due to 6 previous errors
  236. 125.93 s > error[E0609]: no field `lmb_channel_id` on type `CutInfo`
  237. 125.93 s > --> tests/tests/test_runs/utils.rs:568:36
  238. 125.93 s > |
  239. 125.93 s > 568 | event.cut_info.lmb_channel_id,
  240. 125.93 s > | ^^^^^^^^^^^^^^ unknown field
  241. 125.93 s > |
  242. 125.93 s > = note: available fields are: `particle_pdgs`, `cut_id`, `graph_id`, `graph_group_id`, `orientation_id` ... and 2 others
  243. 125.93 s >
  244. 125.93 s > error[E0609]: no field `lmb_channel_id` on type `CutInfo`
  245. 125.93 s > --> tests/tests/test_runs/utils.rs:580:36
  246. 125.93 s > |
  247. 125.93 s > 580 | event.cut_info.lmb_channel_id,
  248. 125.93 s > | ^^^^^^^^^^^^^^ unknown field
  249. 125.93 s > |
  250. 125.93 s > = note: available fields are: `particle_pdgs`, `cut_id`, `graph_id`, `graph_group_id`, `orientation_id` ... and 2 others
  251. 125.93 s >
  252. 125.93 s > error: could not compile `gammaloop-integration-tests` (test "test_runs") due to 2 previous errors
  253. 125.93 s For full logs, run:
  254. 125.93 s nix log /nix/store/y9lln3gy6zafqrqybglp5alj2wykf6r9-gammaloop-crate-test-binaries-gammaloop-integration-tests-d6e55b48f8214f9c-deps-0.1.0.drv
  255. 125.93 s error: Cannot build '/nix/store/hhhl8803dsipi40hpgplqymzcrlkddp3-nix-ci-artifact-barrier-crate-test-binaries-python-api-gammaloop-integration-tests.drv'.
  256. 125.93 s Reason: 1 dependency failed.
  257. 125.93 s Output paths:
  258. 125.93 s /nix/store/x6s28q9k9hx0qh4kcqpc0hgn0877bsrm-nix-ci-artifact-barrier-crate-test-binaries-python-api-gammaloop-integration-tests
  259. 125.93 s Build failed due to failed dependency
  260. 126.04 s Build failed.