build checks.x86_64-linux.gammaloop-check
0.00 s
$ /nix/store/9ypz3flqsrl5xl495mm8h645gadjsxi1-coreutils-9.11/bin/timeout --kill-after=15s 7200s /nix/store/23zk8sgzamrbmj1fday15szf7f2279s8-nix-2.34.7/bin/nix --extra-experimental-features nix-command --extra-experimental-features flakes --log-format internal-json build --no-link --print-out-paths git+https://github.com/alphal00p/gammaloop?ref=advanced_sampling&rev=cc55e4a91cce0ef30491318a3a7031fd710c44d7&shallow=1#checks.x86_64-linux.gammaloop-check --print-build-logs
0.13 s
error (ignored): SQLite database '/var/cache/nix-ci-worker/eval-cache-v6/05ab4b66505e25f5d9e7f8737745ba19834df15e9de187eb4a690c3842856d66.sqlite ' is busy
2.35 s
2.59 s
Building /nix/store/xx19zb0ypp54ncq730s03znjvrk53ng6-gammaloop-workspace-check-0.1.0.drv
2.65 s
[gammaloop-workspace-check] Phase: unpackPhase
2.66 s
[gammaloop-workspace-check] unpacking source archive /nix/store/347q9p0qp2wa20ngg5lpvsij2vdjh4wr-source
2.80 s
[gammaloop-workspace-check] source root is source
2.83 s
[gammaloop-workspace-check] Phase: patchPhase
2.84 s
[gammaloop-workspace-check] Executing configureCargoCommonVars
2.84 s
[gammaloop-workspace-check] decompressing cargo artifacts from /nix/store/50vpxlcgfxf2d57i27v3d10zjwxxbm2r-gammaloop-workspace-deps-deps-0.1.0/target.tar.zst to target
4.06 s
[gammaloop-workspace-check] Phase: updateAutotoolsGnuConfigScriptsPhase
4.09 s
[gammaloop-workspace-check] Phase: configurePhase
4.09 s
[gammaloop-workspace-check] will append /build/source/.cargo-home/config.toml with contents of /nix/store/5drf77x6km4ky7gwlrzdx9bbd6fz09g3-vendor-cargo-deps/config.toml
4.10 s
[gammaloop-workspace-check] default configurePhase, nothing to do
4.10 s
[gammaloop-workspace-check] Phase: buildPhase
4.10 s
[gammaloop-workspace-check] +++ command cargo --version
4.11 s
[gammaloop-workspace-check] cargo 1.97.0 (c980f4866 2026-06-30)
4.13 s
[gammaloop-workspace-check] +++ command cargo check --profile ci-optim --locked --workspace --features gammaloop-tracing-filter/clap,gammaloop-tracing-filter/symbolica,idenso/bincode,idenso/reference-cases,linnet/bincode,linnet/drawing,linnet/rkyv,linnet/serde,linnet/symbolica,spenso-macros/shadowing,spenso/shadowing,symbolica/tracing_max_level_info,three-dimensional-reps/display,three-dimensional-reps/eval,three-dimensional-reps/serde --all-targets
4.61 s
[gammaloop-workspace-check] Checking cfg-if v1.0.4
4.61 s
[gammaloop-workspace-check] Checking memchr v2.8.0
4.61 s
[gammaloop-workspace-check] Checking once_cell v1.21.4
4.62 s
[gammaloop-workspace-check] Checking either v1.15.0
4.62 s
[gammaloop-workspace-check] Checking serde_core v1.0.228
4.62 s
[gammaloop-workspace-check] Checking libc v0.2.186
4.62 s
[gammaloop-workspace-check] Checking libm v0.2.16
4.63 s
[gammaloop-workspace-check] Checking itoa v1.0.18
4.64 s
[gammaloop-workspace-check] Checking log v0.4.29
4.64 s
[gammaloop-workspace-check] Checking regex-syntax v0.8.10
4.65 s
[gammaloop-workspace-check] Checking zerocopy v0.8.48
4.65 s
[gammaloop-workspace-check] Checking crossbeam-utils v0.8.21
4.65 s
[gammaloop-workspace-check] Checking equivalent v1.0.2
4.66 s
[gammaloop-workspace-check] Checking zmij v1.0.21
4.66 s
[gammaloop-workspace-check] Checking bytemuck v1.25.0
4.67 s
[gammaloop-workspace-check] Checking lazy_static v1.5.0
4.67 s
[gammaloop-workspace-check] Compiling target-lexicon v0.13.5
4.69 s
[gammaloop-workspace-check] Checking arrayvec v0.7.6
4.72 s
[gammaloop-workspace-check] Checking powerfmt v0.2.0
4.73 s
[gammaloop-workspace-check] Checking num_threads v0.1.7
4.74 s
[gammaloop-workspace-check] Checking itertools v0.14.0
4.76 s
[gammaloop-workspace-check] Checking pin-project-lite v0.2.17
4.77 s
[gammaloop-workspace-check] Checking time-core v0.1.8
4.78 s
[gammaloop-workspace-check] Checking num-conv v0.2.1
4.80 s
[gammaloop-workspace-check] Checking safe_arch v0.7.4
4.81 s
[gammaloop-workspace-check] Checking tracing-core v0.1.36
4.82 s
[gammaloop-workspace-check] Checking deranged v0.5.8
4.86 s
[gammaloop-workspace-check] Checking foldhash v0.2.0
4.87 s
[gammaloop-workspace-check] Checking allocator-api2 v0.2.21
4.88 s
[gammaloop-workspace-check] Checking const-random v0.1.18
4.91 s
[gammaloop-workspace-check] Checking unty v0.0.4
4.92 s
[gammaloop-workspace-check] Checking nu-ansi-term v0.50.3
4.93 s
[gammaloop-workspace-check] Checking crossbeam-epoch v0.9.18
4.95 s
[gammaloop-workspace-check] Checking static_assertions v1.1.0
4.96 s
[gammaloop-workspace-check] Checking winnow v1.0.2
4.99 s
[gammaloop-workspace-check] Checking safe_arch v1.0.0
5.01 s
[gammaloop-workspace-check] Checking wide v0.7.33
5.05 s
[gammaloop-workspace-check] Checking aho-corasick v1.1.4
5.09 s
[gammaloop-workspace-check] Checking sharded-slab v0.1.7
5.10 s
[gammaloop-workspace-check] Checking crossbeam-deque v0.8.6
5.15 s
[gammaloop-workspace-check] Checking tracing-log v0.2.0
5.16 s
[gammaloop-workspace-check] Checking hashbrown v0.16.1
5.23 s
[gammaloop-workspace-check] Checking tracing v0.1.44
5.28 s
[gammaloop-workspace-check] Checking rayon-core v1.13.0
5.34 s
[gammaloop-workspace-check] Checking thread_local v1.1.9
5.34 s
[gammaloop-workspace-check] Checking az v1.3.0
5.39 s
[gammaloop-workspace-check] Checking num-traits v0.2.19
5.42 s
[gammaloop-workspace-check] Checking indenter v0.3.4
5.49 s
[gammaloop-workspace-check] Checking toml_writer v1.1.1+spec-1.1.0
5.57 s
[gammaloop-workspace-check] Checking wide v1.3.0
5.61 s
[gammaloop-workspace-check] Checking rayon v1.12.0
5.62 s
[gammaloop-workspace-check] Compiling phf_shared v0.11.3
5.66 s
[gammaloop-workspace-check] Checking anyhow v1.0.102
5.72 s
[gammaloop-workspace-check] Checking rawpointer v0.2.1
5.78 s
[gammaloop-workspace-check] Checking alloc-no-stdlib v2.0.4
5.79 s
[gammaloop-workspace-check] Checking dyn-clone v1.0.20
5.82 s
[gammaloop-workspace-check] Checking utf8parse v0.2.2
5.83 s
[gammaloop-workspace-check] Checking getrandom v0.3.4
5.84 s
[gammaloop-workspace-check] Checking time v0.3.47
5.85 s
[gammaloop-workspace-check] Checking toml_parser v1.1.2+spec-1.1.0
5.86 s
[gammaloop-workspace-check] Checking approx v0.5.1
5.86 s
[gammaloop-workspace-check] Checking num-integer v0.1.46
5.87 s
[gammaloop-workspace-check] Checking gmp-mpfr-sys v1.7.1
5.89 s
[gammaloop-workspace-check] Checking alloc-stdlib v0.2.2
5.89 s
[gammaloop-workspace-check] Checking anstyle-parse v1.0.0
5.95 s
[gammaloop-workspace-check] Checking rand_core v0.9.5
5.96 s
[gammaloop-workspace-check] Checking matrixmultiply v0.3.10
5.97 s
[gammaloop-workspace-check] Checking regex-automata v0.4.14
5.98 s
[gammaloop-workspace-check] Checking anstyle v1.0.14
5.98 s
[gammaloop-workspace-check] Checking anstyle-query v1.1.5
6.03 s
[gammaloop-workspace-check] Checking is_terminal_polyfill v1.70.2
6.04 s
[gammaloop-workspace-check] Checking colorchoice v1.0.5
6.06 s
[gammaloop-workspace-check] Checking colored v3.1.1
6.09 s
[gammaloop-workspace-check] Compiling phf_generator v0.11.3
6.09 s
[gammaloop-workspace-check] Checking eyre v0.6.12
6.10 s
[gammaloop-workspace-check] Checking bitflags v1.3.2
6.11 s
[gammaloop-workspace-check] Compiling pyo3-build-config v0.28.3
6.11 s
[gammaloop-workspace-check] Checking unicode-width v0.2.2
6.13 s
[gammaloop-workspace-check] Checking anstream v1.0.0
6.13 s
[gammaloop-workspace-check] Checking brotli-decompressor v5.0.0
6.13 s
[gammaloop-workspace-check] Checking serde v1.0.228
6.15 s
[gammaloop-workspace-check] Checking serde_json v1.0.149
6.23 s
[gammaloop-workspace-check] Checking bitflags v2.11.1
6.24 s
[gammaloop-workspace-check] Checking serde_spanned v1.1.1
6.27 s
[gammaloop-workspace-check] Checking toml_datetime v1.1.1+spec-1.1.0
6.27 s
[gammaloop-workspace-check] Compiling phf_codegen v0.11.3
6.29 s
[gammaloop-workspace-check] Checking region v3.0.2
6.32 s
[gammaloop-workspace-check] Checking wasmtime-jit-icache-coherence v34.0.2
6.34 s
[gammaloop-workspace-check] Checking hugepage-rs v0.1.1
6.37 s
[gammaloop-workspace-check] Checking inventory v0.3.24
6.37 s
[gammaloop-workspace-check] Checking spec_math v0.1.6
6.39 s
[gammaloop-workspace-check] Checking thiserror v2.0.18
6.42 s
[gammaloop-workspace-check] Compiling getopts v0.2.24
6.42 s
[gammaloop-workspace-check] Checking libloading v0.9.0
6.44 s
[gammaloop-workspace-check] Checking bytes v1.11.1
6.45 s
[gammaloop-workspace-check] Checking toml v1.1.2+spec-1.1.0
6.46 s
[gammaloop-workspace-check] Checking append-only-vec v0.1.8
6.50 s
[gammaloop-workspace-check] Checking byteorder v1.5.0
6.54 s
[gammaloop-workspace-check] Checking tinyjson v2.5.1
6.55 s
[gammaloop-workspace-check] Checking self_cell v1.2.2
6.63 s
[gammaloop-workspace-check] Compiling unic-common v0.9.0
6.66 s
[gammaloop-workspace-check] Compiling unicode_names2_generator v1.3.0
6.68 s
[gammaloop-workspace-check] Checking smallvec v1.15.1
6.73 s
[gammaloop-workspace-check] Checking num-complex v0.4.6
6.74 s
[gammaloop-workspace-check] Checking tracing-serde v0.2.0
6.75 s
[gammaloop-workspace-check] Checking bincode v2.0.1
6.82 s
[gammaloop-workspace-check] Checking smartstring v1.0.1
6.83 s
[gammaloop-workspace-check] Checking linux-raw-sys v0.12.1
6.85 s
[gammaloop-workspace-check] Checking brotli v8.0.2
6.91 s
[gammaloop-workspace-check] Compiling unic-char-range v0.9.0
6.97 s
[gammaloop-workspace-check] Compiling unic-ucd-version v0.9.0
6.98 s
[gammaloop-workspace-check] Compiling unic-char-property v0.9.0
7.01 s
[gammaloop-workspace-check] Compiling is-macro v0.3.7
7.02 s
[gammaloop-workspace-check] Compiling rustpython-parser-vendored v0.4.0
7.03 s
[gammaloop-workspace-check] Checking simba v0.9.1
7.07 s
[gammaloop-workspace-check] Checking iana-time-zone v0.1.65
7.11 s
[gammaloop-workspace-check] Checking rustix v1.1.4
7.13 s
[gammaloop-workspace-check] Compiling rustpython-parser v0.4.0
7.17 s
[gammaloop-workspace-check] Compiling phf v0.11.3
7.18 s
[gammaloop-workspace-check] Checking rustc-hash v2.1.2
7.20 s
[gammaloop-workspace-check] Checking chrono v0.4.44
7.24 s
[gammaloop-workspace-check] Compiling unic-emoji-char v0.9.0
7.24 s
[gammaloop-workspace-check] Compiling unic-ucd-ident v0.9.0
7.35 s
[gammaloop-workspace-check] Checking ndarray v0.17.2
7.37 s
[gammaloop-workspace-check] Compiling lalrpop-util v0.20.2
7.40 s
[gammaloop-workspace-check] Compiling rustc-hash v1.1.0
7.48 s
[gammaloop-workspace-check] Checking rug v1.30.0
7.50 s
[gammaloop-workspace-check] Compiling symbolica v2.2.0 (https://github.com/alphal00p/symbolica?rev=a277a8dadbaae5a8d6605f2f381991a601e1f345#a277a8da)
7.53 s
[gammaloop-workspace-check] Checking unicode-segmentation v1.13.2
7.56 s
[gammaloop-workspace-check] Checking typenum v1.20.0
7.57 s
[gammaloop-workspace-check] Checking getrandom v0.2.17
7.79 s
[gammaloop-workspace-check] Checking scopeguard v1.2.0
7.80 s
[gammaloop-workspace-check] Checking parking_lot_core v0.9.12
7.86 s
[gammaloop-workspace-check] Checking lock_api v0.4.14
7.93 s
[gammaloop-workspace-check] Checking ppv-lite86 v0.2.21
7.94 s
[gammaloop-workspace-check] Checking ahash v0.8.12
8.02 s
[gammaloop-workspace-check] Checking hashbrown v0.17.0
8.04 s
[gammaloop-workspace-check] Checking unicode-ident v1.0.24
8.12 s
[gammaloop-workspace-check] Checking parking_lot v0.12.5
8.19 s
[gammaloop-workspace-check] Checking errno v0.3.14
8.24 s
[gammaloop-workspace-check] Checking rand_chacha v0.9.0
8.25 s
[gammaloop-workspace-check] Checking matchers v0.2.0
8.31 s
[gammaloop-workspace-check] Checking regex v1.12.3
8.33 s
[gammaloop-workspace-check] Checking tracing-subscriber v0.3.23
8.35 s
[gammaloop-workspace-check] Checking strsim v0.11.1
8.37 s
[gammaloop-workspace-check] Checking rand v0.9.4
8.56 s
[gammaloop-workspace-check] Checking clap_lex v1.1.0
8.57 s
[gammaloop-workspace-check] Checking indexmap v2.14.0
8.62 s
[gammaloop-workspace-check] Checking unicase v2.9.0
8.67 s
[gammaloop-workspace-check] Checking signal-hook-registry v1.4.8
8.72 s
[gammaloop-workspace-check] Checking vte v0.14.1
8.76 s
[gammaloop-workspace-check] Checking terminal_size v0.4.4
8.78 s
[gammaloop-workspace-check] Checking same-file v1.0.6
8.83 s
[gammaloop-workspace-check] Checking signal-hook v0.3.18
8.84 s
[gammaloop-workspace-check] Checking symjit v2.21.0
8.85 s
[gammaloop-workspace-check] Checking walkdir v2.5.0
8.87 s
[gammaloop-workspace-check] Checking clap_builder v4.6.0
8.98 s
[gammaloop-workspace-check] Checking half v2.7.1
9.00 s
[gammaloop-workspace-check] Checking generic-array v0.14.7
9.02 s
[gammaloop-workspace-check] Checking mio v1.2.0
9.03 s
[gammaloop-workspace-check] Checking minimal-lexical v0.2.1
9.22 s
[gammaloop-workspace-check] Checking ciborium-io v0.2.2
9.28 s
[gammaloop-workspace-check] Checking nom v7.1.3
9.28 s
[gammaloop-workspace-check] Checking ciborium-ll v0.2.2
9.35 s
[gammaloop-workspace-check] Checking derive_more v2.1.1
9.42 s
[gammaloop-workspace-check] Checking num-bigint v0.4.6
9.44 s
[gammaloop-workspace-check] Checking console v0.16.3
9.48 s
[gammaloop-workspace-check] Checking signal-hook-mio v0.2.5
9.49 s
[gammaloop-workspace-check] Checking crypto-common v0.1.7
9.54 s
[gammaloop-workspace-check] Checking block-buffer v0.10.4
9.61 s
[gammaloop-workspace-check] Checking bstr v1.12.1
9.63 s
[gammaloop-workspace-check] Checking cpufeatures v0.2.17
9.65 s
[gammaloop-workspace-check] Checking digest v0.10.7
9.67 s
[gammaloop-workspace-check] Checking winnow v0.7.15
9.71 s
[gammaloop-workspace-check] Checking linux-raw-sys v0.4.15
9.77 s
[gammaloop-workspace-check] Checking ciborium v0.2.2
9.83 s
[gammaloop-workspace-check] Checking sha2 v0.10.9
9.95 s
[gammaloop-workspace-check] Checking globset v0.4.18
10.09 s
[gammaloop-workspace-check] Checking rustix v0.38.44
10.28 s
[gammaloop-workspace-check] Compiling unicode_names2 v1.3.0
10.43 s
[gammaloop-workspace-check] Checking getrandom v0.4.2
10.47 s
[gammaloop-workspace-check] Checking rand_core v0.6.4
10.56 s
[gammaloop-workspace-check] Checking fnv v1.0.7
10.59 s
[gammaloop-workspace-check] Checking fastrand v2.4.1
10.67 s
[gammaloop-workspace-check] Checking plotters-backend v0.3.7
10.69 s
[gammaloop-workspace-check] Checking rust-embed-utils v8.11.0
10.71 s
[gammaloop-workspace-check] Checking serde_spanned v0.6.9
10.81 s
[gammaloop-workspace-check] Checking toml_datetime v0.6.11
10.84 s
[gammaloop-workspace-check] Checking itertools v0.10.5
10.87 s
[gammaloop-workspace-check] Checking clap v4.6.1
10.89 s
[gammaloop-workspace-check] Checking tempfile v3.27.0
10.91 s
[gammaloop-workspace-check] Checking cast v0.3.0
10.98 s
[gammaloop-workspace-check] Checking tap v1.0.1
11.02 s
[gammaloop-workspace-check] Checking crossterm v0.28.1
11.03 s
[gammaloop-workspace-check] Checking plotters-svg v0.3.7
11.09 s
[gammaloop-workspace-check] Checking toml_write v0.1.2
11.15 s
[gammaloop-workspace-check] Checking wyz v0.5.1
11.16 s
[gammaloop-workspace-check] Checking rand_chacha v0.3.1
11.18 s
[gammaloop-workspace-check] Checking plotters v0.3.7
11.27 s
[gammaloop-workspace-check] Checking radium v0.7.0
11.27 s
[gammaloop-workspace-check] Checking ansitok v0.3.0
11.29 s
[gammaloop-workspace-check] Checking typeid v1.0.3
11.39 s
[gammaloop-workspace-check] Checking similar v2.7.0
11.42 s
[gammaloop-workspace-check] Checking tinytemplate v1.2.1
11.52 s
[gammaloop-workspace-check] Checking is-terminal v0.4.17
11.59 s
[gammaloop-workspace-check] Checking oorandom v11.1.5
11.61 s
[gammaloop-workspace-check] Checking funty v2.0.0
11.74 s
[gammaloop-workspace-check] Checking anes v0.1.6
11.79 s
[gammaloop-workspace-check] Checking xprec v0.2.2
11.82 s
[gammaloop-workspace-check] Checking bytecount v0.6.9
11.87 s
[gammaloop-workspace-check] Checking ansi-str v0.9.0
11.96 s
[gammaloop-workspace-check] Checking testing_table v0.3.0
11.99 s
[gammaloop-workspace-check] Checking rand v0.8.6
12.08 s
[gammaloop-workspace-check] Checking ron v0.12.1
12.18 s
[gammaloop-workspace-check] Checking papergrid v0.17.0
12.20 s
[gammaloop-workspace-check] Checking toml_edit v0.22.27
12.33 s
[gammaloop-workspace-check] Checking toml_edit v0.25.11+spec-1.1.0
12.34 s
[gammaloop-workspace-check] Checking uncased v0.9.10
12.36 s
[gammaloop-workspace-check] Checking env_filter v1.0.1
12.45 s
[gammaloop-workspace-check] Checking criterion-plot v0.5.0
12.46 s
[gammaloop-workspace-check] Checking jiff v0.2.24
12.49 s
[gammaloop-workspace-check] Checking ptr_meta v0.1.4
12.56 s
[gammaloop-workspace-check] Checking ucd-trie v0.1.7
12.58 s
[gammaloop-workspace-check] Checking simdutf8 v0.1.5
12.60 s
[gammaloop-workspace-check] Checking bitvec v1.0.1
12.72 s
[gammaloop-workspace-check] Checking pest v2.8.6
12.78 s
[gammaloop-workspace-check] Checking ahash v0.7.8
12.80 s
[gammaloop-workspace-check] Checking bytecheck v0.6.12
12.86 s
[gammaloop-workspace-check] Checking criterion v0.5.1
12.92 s
[gammaloop-workspace-check] Checking approx v0.4.0
12.98 s
[gammaloop-workspace-check] Checking hashbrown v0.12.3
13.09 s
[gammaloop-workspace-check] Checking seahash v4.1.0
13.26 s
[gammaloop-workspace-check] Checking cgmath v0.18.0
13.28 s
[gammaloop-workspace-check] Checking rend v0.4.2
13.54 s
[gammaloop-workspace-check] Checking num-rational v0.4.2
13.69 s
[gammaloop-workspace-check] Checking tabled v0.20.0
13.76 s
[gammaloop-workspace-check] Checking insta v1.47.2
13.89 s
[gammaloop-workspace-check] Checking num-iter v0.1.45
13.98 s
[gammaloop-workspace-check] Checking ref-ops v0.2.5
14.03 s
[gammaloop-workspace-check] Checking rand_xoshiro v0.6.0
14.04 s
[gammaloop-workspace-check] Checking num v0.4.3
14.11 s
[gammaloop-workspace-check] Checking features v0.10.0
14.15 s
[gammaloop-workspace-check] Compiling pyo3-macros-backend v0.28.3
14.20 s
[gammaloop-workspace-check] Compiling pyo3-ffi v0.28.3
14.21 s
[gammaloop-workspace-check] Compiling pyo3 v0.28.3
14.34 s
[gammaloop-workspace-check] Compiling numpy v0.28.0
14.34 s
[gammaloop-workspace-check] Checking dot-parser v0.5.1
14.61 s
[gammaloop-workspace-check] Checking toml v0.8.23
14.75 s
[gammaloop-workspace-check] Checking constcat v0.5.1
14.82 s
[gammaloop-workspace-check] Checking gat-lending-iterator v0.1.8
14.83 s
[gammaloop-workspace-check] Checking colored v2.2.0
15.02 s
[gammaloop-workspace-check] Checking cpufeatures v0.3.0
15.09 s
[gammaloop-workspace-check] Checking constant_time_eq v0.4.2
15.11 s
[gammaloop-workspace-check] Checking arrayref v0.3.9
15.15 s
[gammaloop-workspace-check] Checking base64 v0.22.1
15.17 s
[gammaloop-workspace-check] Checking joinery v2.1.0
15.21 s
[gammaloop-workspace-check] Checking siphasher v1.0.2
15.28 s
[gammaloop-workspace-check] Checking figment v0.10.19
15.39 s
[gammaloop-workspace-check] Checking blake3 v1.8.5
15.41 s
[gammaloop-workspace-check] Checking titlecase v2.2.1
15.43 s
[gammaloop-workspace-check] Checking subprocess v0.2.15
15.44 s
[gammaloop-workspace-check] Checking phf_shared v0.13.1
15.66 s
[gammaloop-workspace-check] Checking rust_lisp v0.18.0
15.68 s
[gammaloop-workspace-check] Compiling vakint v0.1.2 (/build/source/crates/vakint)
15.69 s
[gammaloop-workspace-check] Checking version-compare v0.2.1
15.75 s
[gammaloop-workspace-check] Checking phf v0.13.1
15.90 s
[gammaloop-workspace-check] Checking xpct v0.5.1
15.92 s
[gammaloop-workspace-check] Checking ryu v1.0.23
16.04 s
[gammaloop-workspace-check] Checking castaway v0.2.4
16.09 s
[gammaloop-workspace-check] Checking toml_datetime v0.7.5+spec-1.1.0
16.11 s
[gammaloop-workspace-check] Checking strum v0.27.2
16.13 s
[gammaloop-workspace-check] Checking unicode-truncate v2.0.1
16.15 s
[gammaloop-workspace-check] Checking kasuari v0.4.12
16.16 s
[gammaloop-workspace-check] Checking compact_str v0.9.0
16.23 s
[gammaloop-workspace-check] Checking lru v0.16.4
16.26 s
[gammaloop-workspace-check] Checking string-template-plus v0.4.3
16.29 s
[gammaloop-workspace-check] Checking vte v0.15.0
16.33 s
[gammaloop-workspace-check] Checking portable-atomic v1.13.1
16.33 s
[gammaloop-workspace-check] Checking toml v0.9.12+spec-1.1.0
16.33 s
[gammaloop-workspace-check] Checking unit-prefix v0.5.2
16.44 s
[gammaloop-workspace-check] Checking rand_distr v0.4.3
16.52 s
[gammaloop-workspace-check] Checking simba v0.6.0
16.55 s
[gammaloop-workspace-check] Checking line-clipping v0.3.7
16.56 s
[gammaloop-workspace-check] Checking adler2 v2.0.1
16.59 s
[gammaloop-workspace-check] Checking gimli v0.32.3
16.62 s
[gammaloop-workspace-check] Checking vt100 v0.16.2
16.70 s
[gammaloop-workspace-check] Compiling three-dimensional-reps v0.1.0 (/build/source/crates/three-dimensional-reps)
16.76 s
[gammaloop-workspace-check] Checking miniz_oxide v0.8.9
16.79 s
[gammaloop-workspace-check] Checking thiserror v1.0.69
16.86 s
[gammaloop-workspace-check] Checking derive_builder v0.11.2
16.89 s
[gammaloop-workspace-check] Checking ratatui-core v0.1.0
16.90 s
[gammaloop-workspace-check] Checking crossterm v0.29.0
16.97 s
[gammaloop-workspace-check] Checking owo-colors v4.3.0
16.99 s
[gammaloop-workspace-check] Checking object v0.37.3
17.04 s
[gammaloop-workspace-check] Checking env_logger v0.11.10
17.05 s
[gammaloop-workspace-check] Checking tracing-error v0.2.1
17.05 s
[gammaloop-workspace-check] Checking typed-index-collections v3.5.0
17.22 s
[gammaloop-workspace-check] Checking serde-big-array v0.5.1
17.36 s
[gammaloop-workspace-check] Checking amd v0.2.2
17.40 s
[gammaloop-workspace-check] Checking itertools v0.11.0
17.42 s
[gammaloop-workspace-check] Checking indicatif v0.18.4
17.43 s
[gammaloop-workspace-check] Compiling gammaloop-tracing-filter-macros v0.1.0 (/build/source/crates/gammaloop-tracing-filter-macros)
17.46 s
[gammaloop-workspace-check] Compiling rustpython-parser-core v0.4.0
17.48 s
[gammaloop-workspace-check] Checking option-ext v0.2.0
17.57 s
[gammaloop-workspace-check] Checking rustc-demangle v0.1.27
17.61 s
[gammaloop-workspace-check] Checking dirs-sys v0.5.0
17.66 s
[gammaloop-workspace-check] Checking ref-cast v1.0.25
17.75 s
[gammaloop-workspace-check] Compiling rustpython-ast v0.4.0
17.80 s
[gammaloop-workspace-check] Checking nix v0.31.2
17.86 s
[gammaloop-workspace-check] Checking brotli-decompressor v4.0.3
17.97 s
[gammaloop-workspace-check] Checking rkyv v0.7.46
18.00 s
[gammaloop-workspace-check] Checking integer-sqrt v0.1.5
18.01 s
[gammaloop-workspace-check] Checking color-spantrace v0.3.0
18.03 s
[gammaloop-workspace-check] Checking crossbeam-channel v0.5.15
18.06 s
[gammaloop-workspace-check] Checking itertools v0.12.1
18.12 s
[gammaloop-workspace-check] Compiling gammalooprs v0.3.4 (/build/source/crates/gammalooprs)
18.16 s
[gammaloop-workspace-check] Checking symlink v0.1.0
18.24 s
[gammaloop-workspace-check] Checking unsafe-libyaml v0.2.11
18.26 s
[gammaloop-workspace-check] Checking tracing-indicatif v0.3.14
18.70 s
[gammaloop-workspace-check] Checking tracing-appender v0.2.5
18.73 s
[gammaloop-workspace-check] Checking include_dir v0.7.4
18.77 s
[gammaloop-workspace-check] Checking pathfinding v4.15.0
18.79 s
[gammaloop-workspace-check] Checking ctrlc v3.5.2
18.81 s
[gammaloop-workspace-check] Checking ratatui-widgets v0.3.0
18.87 s
[gammaloop-workspace-check] Checking ratatui-crossterm v0.1.0
19.05 s
[gammaloop-workspace-check] Checking schemars v1.2.1
19.17 s
[gammaloop-workspace-check] Checking brotli v7.0.0
19.26 s
[gammaloop-workspace-check] Checking dirs v6.0.0
19.27 s
[gammaloop-workspace-check] Checking slotmap v1.1.1
19.40 s
[gammaloop-workspace-check] Checking json5 v0.4.1
19.41 s
[gammaloop-workspace-check] Checking clarabel v0.11.1
19.54 s
[gammaloop-workspace-check] Checking vectorize v0.2.0
19.67 s
[gammaloop-workspace-check] Checking ringbuffer v0.16.0
20.25 s
[gammaloop-workspace-check] Checking serde_yaml v0.9.34+deprecated
20.28 s
[gammaloop-workspace-check] Checking base62 v2.2.4
20.33 s
[gammaloop-workspace-check] Checking rust-embed v8.11.0
20.41 s
[gammaloop-workspace-check] Compiling numerica v2.2.0 (https://github.com/alphal00p/symbolica?rev=a277a8dadbaae5a8d6605f2f381991a601e1f345#a277a8da)
20.49 s
[gammaloop-workspace-check] Checking clap_complete v4.6.3
20.67 s
[gammaloop-workspace-check] Checking addr2line v0.25.1
20.70 s
[gammaloop-workspace-check] Checking strip-ansi-escapes v0.2.1
20.82 s
[gammaloop-workspace-check] Checking fd-lock v4.0.4
21.02 s
[gammaloop-workspace-check] Compiling gammaloop-api v0.1.0 (/build/source/crates/gammaloop-api)
21.04 s
[gammaloop-workspace-check] Checking itertools v0.13.0
21.11 s
[gammaloop-workspace-check] Checking strum v0.26.3
21.29 s
[gammaloop-workspace-check] Checking clap_complete_nushell v4.6.0
21.38 s
[gammaloop-workspace-check] Checking sysinfo v0.33.1
21.67 s
[gammaloop-workspace-check] Checking shlex v1.3.0
21.84 s
[gammaloop-workspace-check] Checking futures-core v0.3.32
21.85 s
[gammaloop-workspace-check] Checking futures-task v0.3.32
21.92 s
[gammaloop-workspace-check] Checking slab v0.4.12
21.94 s
[gammaloop-workspace-check] Checking sdd v3.0.10
21.96 s
[gammaloop-workspace-check] Checking ratatui-macros v0.7.0
21.98 s
[gammaloop-workspace-check] Compiling gammaloop-integration-tests v0.1.0 (/build/source/tests)
22.01 s
[gammaloop-workspace-check] Compiling test-log-core v0.2.20
22.03 s
[gammaloop-workspace-check] Checking ratatui v0.30.0
22.15 s
[gammaloop-workspace-check] Compiling rustc_version v0.4.1
22.21 s
[gammaloop-workspace-check] Checking scc v2.4.0
22.23 s
[gammaloop-workspace-check] Checking futures-util v0.3.32
22.23 s
[gammaloop-workspace-check] Checking which v8.0.2
22.48 s
[gammaloop-workspace-check] Checking bincode v1.3.3
22.57 s
[gammaloop-workspace-check] Compiling gungraun-runner v0.18.2
22.97 s
[gammaloop-workspace-check] Checking backtrace v0.3.76
23.00 s
[gammaloop-workspace-check] Checking proc-macro2 v1.0.106
23.24 s
[gammaloop-workspace-check] Checking reedline v0.42.0
23.26 s
[gammaloop-workspace-check] Compiling gungraun-macros v0.8.0
23.43 s
[gammaloop-workspace-check] Checking nalgebra v0.29.0
23.48 s
[gammaloop-workspace-check] Checking color-eyre v0.6.5
23.54 s
[gammaloop-workspace-check] Checking quote v1.0.45
23.75 s
[gammaloop-workspace-check] Checking base64 v0.21.7
23.84 s
[gammaloop-workspace-check] Checking maplit v1.0.2
23.88 s
[gammaloop-workspace-check] Compiling iai-callgrind-runner v0.14.2
23.90 s
[gammaloop-workspace-check] Checking kurbo v0.13.0
24.03 s
[gammaloop-workspace-check] Checking wait-timeout v0.2.1
24.15 s
[gammaloop-workspace-check] Checking ron v0.8.1
24.19 s
[gammaloop-workspace-check] Checking bit-vec v0.8.0
24.30 s
[gammaloop-workspace-check] Checking quick-error v1.2.3
24.37 s
[gammaloop-workspace-check] Compiling iai-callgrind v0.14.2
24.58 s
[gammaloop-workspace-check] Checking rusty-fork v0.3.1
24.61 s
[gammaloop-workspace-check] Checking bit-set v0.8.0
24.87 s
[gammaloop-workspace-check] Checking futures-executor v0.3.32
24.92 s
[gammaloop-workspace-check] Checking syn v2.0.117
24.96 s
[gammaloop-workspace-check] Compiling iai-callgrind-macros v0.5.1
25.10 s
[gammaloop-workspace-check] Checking serial_test v3.4.0
25.14 s
[gammaloop-workspace-check] Checking rand_xorshift v0.4.0
25.20 s
[gammaloop-workspace-check] Checking console v0.15.11
25.28 s
[gammaloop-workspace-check] Checking unarray v0.1.4
25.30 s
[gammaloop-workspace-check] Checking pathdiff v0.2.3
25.38 s
[gammaloop-workspace-check] Checking proptest v1.11.0
25.49 s
[gammaloop-workspace-check] Checking clinnet v0.1.8 (/build/source/crates/clinnet)
25.62 s
[gammaloop-workspace-check] Checking similar-asserts v1.7.0
25.87 s
[gammaloop-workspace-check] Compiling test-log-macros v0.2.20
25.93 s
[gammaloop-workspace-check] Checking kurvst v0.1.0 (/build/source/crates/kurvst)
26.71 s
[gammaloop-workspace-check] Compiling graphica v2.1.0 (https://github.com/alphal00p/symbolica?rev=a277a8dadbaae5a8d6605f2f381991a601e1f345#a277a8da)
30.76 s
[gammaloop-workspace-check] Checking test-log v0.2.20
33.12 s
[gammaloop-workspace-check] Checking statrs v0.16.1
34.34 s
[gammaloop-workspace-check] Checking momtrop v0.3.0
34.75 s
[gammaloop-workspace-check] Checking gungraun v0.18.2
39.13 s
[gammaloop-workspace-check] Compiling pyo3-stub-gen-derive v0.17.2
40.88 s
[gammaloop-workspace-check] Compiling pyo3-macros v0.28.3
48.87 s
[gammaloop-workspace-check] Checking pyo3-stub-gen v0.17.2
59.74 s
[gammaloop-workspace-check] Checking symbolica-utils v0.1.0 (/build/source/crates/symbolica-utils)
59.74 s
[gammaloop-workspace-check] Checking spenso-macros v0.3.2 (/build/source/crates/spenso-macros)
296.86 s
[gammaloop-workspace-check] Compiling gammaloop-workspace-hack v0.1.0 (/build/source/crates/gammaloop-workspace-hack)
297.18 s
[gammaloop-workspace-check] Checking linnet v0.17.0 (/build/source/crates/linnet)
302.21 s
[gammaloop-workspace-check] Checking spenso v0.6.0 (/build/source/crates/spenso)
303.04 s
[gammaloop-workspace-check] Checking linnet-py v0.1.0 (/build/source/crates/linnet-py)
303.04 s
[gammaloop-workspace-check] Checking linnest v0.1.0 (/build/source/crates/linnest)
311.66 s
[gammaloop-workspace-check] Checking idenso v0.3.0 (/build/source/crates/idenso)
311.66 s
[gammaloop-workspace-check] Checking gammaloop-tracing-filter v0.1.0 (/build/source/crates/gammaloop-tracing-filter)
314.68 s
[gammaloop-workspace-check] Checking spenso-hep-lib v0.1.7 (/build/source/crates/spenso-hep-lib)
314.98 s
[gammaloop-workspace-check] Checking spynso3 v0.1.2 (/build/source/crates/spynso3)
359.74 s
[gammaloop-workspace-check] error[E0560] : struct `CutInfo` has no field named `lmb_channel_id`
359.74 s
[gammaloop-workspace-check] --> tests/tests/test_differential.rs:86:13
359.74 s
[gammaloop-workspace-check] |
359.74 s
[gammaloop-workspace-check] 86 | lmb_channel_id: None,
359.74 s
[gammaloop-workspace-check] | ^^^^^^^^^^^^^^ `CutInfo` does not have this field
359.74 s
[gammaloop-workspace-check] |
359.74 s
[gammaloop-workspace-check] = note : available fields are: `sampling_channel_id`, `sampling_channel_edge_ids`
359.74 s
[gammaloop-workspace-check]
359.74 s
[gammaloop-workspace-check] error[E0560] : struct `CutInfo` has no field named `lmb_channel_edge_ids`
359.74 s
[gammaloop-workspace-check] --> tests/tests/test_differential.rs:87:13
359.74 s
[gammaloop-workspace-check] |
359.74 s
[gammaloop-workspace-check] 87 | lmb_channel_edge_ids: None,
359.74 s
[gammaloop-workspace-check] | ^^^^^^^^^^^^^^^^^^^^ `CutInfo` does not have this field
359.74 s
[gammaloop-workspace-check] |
359.74 s
[gammaloop-workspace-check] = note : available fields are: `sampling_channel_id`, `sampling_channel_edge_ids`
359.74 s
[gammaloop-workspace-check]
359.81 s
[gammaloop-workspace-check] For more information about this error, try `rustc --explain E0560`.
359.83 s
[gammaloop-workspace-check] error : could not compile `gammaloop-integration-tests` (test "test_differential") due to 2 previous errors
359.83 s
[gammaloop-workspace-check] warning : build failed, waiting for other jobs to finish...
360.00 s
[gammaloop-workspace-check] error[E0609] : no field `lmb_channel_edge_ids` on type `CutInfo`
360.00 s
[gammaloop-workspace-check] --> tests/tests/test_evaluation_api.rs:311:10
360.00 s
[gammaloop-workspace-check] |
360.00 s
[gammaloop-workspace-check] 311 | .lmb_channel_edge_ids
360.00 s
[gammaloop-workspace-check] | ^^^^^^^^^^^^^^^^^^^^ unknown field
360.00 s
[gammaloop-workspace-check] |
360.00 s
[gammaloop-workspace-check] = note : available fields are: `particle_pdgs`, `cut_id`, `graph_id`, `graph_group_id`, `orientation_id` ... and 2 others
360.00 s
[gammaloop-workspace-check]
360.09 s
[gammaloop-workspace-check] error[E0609] : no field `lmb_channel_edge_ids` on type `CutInfo`
360.09 s
[gammaloop-workspace-check] --> tests/tests/test_evaluation_api.rs:591:26
360.09 s
[gammaloop-workspace-check] |
360.09 s
[gammaloop-workspace-check] 591 | .lmb_channel_edge_ids
360.09 s
[gammaloop-workspace-check] | ^^^^^^^^^^^^^^^^^^^^ unknown field
360.09 s
[gammaloop-workspace-check] |
360.09 s
[gammaloop-workspace-check] = note : available fields are: `particle_pdgs`, `cut_id`, `graph_id`, `graph_group_id`, `orientation_id` ... and 2 others
360.09 s
[gammaloop-workspace-check]
360.23 s
[gammaloop-workspace-check] error[E0609] : no field `lmb_channel_edge_ids` on type `CutInfo`
360.23 s
[gammaloop-workspace-check] --> tests/tests/test_evaluation_api.rs:1177:18
360.23 s
[gammaloop-workspace-check] |
360.23 s
[gammaloop-workspace-check] 1177 | .lmb_channel_edge_ids
360.23 s
[gammaloop-workspace-check] | ^^^^^^^^^^^^^^^^^^^^ unknown field
360.23 s
[gammaloop-workspace-check] |
360.23 s
[gammaloop-workspace-check] = note : available fields are: `particle_pdgs`, `cut_id`, `graph_id`, `graph_group_id`, `orientation_id` ... and 2 others
360.23 s
[gammaloop-workspace-check]
360.49 s
[gammaloop-workspace-check] error[E0609] : no field `lmb_channel_edge_ids` on type `CutInfo`
360.49 s
[gammaloop-workspace-check] --> tests/tests/test_evaluation_api.rs:1222:22
360.49 s
[gammaloop-workspace-check] |
360.49 s
[gammaloop-workspace-check] 1222 | .lmb_channel_edge_ids
360.49 s
[gammaloop-workspace-check] | ^^^^^^^^^^^^^^^^^^^^ unknown field
360.49 s
[gammaloop-workspace-check] |
360.49 s
[gammaloop-workspace-check] = note : available fields are: `particle_pdgs`, `cut_id`, `graph_id`, `graph_group_id`, `orientation_id` ... and 2 others
360.49 s
[gammaloop-workspace-check]
360.50 s
[gammaloop-workspace-check] error[E0609] : no field `lmb_channel_edge_ids` on type `CutInfo`
360.50 s
[gammaloop-workspace-check] --> tests/tests/test_evaluation_api.rs:1281:14
360.50 s
[gammaloop-workspace-check] |
360.50 s
[gammaloop-workspace-check] 1281 | .lmb_channel_edge_ids
360.50 s
[gammaloop-workspace-check] | ^^^^^^^^^^^^^^^^^^^^ unknown field
360.50 s
[gammaloop-workspace-check] |
360.50 s
[gammaloop-workspace-check] = note : available fields are: `particle_pdgs`, `cut_id`, `graph_id`, `graph_group_id`, `orientation_id` ... and 2 others
360.50 s
[gammaloop-workspace-check]
360.54 s
[gammaloop-workspace-check] error[E0609] : no field `lmb_channel_edge_ids` on type `CutInfo`
360.54 s
[gammaloop-workspace-check] --> tests/tests/test_evaluation_api.rs:1428:18
360.54 s
[gammaloop-workspace-check] |
360.54 s
[gammaloop-workspace-check] 1428 | .lmb_channel_edge_ids
360.54 s
[gammaloop-workspace-check] | ^^^^^^^^^^^^^^^^^^^^ unknown field
360.54 s
[gammaloop-workspace-check] |
360.54 s
[gammaloop-workspace-check] = note : available fields are: `particle_pdgs`, `cut_id`, `graph_id`, `graph_group_id`, `orientation_id` ... and 2 others
360.54 s
[gammaloop-workspace-check]
360.63 s
[gammaloop-workspace-check] For more information about this error, try `rustc --explain E0609`.
360.65 s
[gammaloop-workspace-check] error : could not compile `gammaloop-integration-tests` (test "test_evaluation_api") due to 6 previous errors
361.08 s
[gammaloop-workspace-check] error[E0609] : no field `lmb_channel_id` on type `CutInfo`
361.08 s
[gammaloop-workspace-check] --> tests/tests/test_runs/utils.rs:568:36
361.08 s
[gammaloop-workspace-check] |
361.08 s
[gammaloop-workspace-check] 568 | event.cut_info.lmb_channel_id,
361.08 s
[gammaloop-workspace-check] | ^^^^^^^^^^^^^^ unknown field
361.08 s
[gammaloop-workspace-check] |
361.08 s
[gammaloop-workspace-check] = note : available fields are: `particle_pdgs`, `cut_id`, `graph_id`, `graph_group_id`, `orientation_id` ... and 2 others
361.09 s
[gammaloop-workspace-check]
361.09 s
[gammaloop-workspace-check] error[E0609] : no field `lmb_channel_id` on type `CutInfo`
361.09 s
[gammaloop-workspace-check] --> tests/tests/test_runs/utils.rs:580:36
361.09 s
[gammaloop-workspace-check] |
361.09 s
[gammaloop-workspace-check] 580 | event.cut_info.lmb_channel_id,
361.09 s
[gammaloop-workspace-check] | ^^^^^^^^^^^^^^ unknown field
361.09 s
[gammaloop-workspace-check] |
361.09 s
[gammaloop-workspace-check] = note : available fields are: `particle_pdgs`, `cut_id`, `graph_id`, `graph_group_id`, `orientation_id` ... and 2 others
361.09 s
[gammaloop-workspace-check]
361.68 s
[gammaloop-workspace-check] error : could not compile `gammaloop-integration-tests` (test "test_runs") due to 2 previous errors
362.26 s
Progress: 0 of 1 built (1 failed)
362.26 s
Failed to build gammaloop-workspace-check after 5m59s
362.27 s
Cannot build ' /nix/store/xx19zb0ypp54ncq730s03znjvrk53ng6-gammaloop-workspace-check-0.1.0.drv '.
362.27 s
Reason: builder failed with exit code 101 .
362.27 s
Output paths:
362.27 s
/nix/store/m11j3ipx5i05zjyqv1i7mpznf6lrw1dk-gammaloop-workspace-check-0.1.0
362.27 s
Last 511 log lines:
362.27 s
> Running phase: unpackPhase
362.27 s
> unpacking source archive /nix/store/347q9p0qp2wa20ngg5lpvsij2vdjh4wr-source
362.27 s
> source root is source
362.27 s
> Running phase: patchPhase
362.27 s
> Executing configureCargoCommonVars
362.27 s
> decompressing cargo artifacts from /nix/store/50vpxlcgfxf2d57i27v3d10zjwxxbm2r-gammaloop-workspace-deps-deps-0.1.0/target.tar.zst to target
362.27 s
> Running phase: updateAutotoolsGnuConfigScriptsPhase
362.27 s
> Running phase: configurePhase
362.27 s
> will append /build/source/.cargo-home/config.toml with contents of /nix/store/5drf77x6km4ky7gwlrzdx9bbd6fz09g3-vendor-cargo-deps/config.toml
362.27 s
> default configurePhase, nothing to do
362.27 s
> Running phase: buildPhase
362.27 s
> +++ command cargo --version
362.27 s
> cargo 1.97.0 (c980f4866 2026-06-30)
362.27 s
> +++ command cargo check --profile ci-optim --locked --workspace --features gammaloop-tracing-filter/clap,gammaloop-tracing-filter/symbolica,idenso/bincode,idenso/reference-cases,linnet/bincode,linnet/drawing,linnet/rkyv,linnet/serde,linnet/symbolica,spenso-macros/shadowing,spenso/shadowing,symbolica/tracing_max_level_info,three-dimensional-reps/display,three-dimensional-reps/eval,three-dimensional-reps/serde --all-targets
362.27 s
> Checking cfg-if v1.0.4
362.27 s
> Checking memchr v2.8.0
362.27 s
> Checking once_cell v1.21.4
362.27 s
> Checking either v1.15.0
362.27 s
> Checking serde_core v1.0.228
362.27 s
> Checking libc v0.2.186
362.27 s
> Checking libm v0.2.16
362.27 s
> Checking itoa v1.0.18
362.27 s
> Checking log v0.4.29
362.27 s
> Checking regex-syntax v0.8.10
362.27 s
> Checking zerocopy v0.8.48
362.27 s
> Checking crossbeam-utils v0.8.21
362.27 s
> Checking equivalent v1.0.2
362.27 s
> Checking zmij v1.0.21
362.27 s
> Checking bytemuck v1.25.0
362.27 s
> Checking lazy_static v1.5.0
362.27 s
> Compiling target-lexicon v0.13.5
362.27 s
> Checking arrayvec v0.7.6
362.27 s
> Checking powerfmt v0.2.0
362.27 s
> Checking num_threads v0.1.7
362.27 s
> Checking itertools v0.14.0
362.27 s
> Checking pin-project-lite v0.2.17
362.27 s
> Checking time-core v0.1.8
362.27 s
> Checking num-conv v0.2.1
362.27 s
> Checking safe_arch v0.7.4
362.27 s
> Checking tracing-core v0.1.36
362.27 s
> Checking deranged v0.5.8
362.27 s
> Checking foldhash v0.2.0
362.27 s
> Checking allocator-api2 v0.2.21
362.27 s
> Checking const-random v0.1.18
362.27 s
> Checking unty v0.0.4
362.27 s
> Checking nu-ansi-term v0.50.3
362.27 s
> Checking crossbeam-epoch v0.9.18
362.27 s
> Checking static_assertions v1.1.0
362.27 s
> Checking winnow v1.0.2
362.27 s
> Checking safe_arch v1.0.0
362.27 s
> Checking wide v0.7.33
362.27 s
> Checking aho-corasick v1.1.4
362.27 s
> Checking sharded-slab v0.1.7
362.27 s
> Checking crossbeam-deque v0.8.6
362.27 s
> Checking tracing-log v0.2.0
362.27 s
> Checking hashbrown v0.16.1
362.27 s
> Checking tracing v0.1.44
362.27 s
> Checking rayon-core v1.13.0
362.27 s
> Checking thread_local v1.1.9
362.27 s
> Checking az v1.3.0
362.27 s
> Checking num-traits v0.2.19
362.27 s
> Checking indenter v0.3.4
362.27 s
> Checking toml_writer v1.1.1+spec-1.1.0
362.27 s
> Checking wide v1.3.0
362.27 s
> Checking rayon v1.12.0
362.27 s
> Compiling phf_shared v0.11.3
362.27 s
> Checking anyhow v1.0.102
362.27 s
> Checking rawpointer v0.2.1
362.27 s
> Checking alloc-no-stdlib v2.0.4
362.27 s
> Checking dyn-clone v1.0.20
362.27 s
> Checking utf8parse v0.2.2
362.27 s
> Checking getrandom v0.3.4
362.27 s
> Checking time v0.3.47
362.27 s
> Checking toml_parser v1.1.2+spec-1.1.0
362.27 s
> Checking approx v0.5.1
362.27 s
> Checking num-integer v0.1.46
362.27 s
> Checking gmp-mpfr-sys v1.7.1
362.27 s
> Checking alloc-stdlib v0.2.2
362.27 s
> Checking anstyle-parse v1.0.0
362.27 s
> Checking rand_core v0.9.5
362.27 s
> Checking matrixmultiply v0.3.10
362.27 s
> Checking regex-automata v0.4.14
362.27 s
> Checking anstyle v1.0.14
362.27 s
> Checking anstyle-query v1.1.5
362.27 s
> Checking is_terminal_polyfill v1.70.2
362.27 s
> Checking colorchoice v1.0.5
362.27 s
> Checking colored v3.1.1
362.27 s
> Compiling phf_generator v0.11.3
362.27 s
> Checking eyre v0.6.12
362.27 s
> Checking bitflags v1.3.2
362.27 s
> Compiling pyo3-build-config v0.28.3
362.27 s
> Checking unicode-width v0.2.2
362.27 s
> Checking anstream v1.0.0
362.27 s
> Checking brotli-decompressor v5.0.0
362.27 s
> Checking serde v1.0.228
362.27 s
> Checking serde_json v1.0.149
362.27 s
> Checking bitflags v2.11.1
362.27 s
> Checking serde_spanned v1.1.1
362.27 s
> Checking toml_datetime v1.1.1+spec-1.1.0
362.27 s
> Compiling phf_codegen v0.11.3
362.27 s
> Checking region v3.0.2
362.27 s
> Checking wasmtime-jit-icache-coherence v34.0.2
362.27 s
> Checking hugepage-rs v0.1.1
362.27 s
> Checking inventory v0.3.24
362.27 s
> Checking spec_math v0.1.6
362.27 s
> Checking thiserror v2.0.18
362.27 s
> Compiling getopts v0.2.24
362.27 s
> Checking libloading v0.9.0
362.27 s
> Checking bytes v1.11.1
362.27 s
> Checking toml v1.1.2+spec-1.1.0
362.27 s
> Checking append-only-vec v0.1.8
362.27 s
> Checking byteorder v1.5.0
362.27 s
> Checking tinyjson v2.5.1
362.27 s
> Checking self_cell v1.2.2
362.27 s
> Compiling unic-common v0.9.0
362.27 s
> Compiling unicode_names2_generator v1.3.0
362.27 s
> Checking smallvec v1.15.1
362.27 s
> Checking num-complex v0.4.6
362.27 s
> Checking tracing-serde v0.2.0
362.27 s
> Checking bincode v2.0.1
362.27 s
> Checking smartstring v1.0.1
362.27 s
> Checking linux-raw-sys v0.12.1
362.27 s
> Checking brotli v8.0.2
362.27 s
> Compiling unic-char-range v0.9.0
362.27 s
> Compiling unic-ucd-version v0.9.0
362.27 s
> Compiling unic-char-property v0.9.0
362.27 s
> Compiling is-macro v0.3.7
362.27 s
> Compiling rustpython-parser-vendored v0.4.0
362.27 s
> Checking simba v0.9.1
362.27 s
> Checking iana-time-zone v0.1.65
362.27 s
> Checking rustix v1.1.4
362.27 s
> Compiling rustpython-parser v0.4.0
362.27 s
> Compiling phf v0.11.3
362.27 s
> Checking rustc-hash v2.1.2
362.27 s
> Checking chrono v0.4.44
362.27 s
> Compiling unic-emoji-char v0.9.0
362.27 s
> Compiling unic-ucd-ident v0.9.0
362.27 s
> Checking ndarray v0.17.2
362.27 s
> Compiling lalrpop-util v0.20.2
362.27 s
> Compiling rustc-hash v1.1.0
362.27 s
> Checking rug v1.30.0
362.27 s
> Compiling symbolica v2.2.0 (https://github.com/alphal00p/symbolica?rev=a277a8dadbaae5a8d6605f2f381991a601e1f345#a277a8da)
362.27 s
> Checking unicode-segmentation v1.13.2
362.27 s
> Checking typenum v1.20.0
362.27 s
> Checking getrandom v0.2.17
362.27 s
> Checking scopeguard v1.2.0
362.27 s
> Checking parking_lot_core v0.9.12
362.27 s
> Checking lock_api v0.4.14
362.27 s
> Checking ppv-lite86 v0.2.21
362.27 s
> Checking ahash v0.8.12
362.27 s
> Checking hashbrown v0.17.0
362.27 s
> Checking unicode-ident v1.0.24
362.27 s
> Checking parking_lot v0.12.5
362.27 s
> Checking errno v0.3.14
362.27 s
> Checking rand_chacha v0.9.0
362.27 s
> Checking matchers v0.2.0
362.27 s
> Checking regex v1.12.3
362.27 s
> Checking tracing-subscriber v0.3.23
362.27 s
> Checking strsim v0.11.1
362.27 s
> Checking rand v0.9.4
362.27 s
> Checking clap_lex v1.1.0
362.27 s
> Checking indexmap v2.14.0
362.27 s
> Checking unicase v2.9.0
362.27 s
> Checking signal-hook-registry v1.4.8
362.27 s
> Checking vte v0.14.1
362.27 s
> Checking terminal_size v0.4.4
362.27 s
> Checking same-file v1.0.6
362.27 s
> Checking signal-hook v0.3.18
362.27 s
> Checking symjit v2.21.0
362.27 s
> Checking walkdir v2.5.0
362.27 s
> Checking clap_builder v4.6.0
362.27 s
> Checking half v2.7.1
362.27 s
> Checking generic-array v0.14.7
362.27 s
> Checking mio v1.2.0
362.27 s
> Checking minimal-lexical v0.2.1
362.27 s
> Checking ciborium-io v0.2.2
362.27 s
> Checking nom v7.1.3
362.27 s
> Checking ciborium-ll v0.2.2
362.27 s
> Checking derive_more v2.1.1
362.27 s
> Checking num-bigint v0.4.6
362.27 s
> Checking console v0.16.3
362.27 s
> Checking signal-hook-mio v0.2.5
362.27 s
> Checking crypto-common v0.1.7
362.27 s
> Checking block-buffer v0.10.4
362.27 s
> Checking bstr v1.12.1
362.27 s
> Checking cpufeatures v0.2.17
362.27 s
> Checking digest v0.10.7
362.27 s
> Checking winnow v0.7.15
362.27 s
> Checking linux-raw-sys v0.4.15
362.27 s
> Checking ciborium v0.2.2
362.27 s
> Checking sha2 v0.10.9
362.27 s
> Checking globset v0.4.18
362.27 s
> Checking rustix v0.38.44
362.27 s
> Compiling unicode_names2 v1.3.0
362.27 s
> Checking getrandom v0.4.2
362.27 s
> Checking rand_core v0.6.4
362.27 s
> Checking fnv v1.0.7
362.27 s
> Checking fastrand v2.4.1
362.27 s
> Checking plotters-backend v0.3.7
362.27 s
> Checking rust-embed-utils v8.11.0
362.27 s
> Checking serde_spanned v0.6.9
362.27 s
> Checking toml_datetime v0.6.11
362.27 s
> Checking itertools v0.10.5
362.27 s
> Checking clap v4.6.1
362.27 s
> Checking tempfile v3.27.0
362.27 s
> Checking cast v0.3.0
362.27 s
> Checking tap v1.0.1
362.27 s
> Checking crossterm v0.28.1
362.27 s
> Checking plotters-svg v0.3.7
362.27 s
> Checking toml_write v0.1.2
362.27 s
> Checking wyz v0.5.1
362.27 s
> Checking rand_chacha v0.3.1
362.27 s
> Checking plotters v0.3.7
362.27 s
> Checking radium v0.7.0
362.27 s
> Checking ansitok v0.3.0
362.27 s
> Checking typeid v1.0.3
362.27 s
> Checking similar v2.7.0
362.27 s
> Checking tinytemplate v1.2.1
362.27 s
> Checking is-terminal v0.4.17
362.27 s
> Checking oorandom v11.1.5
362.27 s
> Checking funty v2.0.0
362.27 s
> Checking anes v0.1.6
362.27 s
> Checking xprec v0.2.2
362.27 s
> Checking bytecount v0.6.9
362.27 s
> Checking ansi-str v0.9.0
362.27 s
> Checking testing_table v0.3.0
362.27 s
> Checking rand v0.8.6
362.27 s
> Checking ron v0.12.1
362.27 s
> Checking papergrid v0.17.0
362.27 s
> Checking toml_edit v0.22.27
362.27 s
> Checking toml_edit v0.25.11+spec-1.1.0
362.27 s
> Checking uncased v0.9.10
362.27 s
> Checking env_filter v1.0.1
362.27 s
> Checking criterion-plot v0.5.0
362.27 s
> Checking jiff v0.2.24
362.27 s
> Checking ptr_meta v0.1.4
362.27 s
> Checking ucd-trie v0.1.7
362.27 s
> Checking simdutf8 v0.1.5
362.27 s
> Checking bitvec v1.0.1
362.27 s
> Checking pest v2.8.6
362.27 s
> Checking ahash v0.7.8
362.27 s
> Checking bytecheck v0.6.12
362.27 s
> Checking criterion v0.5.1
362.27 s
> Checking approx v0.4.0
362.27 s
> Checking hashbrown v0.12.3
362.27 s
> Checking seahash v4.1.0
362.27 s
> Checking cgmath v0.18.0
362.27 s
> Checking rend v0.4.2
362.27 s
> Checking num-rational v0.4.2
362.27 s
> Checking tabled v0.20.0
362.27 s
> Checking insta v1.47.2
362.27 s
> Checking num-iter v0.1.45
362.27 s
> Checking ref-ops v0.2.5
362.27 s
> Checking rand_xoshiro v0.6.0
362.27 s
> Checking num v0.4.3
362.27 s
> Checking features v0.10.0
362.27 s
> Compiling pyo3-macros-backend v0.28.3
362.27 s
> Compiling pyo3-ffi v0.28.3
362.27 s
> Compiling pyo3 v0.28.3
362.27 s
> Compiling numpy v0.28.0
362.27 s
> Checking dot-parser v0.5.1
362.27 s
> Checking toml v0.8.23
362.27 s
> Checking constcat v0.5.1
362.27 s
> Checking gat-lending-iterator v0.1.8
362.27 s
> Checking colored v2.2.0
362.27 s
> Checking cpufeatures v0.3.0
362.27 s
> Checking constant_time_eq v0.4.2
362.27 s
> Checking arrayref v0.3.9
362.27 s
> Checking base64 v0.22.1
362.27 s
> Checking joinery v2.1.0
362.27 s
> Checking siphasher v1.0.2
362.27 s
> Checking figment v0.10.19
362.27 s
> Checking blake3 v1.8.5
362.27 s
> Checking titlecase v2.2.1
362.27 s
> Checking subprocess v0.2.15
362.27 s
> Checking phf_shared v0.13.1
362.27 s
> Checking rust_lisp v0.18.0
362.27 s
> Compiling vakint v0.1.2 (/build/source/crates/vakint)
362.27 s
> Checking version-compare v0.2.1
362.27 s
> Checking phf v0.13.1
362.27 s
> Checking xpct v0.5.1
362.27 s
> Checking ryu v1.0.23
362.27 s
> Checking castaway v0.2.4
362.27 s
> Checking toml_datetime v0.7.5+spec-1.1.0
362.27 s
> Checking strum v0.27.2
362.27 s
> Checking unicode-truncate v2.0.1
362.27 s
> Checking kasuari v0.4.12
362.27 s
> Checking compact_str v0.9.0
362.27 s
> Checking lru v0.16.4
362.27 s
> Checking string-template-plus v0.4.3
362.27 s
> Checking vte v0.15.0
362.27 s
> Checking portable-atomic v1.13.1
362.27 s
> Checking toml v0.9.12+spec-1.1.0
362.27 s
> Checking unit-prefix v0.5.2
362.27 s
> Checking rand_distr v0.4.3
362.27 s
> Checking simba v0.6.0
362.27 s
> Checking line-clipping v0.3.7
362.27 s
> Checking adler2 v2.0.1
362.27 s
> Checking gimli v0.32.3
362.27 s
> Checking vt100 v0.16.2
362.27 s
> Compiling three-dimensional-reps v0.1.0 (/build/source/crates/three-dimensional-reps)
362.27 s
> Checking miniz_oxide v0.8.9
362.27 s
> Checking thiserror v1.0.69
362.27 s
> Checking derive_builder v0.11.2
362.27 s
> Checking ratatui-core v0.1.0
362.27 s
> Checking crossterm v0.29.0
362.27 s
> Checking owo-colors v4.3.0
362.27 s
> Checking object v0.37.3
362.27 s
> Checking env_logger v0.11.10
362.27 s
> Checking tracing-error v0.2.1
362.27 s
> Checking typed-index-collections v3.5.0
362.27 s
> Checking serde-big-array v0.5.1
362.27 s
> Checking amd v0.2.2
362.27 s
> Checking itertools v0.11.0
362.27 s
> Checking indicatif v0.18.4
362.27 s
> Compiling gammaloop-tracing-filter-macros v0.1.0 (/build/source/crates/gammaloop-tracing-filter-macros)
362.27 s
> Compiling rustpython-parser-core v0.4.0
362.27 s
> Checking option-ext v0.2.0
362.27 s
> Checking rustc-demangle v0.1.27
362.27 s
> Checking dirs-sys v0.5.0
362.27 s
> Checking ref-cast v1.0.25
362.27 s
> Compiling rustpython-ast v0.4.0
362.27 s
> Checking nix v0.31.2
362.27 s
> Checking brotli-decompressor v4.0.3
362.27 s
> Checking rkyv v0.7.46
362.27 s
> Checking integer-sqrt v0.1.5
362.27 s
> Checking color-spantrace v0.3.0
362.27 s
> Checking crossbeam-channel v0.5.15
362.27 s
> Checking itertools v0.12.1
362.27 s
> Compiling gammalooprs v0.3.4 (/build/source/crates/gammalooprs)
362.27 s
> Checking symlink v0.1.0
362.27 s
> Checking unsafe-libyaml v0.2.11
362.27 s
> Checking tracing-indicatif v0.3.14
362.27 s
> Checking tracing-appender v0.2.5
362.27 s
> Checking include_dir v0.7.4
362.27 s
> Checking pathfinding v4.15.0
362.27 s
> Checking ctrlc v3.5.2
362.27 s
> Checking ratatui-widgets v0.3.0
362.27 s
> Checking ratatui-crossterm v0.1.0
362.27 s
> Checking schemars v1.2.1
362.27 s
> Checking brotli v7.0.0
362.27 s
> Checking dirs v6.0.0
362.27 s
> Checking slotmap v1.1.1
362.27 s
> Checking json5 v0.4.1
362.27 s
> Checking clarabel v0.11.1
362.27 s
> Checking vectorize v0.2.0
362.27 s
> Checking ringbuffer v0.16.0
362.27 s
> Checking serde_yaml v0.9.34+deprecated
362.27 s
> Checking base62 v2.2.4
362.27 s
> Checking rust-embed v8.11.0
362.27 s
> Compiling numerica v2.2.0 (https://github.com/alphal00p/symbolica?rev=a277a8dadbaae5a8d6605f2f381991a601e1f345#a277a8da)
362.27 s
> Checking clap_complete v4.6.3
362.27 s
> Checking addr2line v0.25.1
362.27 s
> Checking strip-ansi-escapes v0.2.1
362.27 s
> Checking fd-lock v4.0.4
362.27 s
> Compiling gammaloop-api v0.1.0 (/build/source/crates/gammaloop-api)
362.27 s
> Checking itertools v0.13.0
362.27 s
> Checking strum v0.26.3
362.27 s
> Checking clap_complete_nushell v4.6.0
362.27 s
> Checking sysinfo v0.33.1
362.27 s
> Checking shlex v1.3.0
362.27 s
> Checking futures-core v0.3.32
362.27 s
> Checking futures-task v0.3.32
362.27 s
> Checking slab v0.4.12
362.27 s
> Checking sdd v3.0.10
362.27 s
> Checking ratatui-macros v0.7.0
362.27 s
> Compiling gammaloop-integration-tests v0.1.0 (/build/source/tests)
362.27 s
> Compiling test-log-core v0.2.20
362.27 s
> Checking ratatui v0.30.0
362.27 s
> Compiling rustc_version v0.4.1
362.27 s
> Checking scc v2.4.0
362.27 s
> Checking futures-util v0.3.32
362.27 s
> Checking which v8.0.2
362.27 s
> Checking bincode v1.3.3
362.27 s
> Compiling gungraun-runner v0.18.2
362.27 s
> Checking backtrace v0.3.76
362.27 s
> Checking proc-macro2 v1.0.106
362.27 s
> Checking reedline v0.42.0
362.27 s
> Compiling gungraun-macros v0.8.0
362.27 s
> Checking nalgebra v0.29.0
362.27 s
> Checking color-eyre v0.6.5
362.27 s
> Checking quote v1.0.45
362.27 s
> Checking base64 v0.21.7
362.27 s
> Checking maplit v1.0.2
362.27 s
> Compiling iai-callgrind-runner v0.14.2
362.27 s
> Checking kurbo v0.13.0
362.27 s
> Checking wait-timeout v0.2.1
362.27 s
> Checking ron v0.8.1
362.27 s
> Checking bit-vec v0.8.0
362.27 s
> Checking quick-error v1.2.3
362.27 s
> Compiling iai-callgrind v0.14.2
362.27 s
> Checking rusty-fork v0.3.1
362.27 s
> Checking bit-set v0.8.0
362.27 s
> Checking futures-executor v0.3.32
362.27 s
> Checking syn v2.0.117
362.27 s
> Compiling iai-callgrind-macros v0.5.1
362.27 s
> Checking serial_test v3.4.0
362.27 s
> Checking rand_xorshift v0.4.0
362.27 s
> Checking console v0.15.11
362.27 s
> Checking unarray v0.1.4
362.27 s
> Checking pathdiff v0.2.3
362.27 s
> Checking proptest v1.11.0
362.27 s
> Checking clinnet v0.1.8 (/build/source/crates/clinnet)
362.27 s
> Checking similar-asserts v1.7.0
362.27 s
> Compiling test-log-macros v0.2.20
362.27 s
> Checking kurvst v0.1.0 (/build/source/crates/kurvst)
362.27 s
> Compiling graphica v2.1.0 (https://github.com/alphal00p/symbolica?rev=a277a8dadbaae5a8d6605f2f381991a601e1f345#a277a8da)
362.27 s
> Checking test-log v0.2.20
362.27 s
> Checking statrs v0.16.1
362.27 s
> Checking momtrop v0.3.0
362.27 s
> Checking gungraun v0.18.2
362.27 s
> Compiling pyo3-stub-gen-derive v0.17.2
362.27 s
> Compiling pyo3-macros v0.28.3
362.27 s
> Checking pyo3-stub-gen v0.17.2
362.27 s
> Checking symbolica-utils v0.1.0 (/build/source/crates/symbolica-utils)
362.27 s
> Checking spenso-macros v0.3.2 (/build/source/crates/spenso-macros)
362.27 s
> Compiling gammaloop-workspace-hack v0.1.0 (/build/source/crates/gammaloop-workspace-hack)
362.27 s
> Checking linnet v0.17.0 (/build/source/crates/linnet)
362.27 s
> Checking spenso v0.6.0 (/build/source/crates/spenso)
362.27 s
> Checking linnet-py v0.1.0 (/build/source/crates/linnet-py)
362.27 s
> Checking linnest v0.1.0 (/build/source/crates/linnest)
362.27 s
> Checking idenso v0.3.0 (/build/source/crates/idenso)
362.27 s
> Checking gammaloop-tracing-filter v0.1.0 (/build/source/crates/gammaloop-tracing-filter)
362.27 s
> Checking spenso-hep-lib v0.1.7 (/build/source/crates/spenso-hep-lib)
362.27 s
> Checking spynso3 v0.1.2 (/build/source/crates/spynso3)
362.27 s
> error[E0560] : struct `CutInfo` has no field named `lmb_channel_id`
362.27 s
> --> tests/tests/test_differential.rs:86:13
362.27 s
> |
362.27 s
> 86 | lmb_channel_id: None,
362.27 s
> | ^^^^^^^^^^^^^^ `CutInfo` does not have this field
362.27 s
> |
362.27 s
> = note : available fields are: `sampling_channel_id`, `sampling_channel_edge_ids`
362.27 s
>
362.27 s
> error[E0560] : struct `CutInfo` has no field named `lmb_channel_edge_ids`
362.27 s
> --> tests/tests/test_differential.rs:87:13
362.27 s
> |
362.27 s
> 87 | lmb_channel_edge_ids: None,
362.27 s
> | ^^^^^^^^^^^^^^^^^^^^ `CutInfo` does not have this field
362.27 s
> |
362.27 s
> = note : available fields are: `sampling_channel_id`, `sampling_channel_edge_ids`
362.27 s
>
362.27 s
> For more information about this error, try `rustc --explain E0560`.
362.27 s
> error : could not compile `gammaloop-integration-tests` (test "test_differential") due to 2 previous errors
362.27 s
> warning : build failed, waiting for other jobs to finish...
362.27 s
> error[E0609] : no field `lmb_channel_edge_ids` on type `CutInfo`
362.27 s
> --> tests/tests/test_evaluation_api.rs:311:10
362.27 s
> |
362.27 s
> 311 | .lmb_channel_edge_ids
362.27 s
> | ^^^^^^^^^^^^^^^^^^^^ unknown field
362.27 s
> |
362.27 s
> = note : available fields are: `particle_pdgs`, `cut_id`, `graph_id`, `graph_group_id`, `orientation_id` ... and 2 others
362.27 s
>
362.27 s
> error[E0609] : no field `lmb_channel_edge_ids` on type `CutInfo`
362.27 s
> --> tests/tests/test_evaluation_api.rs:591:26
362.27 s
> |
362.27 s
> 591 | .lmb_channel_edge_ids
362.27 s
> | ^^^^^^^^^^^^^^^^^^^^ unknown field
362.27 s
> |
362.27 s
> = note : available fields are: `particle_pdgs`, `cut_id`, `graph_id`, `graph_group_id`, `orientation_id` ... and 2 others
362.27 s
>
362.27 s
> error[E0609] : no field `lmb_channel_edge_ids` on type `CutInfo`
362.27 s
> --> tests/tests/test_evaluation_api.rs:1177:18
362.27 s
> |
362.27 s
> 1177 | .lmb_channel_edge_ids
362.27 s
> | ^^^^^^^^^^^^^^^^^^^^ unknown field
362.27 s
> |
362.27 s
> = note : available fields are: `particle_pdgs`, `cut_id`, `graph_id`, `graph_group_id`, `orientation_id` ... and 2 others
362.27 s
>
362.27 s
> error[E0609] : no field `lmb_channel_edge_ids` on type `CutInfo`
362.27 s
> --> tests/tests/test_evaluation_api.rs:1222:22
362.27 s
> |
362.27 s
> 1222 | .lmb_channel_edge_ids
362.27 s
> | ^^^^^^^^^^^^^^^^^^^^ unknown field
362.27 s
> |
362.27 s
> = note : available fields are: `particle_pdgs`, `cut_id`, `graph_id`, `graph_group_id`, `orientation_id` ... and 2 others
362.27 s
>
362.27 s
> error[E0609] : no field `lmb_channel_edge_ids` on type `CutInfo`
362.27 s
> --> tests/tests/test_evaluation_api.rs:1281:14
362.27 s
> |
362.27 s
> 1281 | .lmb_channel_edge_ids
362.27 s
> | ^^^^^^^^^^^^^^^^^^^^ unknown field
362.27 s
> |
362.27 s
> = note : available fields are: `particle_pdgs`, `cut_id`, `graph_id`, `graph_group_id`, `orientation_id` ... and 2 others
362.27 s
>
362.27 s
> error[E0609] : no field `lmb_channel_edge_ids` on type `CutInfo`
362.27 s
> --> tests/tests/test_evaluation_api.rs:1428:18
362.27 s
> |
362.27 s
> 1428 | .lmb_channel_edge_ids
362.27 s
> | ^^^^^^^^^^^^^^^^^^^^ unknown field
362.27 s
> |
362.27 s
> = note : available fields are: `particle_pdgs`, `cut_id`, `graph_id`, `graph_group_id`, `orientation_id` ... and 2 others
362.27 s
>
362.27 s
> For more information about this error, try `rustc --explain E0609`.
362.27 s
> error : could not compile `gammaloop-integration-tests` (test "test_evaluation_api") due to 6 previous errors
362.27 s
> error[E0609] : no field `lmb_channel_id` on type `CutInfo`
362.27 s
> --> tests/tests/test_runs/utils.rs:568:36
362.27 s
> |
362.27 s
> 568 | event.cut_info.lmb_channel_id,
362.27 s
> | ^^^^^^^^^^^^^^ unknown field
362.27 s
> |
362.27 s
> = note : available fields are: `particle_pdgs`, `cut_id`, `graph_id`, `graph_group_id`, `orientation_id` ... and 2 others
362.27 s
>
362.27 s
> error[E0609] : no field `lmb_channel_id` on type `CutInfo`
362.27 s
> --> tests/tests/test_runs/utils.rs:580:36
362.27 s
> |
362.27 s
> 580 | event.cut_info.lmb_channel_id,
362.27 s
> | ^^^^^^^^^^^^^^ unknown field
362.27 s
> |
362.27 s
> = note : available fields are: `particle_pdgs`, `cut_id`, `graph_id`, `graph_group_id`, `orientation_id` ... and 2 others
362.27 s
>
362.27 s
> error : could not compile `gammaloop-integration-tests` (test "test_runs") due to 2 previous errors
362.27 s
For full logs, run:
362.27 s
nix log /nix/store/xx19zb0ypp54ncq730s03znjvrk53ng6-gammaloop-workspace-check-0.1.0.drv
362.32 s
Build failed.