0.00 s
$ /nix/store/9ypz3flqsrl5xl495mm8h645gadjsxi1-coreutils-9.11/bin/timeout --kill-after=15s 7200s /nix/store/23zk8sgzamrbmj1fday15szf7f2279s8-nix-2.34.7/bin/nix --extra-experimental-features nix-command --extra-experimental-features flakes --log-format internal-json build --no-link --print-out-paths git+https://github.com/alphal00p/gammaloop?ref=advanced_sampling&rev=d9078cab7a647de234c5623803b2d7b8f95b5377&shallow=1#checks.x86_64-linux.gammaloop-check --print-build-logs
2.24 s
2.71 s
Building /nix/store/dwdr0078rsb6aq3cbband7h8345g8q87-gammaloop-workspace-check-0.1.0.drv
2.77 s
[gammaloop-workspace-check] Phase: unpackPhase
2.77 s
[gammaloop-workspace-check] unpacking source archive /nix/store/vl8dldsrilgvjmfqpn2li3bab97z2cgm-source
2.90 s
[gammaloop-workspace-check] source root is source
2.93 s
[gammaloop-workspace-check] Phase: patchPhase
2.93 s
[gammaloop-workspace-check] Executing configureCargoCommonVars
2.93 s
[gammaloop-workspace-check] decompressing cargo artifacts from /nix/store/50vpxlcgfxf2d57i27v3d10zjwxxbm2r-gammaloop-workspace-deps-deps-0.1.0/target.tar.zst to target
3.96 s
[gammaloop-workspace-check] Phase: updateAutotoolsGnuConfigScriptsPhase
3.99 s
[gammaloop-workspace-check] Phase: configurePhase
3.99 s
[gammaloop-workspace-check] will append /build/source/.cargo-home/config.toml with contents of /nix/store/5drf77x6km4ky7gwlrzdx9bbd6fz09g3-vendor-cargo-deps/config.toml
4.00 s
[gammaloop-workspace-check] default configurePhase, nothing to do
4.00 s
[gammaloop-workspace-check] Phase: buildPhase
4.00 s
[gammaloop-workspace-check] +++ command cargo --version
4.00 s
[gammaloop-workspace-check] cargo 1.97.0 (c980f4866 2026-06-30)
4.03 s
[gammaloop-workspace-check] +++ command cargo check --profile ci-optim --locked --workspace --features gammaloop-tracing-filter/clap,gammaloop-tracing-filter/symbolica,idenso/bincode,idenso/reference-cases,linnet/bincode,linnet/drawing,linnet/rkyv,linnet/serde,linnet/symbolica,spenso-macros/shadowing,spenso/shadowing,symbolica/tracing_max_level_info,three-dimensional-reps/display,three-dimensional-reps/eval,three-dimensional-reps/serde --all-targets
4.44 s
[gammaloop-workspace-check] Checking cfg-if v1.0.4
4.44 s
[gammaloop-workspace-check] Checking memchr v2.8.0
4.44 s
[gammaloop-workspace-check] Checking once_cell v1.21.4
4.46 s
[gammaloop-workspace-check] Checking either v1.15.0
4.46 s
[gammaloop-workspace-check] Checking serde_core v1.0.228
4.46 s
[gammaloop-workspace-check] Checking libc v0.2.186
4.46 s
[gammaloop-workspace-check] Checking libm v0.2.16
4.47 s
[gammaloop-workspace-check] Checking itoa v1.0.18
4.48 s
[gammaloop-workspace-check] Checking log v0.4.29
4.48 s
[gammaloop-workspace-check] Checking regex-syntax v0.8.10
4.50 s
[gammaloop-workspace-check] Checking zerocopy v0.8.48
4.50 s
[gammaloop-workspace-check] Checking crossbeam-utils v0.8.21
4.51 s
[gammaloop-workspace-check] Checking equivalent v1.0.2
4.51 s
[gammaloop-workspace-check] Checking zmij v1.0.21
4.52 s
[gammaloop-workspace-check] Checking lazy_static v1.5.0
4.52 s
[gammaloop-workspace-check] Checking bytemuck v1.25.0
4.52 s
[gammaloop-workspace-check] Compiling target-lexicon v0.13.5
4.55 s
[gammaloop-workspace-check] Checking arrayvec v0.7.6
4.56 s
[gammaloop-workspace-check] Checking powerfmt v0.2.0
4.57 s
[gammaloop-workspace-check] Checking itertools v0.14.0
4.57 s
[gammaloop-workspace-check] Checking pin-project-lite v0.2.17
4.58 s
[gammaloop-workspace-check] Checking num-conv v0.2.1
4.59 s
[gammaloop-workspace-check] Checking num_threads v0.1.7
4.61 s
[gammaloop-workspace-check] Checking time-core v0.1.8
4.63 s
[gammaloop-workspace-check] Checking deranged v0.5.8
4.63 s
[gammaloop-workspace-check] Checking safe_arch v0.7.4
4.63 s
[gammaloop-workspace-check] Checking tracing-core v0.1.36
4.66 s
[gammaloop-workspace-check] Checking foldhash v0.2.0
4.68 s
[gammaloop-workspace-check] Checking allocator-api2 v0.2.21
4.70 s
[gammaloop-workspace-check] Checking const-random v0.1.18
4.71 s
[gammaloop-workspace-check] Checking static_assertions v1.1.0
4.74 s
[gammaloop-workspace-check] Checking crossbeam-epoch v0.9.18
4.74 s
[gammaloop-workspace-check] Checking winnow v1.0.2
4.74 s
[gammaloop-workspace-check] Checking unty v0.0.4
4.75 s
[gammaloop-workspace-check] Checking nu-ansi-term v0.50.3
4.76 s
[gammaloop-workspace-check] Checking aho-corasick v1.1.4
4.78 s
[gammaloop-workspace-check] Checking safe_arch v1.0.0
4.86 s
[gammaloop-workspace-check] Checking wide v0.7.33
4.89 s
[gammaloop-workspace-check] Checking crossbeam-deque v0.8.6
4.89 s
[gammaloop-workspace-check] Checking tracing-log v0.2.0
4.91 s
[gammaloop-workspace-check] Checking hashbrown v0.16.1
4.92 s
[gammaloop-workspace-check] Checking tracing v0.1.44
4.97 s
[gammaloop-workspace-check] Checking sharded-slab v0.1.7
5.00 s
[gammaloop-workspace-check] Checking rayon-core v1.13.0
5.04 s
[gammaloop-workspace-check] Checking thread_local v1.1.9
5.06 s
[gammaloop-workspace-check] Checking indenter v0.3.4
5.13 s
[gammaloop-workspace-check] Checking az v1.3.0
5.16 s
[gammaloop-workspace-check] Checking num-traits v0.2.19
5.18 s
[gammaloop-workspace-check] Checking toml_writer v1.1.1+spec-1.1.0
5.27 s
[gammaloop-workspace-check] Checking wide v1.3.0
5.30 s
[gammaloop-workspace-check] Checking rayon v1.12.0
5.32 s
[gammaloop-workspace-check] Compiling phf_shared v0.11.3
5.33 s
[gammaloop-workspace-check] Checking anyhow v1.0.102
5.40 s
[gammaloop-workspace-check] Checking rawpointer v0.2.1
5.42 s
[gammaloop-workspace-check] Checking utf8parse v0.2.2
5.45 s
[gammaloop-workspace-check] Checking toml_parser v1.1.2+spec-1.1.0
5.47 s
[gammaloop-workspace-check] Checking dyn-clone v1.0.20
5.48 s
[gammaloop-workspace-check] Checking alloc-no-stdlib v2.0.4
5.49 s
[gammaloop-workspace-check] Checking anstyle-parse v1.0.0
5.50 s
[gammaloop-workspace-check] Checking matrixmultiply v0.3.10
5.52 s
[gammaloop-workspace-check] Checking getrandom v0.3.4
5.53 s
[gammaloop-workspace-check] Checking time v0.3.47
5.53 s
[gammaloop-workspace-check] Checking gmp-mpfr-sys v1.7.1
5.54 s
[gammaloop-workspace-check] Checking alloc-stdlib v0.2.2
5.58 s
[gammaloop-workspace-check] Checking anstyle-query v1.1.5
5.59 s
[gammaloop-workspace-check] Checking approx v0.5.1
5.60 s
[gammaloop-workspace-check] Checking rand_core v0.9.5
5.63 s
[gammaloop-workspace-check] Checking num-integer v0.1.46
5.63 s
[gammaloop-workspace-check] Checking is_terminal_polyfill v1.70.2
5.65 s
[gammaloop-workspace-check] Checking colored v3.1.1
5.68 s
[gammaloop-workspace-check] Checking colorchoice v1.0.5
5.71 s
[gammaloop-workspace-check] Checking anstyle v1.0.14
5.72 s
[gammaloop-workspace-check] Checking regex-automata v0.4.14
5.72 s
[gammaloop-workspace-check] Compiling phf_generator v0.11.3
5.73 s
[gammaloop-workspace-check] Checking eyre v0.6.12
5.74 s
[gammaloop-workspace-check] Checking bitflags v1.3.2
5.76 s
[gammaloop-workspace-check] Compiling pyo3-build-config v0.28.3
5.76 s
[gammaloop-workspace-check] Checking unicode-width v0.2.2
5.77 s
[gammaloop-workspace-check] Checking brotli-decompressor v5.0.0
5.79 s
[gammaloop-workspace-check] Checking region v3.0.2
5.80 s
[gammaloop-workspace-check] Checking hugepage-rs v0.1.1
5.82 s
[gammaloop-workspace-check] Compiling phf_codegen v0.11.3
5.83 s
[gammaloop-workspace-check] Checking anstream v1.0.0
5.86 s
[gammaloop-workspace-check] Checking wasmtime-jit-icache-coherence v34.0.2
5.88 s
[gammaloop-workspace-check] Checking inventory v0.3.24
5.88 s
[gammaloop-workspace-check] Checking serde v1.0.228
5.91 s
[gammaloop-workspace-check] Checking serde_json v1.0.149
5.92 s
[gammaloop-workspace-check] Checking bitflags v2.11.1
5.92 s
[gammaloop-workspace-check] Checking serde_spanned v1.1.1
5.94 s
[gammaloop-workspace-check] Checking toml_datetime v1.1.1+spec-1.1.0
5.95 s
[gammaloop-workspace-check] Checking spec_math v0.1.6
5.96 s
[gammaloop-workspace-check] Checking thiserror v2.0.18
5.98 s
[gammaloop-workspace-check] Compiling getopts v0.2.24
6.02 s
[gammaloop-workspace-check] Checking libloading v0.9.0
6.03 s
[gammaloop-workspace-check] Checking append-only-vec v0.1.8
6.04 s
[gammaloop-workspace-check] Checking self_cell v1.2.2
6.06 s
[gammaloop-workspace-check] Checking byteorder v1.5.0
6.11 s
[gammaloop-workspace-check] Checking tinyjson v2.5.1
6.12 s
[gammaloop-workspace-check] Checking bytes v1.11.1
6.13 s
[gammaloop-workspace-check] Checking toml v1.1.2+spec-1.1.0
6.14 s
[gammaloop-workspace-check] Compiling unic-common v0.9.0
6.21 s
[gammaloop-workspace-check] Compiling unic-char-range v0.9.0
6.23 s
[gammaloop-workspace-check] Compiling unicode_names2_generator v1.3.0
6.26 s
[gammaloop-workspace-check] Checking linux-raw-sys v0.12.1
6.27 s
[gammaloop-workspace-check] Compiling unic-char-property v0.9.0
6.30 s
[gammaloop-workspace-check] Compiling unic-ucd-version v0.9.0
6.37 s
[gammaloop-workspace-check] Compiling is-macro v0.3.7
6.37 s
[gammaloop-workspace-check] Checking smallvec v1.15.1
6.38 s
[gammaloop-workspace-check] Checking num-complex v0.4.6
6.55 s
[gammaloop-workspace-check] Checking tracing-serde v0.2.0
6.57 s
[gammaloop-workspace-check] Checking bincode v2.0.1
6.59 s
[gammaloop-workspace-check] Checking smartstring v1.0.1
6.63 s
[gammaloop-workspace-check] Checking rustix v1.1.4
6.64 s
[gammaloop-workspace-check] Compiling rustpython-parser-vendored v0.4.0
6.72 s
[gammaloop-workspace-check] Checking iana-time-zone v0.1.65
6.76 s
[gammaloop-workspace-check] Checking simba v0.9.1
6.76 s
[gammaloop-workspace-check] Checking brotli v8.0.2
6.77 s
[gammaloop-workspace-check] Compiling rustpython-parser v0.4.0
6.79 s
[gammaloop-workspace-check] Checking chrono v0.4.44
6.81 s
[gammaloop-workspace-check] Compiling phf v0.11.3
6.84 s
[gammaloop-workspace-check] Checking rustc-hash v2.1.2
6.89 s
[gammaloop-workspace-check] Checking ndarray v0.17.2
6.96 s
[gammaloop-workspace-check] Compiling unic-emoji-char v0.9.0
7.04 s
[gammaloop-workspace-check] Compiling unic-ucd-ident v0.9.0
7.09 s
[gammaloop-workspace-check] Compiling lalrpop-util v0.20.2
7.12 s
[gammaloop-workspace-check] Compiling rustc-hash v1.1.0
7.16 s
[gammaloop-workspace-check] Checking rug v1.30.0
7.18 s
[gammaloop-workspace-check] Compiling symbolica v2.2.0 (https://github.com/alphal00p/symbolica?rev=a277a8dadbaae5a8d6605f2f381991a601e1f345#a277a8da)
7.20 s
[gammaloop-workspace-check] Checking ppv-lite86 v0.2.21
7.20 s
[gammaloop-workspace-check] Checking ahash v0.8.12
7.22 s
[gammaloop-workspace-check] Checking unicode-segmentation v1.13.2
7.26 s
[gammaloop-workspace-check] Checking typenum v1.20.0
7.34 s
[gammaloop-workspace-check] Checking getrandom v0.2.17
7.41 s
[gammaloop-workspace-check] Checking rand_chacha v0.9.0
7.45 s
[gammaloop-workspace-check] Checking scopeguard v1.2.0
7.49 s
[gammaloop-workspace-check] Checking parking_lot_core v0.9.12
7.50 s
[gammaloop-workspace-check] Checking lock_api v0.4.14
7.53 s
[gammaloop-workspace-check] Checking rand v0.9.4
7.61 s
[gammaloop-workspace-check] Checking unicode-ident v1.0.24
7.65 s
[gammaloop-workspace-check] Checking hashbrown v0.17.0
7.66 s
[gammaloop-workspace-check] Checking parking_lot v0.12.5
7.66 s
[gammaloop-workspace-check] Checking errno v0.3.14
7.67 s
[gammaloop-workspace-check] Checking strsim v0.11.1
7.75 s
[gammaloop-workspace-check] Checking unicase v2.9.0
7.78 s
[gammaloop-workspace-check] Checking matchers v0.2.0
7.79 s
[gammaloop-workspace-check] Checking regex v1.12.3
7.80 s
[gammaloop-workspace-check] Checking generic-array v0.14.7
7.81 s
[gammaloop-workspace-check] Checking clap_lex v1.1.0
7.84 s
[gammaloop-workspace-check] Checking signal-hook-registry v1.4.8
7.86 s
[gammaloop-workspace-check] Checking tracing-subscriber v0.3.23
7.89 s
[gammaloop-workspace-check] Checking symjit v2.21.0
7.95 s
[gammaloop-workspace-check] Checking vte v0.14.1
7.96 s
[gammaloop-workspace-check] Checking same-file v1.0.6
8.04 s
[gammaloop-workspace-check] Checking indexmap v2.14.0
8.05 s
[gammaloop-workspace-check] Checking terminal_size v0.4.4
8.07 s
[gammaloop-workspace-check] Checking walkdir v2.5.0
8.09 s
[gammaloop-workspace-check] Checking signal-hook v0.3.18
8.14 s
[gammaloop-workspace-check] Checking clap_builder v4.6.0
8.29 s
[gammaloop-workspace-check] Checking half v2.7.1
8.37 s
[gammaloop-workspace-check] Checking crypto-common v0.1.7
8.40 s
[gammaloop-workspace-check] Checking block-buffer v0.10.4
8.46 s
[gammaloop-workspace-check] Checking mio v1.2.0
8.50 s
[gammaloop-workspace-check] Checking ciborium-io v0.2.2
8.51 s
[gammaloop-workspace-check] Checking minimal-lexical v0.2.1
8.67 s
[gammaloop-workspace-check] Checking digest v0.10.7
8.78 s
[gammaloop-workspace-check] Checking nom v7.1.3
8.80 s
[gammaloop-workspace-check] Checking derive_more v2.1.1
8.84 s
[gammaloop-workspace-check] Checking num-bigint v0.4.6
9.17 s
[gammaloop-workspace-check] Checking signal-hook-mio v0.2.5
9.17 s
[gammaloop-workspace-check] Checking console v0.16.3
9.18 s
[gammaloop-workspace-check] Checking ciborium-ll v0.2.2
9.25 s
[gammaloop-workspace-check] Checking bstr v1.12.1
9.43 s
[gammaloop-workspace-check] Checking linux-raw-sys v0.4.15
9.70 s
[gammaloop-workspace-check] Checking winnow v0.7.15
9.74 s
[gammaloop-workspace-check] Checking cpufeatures v0.2.17
9.79 s
[gammaloop-workspace-check] Checking globset v0.4.18
9.80 s
[gammaloop-workspace-check] Checking sha2 v0.10.9
9.91 s
[gammaloop-workspace-check] Checking rustix v0.38.44
9.94 s
[gammaloop-workspace-check] Compiling unicode_names2 v1.3.0
10.11 s
[gammaloop-workspace-check] Checking ciborium v0.2.2
10.24 s
[gammaloop-workspace-check] Checking rand_core v0.6.4
10.53 s
[gammaloop-workspace-check] Checking getrandom v0.4.2
10.62 s
[gammaloop-workspace-check] Checking fnv v1.0.7
10.64 s
[gammaloop-workspace-check] Checking plotters-backend v0.3.7
10.66 s
[gammaloop-workspace-check] Checking xprec v0.2.2
10.68 s
[gammaloop-workspace-check] Checking fastrand v2.4.1
10.75 s
[gammaloop-workspace-check] Checking ansitok v0.3.0
10.79 s
[gammaloop-workspace-check] Checking rust-embed-utils v8.11.0
10.82 s
[gammaloop-workspace-check] Checking crossterm v0.28.1
10.86 s
[gammaloop-workspace-check] Checking plotters-svg v0.3.7
10.88 s
[gammaloop-workspace-check] Checking tempfile v3.27.0
10.95 s
[gammaloop-workspace-check] Checking toml_datetime v0.6.11
10.95 s
[gammaloop-workspace-check] Checking serde_spanned v0.6.9
11.00 s
[gammaloop-workspace-check] Checking clap v4.6.1
11.01 s
[gammaloop-workspace-check] Checking itertools v0.10.5
11.06 s
[gammaloop-workspace-check] Checking cast v0.3.0
11.08 s
[gammaloop-workspace-check] Checking tap v1.0.1
11.13 s
[gammaloop-workspace-check] Checking toml_write v0.1.2
11.18 s
[gammaloop-workspace-check] Checking plotters v0.3.7
11.24 s
[gammaloop-workspace-check] Checking ansi-str v0.9.0
11.29 s
[gammaloop-workspace-check] Checking rand_chacha v0.3.1
11.35 s
[gammaloop-workspace-check] Checking wyz v0.5.1
11.39 s
[gammaloop-workspace-check] Checking radium v0.7.0
11.43 s
[gammaloop-workspace-check] Checking typeid v1.0.3
11.58 s
[gammaloop-workspace-check] Checking similar v2.7.0
11.65 s
[gammaloop-workspace-check] Checking tinytemplate v1.2.1
11.69 s
[gammaloop-workspace-check] Checking is-terminal v0.4.17
11.74 s
[gammaloop-workspace-check] Checking oorandom v11.1.5
11.76 s
[gammaloop-workspace-check] Checking anes v0.1.6
11.77 s
[gammaloop-workspace-check] Checking bytecount v0.6.9
11.78 s
[gammaloop-workspace-check] Checking funty v2.0.0
11.92 s
[gammaloop-workspace-check] Checking papergrid v0.17.0
11.96 s
[gammaloop-workspace-check] Checking rand v0.8.6
12.02 s
[gammaloop-workspace-check] Checking ron v0.12.1
12.09 s
[gammaloop-workspace-check] Checking testing_table v0.3.0
12.18 s
[gammaloop-workspace-check] Checking toml_edit v0.25.11+spec-1.1.0
12.23 s
[gammaloop-workspace-check] Checking uncased v0.9.10
12.63 s
[gammaloop-workspace-check] Checking bitvec v1.0.1
12.91 s
[gammaloop-workspace-check] Checking env_filter v1.0.1
13.05 s
[gammaloop-workspace-check] Checking toml_edit v0.22.27
13.17 s
[gammaloop-workspace-check] Checking jiff v0.2.24
13.35 s
[gammaloop-workspace-check] Checking ptr_meta v0.1.4
13.37 s
[gammaloop-workspace-check] Checking ucd-trie v0.1.7
13.52 s
[gammaloop-workspace-check] Checking simdutf8 v0.1.5
13.79 s
[gammaloop-workspace-check] Checking pest v2.8.6
13.81 s
[gammaloop-workspace-check] Checking ahash v0.7.8
14.04 s
[gammaloop-workspace-check] Checking hashbrown v0.12.3
14.23 s
[gammaloop-workspace-check] Checking bytecheck v0.6.12
14.25 s
[gammaloop-workspace-check] Checking approx v0.4.0
14.39 s
[gammaloop-workspace-check] Checking seahash v4.1.0
14.70 s
[gammaloop-workspace-check] Checking cgmath v0.18.0
14.93 s
[gammaloop-workspace-check] Checking rend v0.4.2
15.03 s
[gammaloop-workspace-check] Checking num-rational v0.4.2
15.24 s
[gammaloop-workspace-check] Checking num-iter v0.1.45
15.28 s
[gammaloop-workspace-check] Checking insta v1.47.2
15.31 s
[gammaloop-workspace-check] Checking criterion-plot v0.5.0
15.42 s
[gammaloop-workspace-check] Checking ref-ops v0.2.5
15.58 s
[gammaloop-workspace-check] Checking rand_xoshiro v0.6.0
15.61 s
[gammaloop-workspace-check] Checking tabled v0.20.0
15.77 s
[gammaloop-workspace-check] Checking num v0.4.3
15.85 s
[gammaloop-workspace-check] Checking features v0.10.0
15.87 s
[gammaloop-workspace-check] Checking constcat v0.5.1
15.87 s
[gammaloop-workspace-check] Checking criterion v0.5.1
15.93 s
[gammaloop-workspace-check] Checking gat-lending-iterator v0.1.8
15.94 s
[gammaloop-workspace-check] Checking colored v2.2.0
15.96 s
[gammaloop-workspace-check] Checking arrayref v0.3.9
16.02 s
[gammaloop-workspace-check] Checking constant_time_eq v0.4.2
16.06 s
[gammaloop-workspace-check] Checking dot-parser v0.5.1
16.10 s
[gammaloop-workspace-check] Checking cpufeatures v0.3.0
16.14 s
[gammaloop-workspace-check] Checking blake3 v1.8.5
16.26 s
[gammaloop-workspace-check] Checking base64 v0.22.1
16.36 s
[gammaloop-workspace-check] Checking joinery v2.1.0
16.58 s
[gammaloop-workspace-check] Checking siphasher v1.0.2
16.81 s
[gammaloop-workspace-check] Checking phf_shared v0.13.1
16.82 s
[gammaloop-workspace-check] Checking titlecase v2.2.1
17.13 s
[gammaloop-workspace-check] Checking subprocess v0.2.15
17.14 s
[gammaloop-workspace-check] Checking rust_lisp v0.18.0
17.15 s
[gammaloop-workspace-check] Compiling vakint v0.1.2 (/build/source/crates/vakint)
17.34 s
[gammaloop-workspace-check] Checking phf v0.13.1
17.37 s
[gammaloop-workspace-check] Checking version-compare v0.2.1
17.50 s
[gammaloop-workspace-check] Checking xpct v0.5.1
17.66 s
[gammaloop-workspace-check] Checking ryu v1.0.23
17.70 s
[gammaloop-workspace-check] Compiling pyo3-ffi v0.28.3
17.73 s
[gammaloop-workspace-check] Compiling pyo3-macros-backend v0.28.3
17.80 s
[gammaloop-workspace-check] Compiling pyo3 v0.28.3
18.14 s
[gammaloop-workspace-check] Compiling numpy v0.28.0
18.16 s
[gammaloop-workspace-check] Checking string-template-plus v0.4.3
18.43 s
[gammaloop-workspace-check] Checking castaway v0.2.4
18.52 s
[gammaloop-workspace-check] Checking toml_datetime v0.7.5+spec-1.1.0
18.68 s
[gammaloop-workspace-check] Checking strum v0.27.2
18.70 s
[gammaloop-workspace-check] Checking toml v0.9.12+spec-1.1.0
18.81 s
[gammaloop-workspace-check] Checking compact_str v0.9.0
19.04 s
[gammaloop-workspace-check] Checking unicode-truncate v2.0.1
19.12 s
[gammaloop-workspace-check] Checking toml v0.8.23
19.26 s
[gammaloop-workspace-check] Checking kasuari v0.4.12
19.36 s
[gammaloop-workspace-check] Checking lru v0.16.4
19.36 s
[gammaloop-workspace-check] Checking vte v0.15.0
19.49 s
[gammaloop-workspace-check] Checking portable-atomic v1.13.1
19.62 s
[gammaloop-workspace-check] Checking unit-prefix v0.5.2
19.67 s
[gammaloop-workspace-check] Checking rand_distr v0.4.3
19.69 s
[gammaloop-workspace-check] Checking simba v0.6.0
19.75 s
[gammaloop-workspace-check] Checking vt100 v0.16.2
19.82 s
[gammaloop-workspace-check] Checking line-clipping v0.3.7
19.83 s
[gammaloop-workspace-check] Checking gimli v0.32.3
19.85 s
[gammaloop-workspace-check] Compiling three-dimensional-reps v0.1.0 (/build/source/crates/three-dimensional-reps)
20.10 s
[gammaloop-workspace-check] Checking ratatui-core v0.1.0
20.12 s
[gammaloop-workspace-check] Checking figment v0.10.19
20.15 s
[gammaloop-workspace-check] Checking adler2 v2.0.1
20.22 s
[gammaloop-workspace-check] Checking thiserror v1.0.69
20.23 s
[gammaloop-workspace-check] Checking miniz_oxide v0.8.9
20.27 s
[gammaloop-workspace-check] Checking derive_builder v0.11.2
20.32 s
[gammaloop-workspace-check] Checking owo-colors v4.3.0
20.35 s
[gammaloop-workspace-check] Checking crossterm v0.29.0
20.37 s
[gammaloop-workspace-check] Checking indicatif v0.18.4
20.38 s
[gammaloop-workspace-check] Checking object v0.37.3
20.39 s
[gammaloop-workspace-check] Checking tracing-error v0.2.1
20.54 s
[gammaloop-workspace-check] Compiling rustpython-parser-core v0.4.0
20.70 s
[gammaloop-workspace-check] Checking typed-index-collections v3.5.0
20.72 s
[gammaloop-workspace-check] Compiling rustpython-ast v0.4.0
20.96 s
[gammaloop-workspace-check] Checking serde-big-array v0.5.1
20.96 s
[gammaloop-workspace-check] Checking amd v0.2.2
21.06 s
[gammaloop-workspace-check] Checking itertools v0.11.0
21.12 s
[gammaloop-workspace-check] Compiling gammaloop-tracing-filter-macros v0.1.0 (/build/source/crates/gammaloop-tracing-filter-macros)
21.23 s
[gammaloop-workspace-check] Checking rustc-demangle v0.1.27
21.37 s
[gammaloop-workspace-check] Checking option-ext v0.2.0
21.40 s
[gammaloop-workspace-check] Checking rkyv v0.7.46
21.42 s
[gammaloop-workspace-check] Checking ratatui-widgets v0.3.0
21.47 s
[gammaloop-workspace-check] Checking dirs-sys v0.5.0
21.50 s
[gammaloop-workspace-check] Checking ref-cast v1.0.25
21.59 s
[gammaloop-workspace-check] Checking color-spantrace v0.3.0
21.59 s
[gammaloop-workspace-check] Checking nix v0.31.2
21.65 s
[gammaloop-workspace-check] Checking brotli-decompressor v4.0.3
21.71 s
[gammaloop-workspace-check] Checking integer-sqrt v0.1.5
21.72 s
[gammaloop-workspace-check] Checking crossbeam-channel v0.5.15
21.86 s
[gammaloop-workspace-check] Checking itertools v0.12.1
22.13 s
[gammaloop-workspace-check] Checking symlink v0.1.0
22.24 s
[gammaloop-workspace-check] Compiling gammalooprs v0.3.4 (/build/source/crates/gammalooprs)
22.49 s
[gammaloop-workspace-check] Checking ratatui-crossterm v0.1.0
22.52 s
[gammaloop-workspace-check] Checking unsafe-libyaml v0.2.11
22.64 s
[gammaloop-workspace-check] Checking tracing-appender v0.2.5
22.78 s
[gammaloop-workspace-check] Checking env_logger v0.11.10
22.88 s
[gammaloop-workspace-check] Checking include_dir v0.7.4
23.00 s
[gammaloop-workspace-check] Checking pathfinding v4.15.0
23.04 s
[gammaloop-workspace-check] Checking dirs v6.0.0
23.07 s
[gammaloop-workspace-check] Checking clarabel v0.11.1
23.19 s
[gammaloop-workspace-check] Checking schemars v1.2.1
23.28 s
[gammaloop-workspace-check] Checking slotmap v1.1.1
23.48 s
[gammaloop-workspace-check] Checking ctrlc v3.5.2
23.73 s
[gammaloop-workspace-check] Checking tracing-indicatif v0.3.14
23.80 s
[gammaloop-workspace-check] Checking brotli v7.0.0
23.98 s
[gammaloop-workspace-check] Checking serde_yaml v0.9.34+deprecated
24.05 s
[gammaloop-workspace-check] Checking ratatui-macros v0.7.0
24.17 s
[gammaloop-workspace-check] Checking json5 v0.4.1
24.17 s
[gammaloop-workspace-check] Checking ratatui v0.30.0
24.40 s
[gammaloop-workspace-check] Checking vectorize v0.2.0
24.50 s
[gammaloop-workspace-check] Checking ringbuffer v0.16.0
24.59 s
[gammaloop-workspace-check] Checking base62 v2.2.4
24.62 s
[gammaloop-workspace-check] Checking rust-embed v8.11.0
24.71 s
[gammaloop-workspace-check] Checking clap_complete v4.6.3
24.86 s
[gammaloop-workspace-check] Checking strip-ansi-escapes v0.2.1
24.87 s
[gammaloop-workspace-check] Checking fd-lock v4.0.4
25.00 s
[gammaloop-workspace-check] Compiling gammaloop-api v0.1.0 (/build/source/crates/gammaloop-api)
25.01 s
[gammaloop-workspace-check] Checking itertools v0.13.0
25.05 s
[gammaloop-workspace-check] Checking strum v0.26.3
25.09 s
[gammaloop-workspace-check] Checking sysinfo v0.33.1
25.12 s
[gammaloop-workspace-check] Checking shlex v1.3.0
25.48 s
[gammaloop-workspace-check] Checking addr2line v0.25.1
25.49 s
[gammaloop-workspace-check] Checking futures-task v0.3.32
25.54 s
[gammaloop-workspace-check] Checking futures-core v0.3.32
25.58 s
[gammaloop-workspace-check] Checking slab v0.4.12
25.74 s
[gammaloop-workspace-check] Checking clap_complete_nushell v4.6.0
25.74 s
[gammaloop-workspace-check] Checking sdd v3.0.10
25.80 s
[gammaloop-workspace-check] Checking futures-util v0.3.32
26.13 s
[gammaloop-workspace-check] Compiling gammaloop-integration-tests v0.1.0 (/build/source/tests)
26.22 s
[gammaloop-workspace-check] Compiling test-log-core v0.2.20
26.26 s
[gammaloop-workspace-check] Compiling rustc_version v0.4.1
26.26 s
[gammaloop-workspace-check] Checking which v8.0.2
26.27 s
[gammaloop-workspace-check] Checking scc v2.4.0
26.51 s
[gammaloop-workspace-check] Checking backtrace v0.3.76
26.53 s
[gammaloop-workspace-check] Checking bincode v1.3.3
26.66 s
[gammaloop-workspace-check] Compiling gungraun-runner v0.18.2
27.16 s
[gammaloop-workspace-check] Checking nalgebra v0.29.0
27.33 s
[gammaloop-workspace-check] Checking proc-macro2 v1.0.106
27.63 s
[gammaloop-workspace-check] Checking color-eyre v0.6.5
27.91 s
[gammaloop-workspace-check] Compiling gungraun-macros v0.8.0
28.06 s
[gammaloop-workspace-check] Checking reedline v0.42.0
28.24 s
[gammaloop-workspace-check] Checking base64 v0.21.7
28.57 s
[gammaloop-workspace-check] Checking quote v1.0.45
28.89 s
[gammaloop-workspace-check] Checking maplit v1.0.2
28.92 s
[gammaloop-workspace-check] Checking ron v0.8.1
29.00 s
[gammaloop-workspace-check] Compiling iai-callgrind-runner v0.14.2
29.38 s
[gammaloop-workspace-check] Checking kurbo v0.13.0
29.65 s
[gammaloop-workspace-check] Checking wait-timeout v0.2.1
29.89 s
[gammaloop-workspace-check] Compiling numerica v2.2.0 (https://github.com/alphal00p/symbolica?rev=a277a8dadbaae5a8d6605f2f381991a601e1f345#a277a8da)
29.92 s
[gammaloop-workspace-check] Checking futures-executor v0.3.32
30.10 s
[gammaloop-workspace-check] Compiling iai-callgrind v0.14.2
30.27 s
[gammaloop-workspace-check] Checking bit-vec v0.8.0
30.61 s
[gammaloop-workspace-check] Checking quick-error v1.2.3
30.64 s
[gammaloop-workspace-check] Checking bit-set v0.8.0
30.74 s
[gammaloop-workspace-check] Checking rusty-fork v0.3.1
31.08 s
[gammaloop-workspace-check] Checking syn v2.0.117
31.10 s
[gammaloop-workspace-check] Compiling iai-callgrind-macros v0.5.1
31.11 s
[gammaloop-workspace-check] Checking serial_test v3.4.0
31.42 s
[gammaloop-workspace-check] Checking rand_xorshift v0.4.0
31.53 s
[gammaloop-workspace-check] Checking console v0.15.11
32.07 s
[gammaloop-workspace-check] Checking pathdiff v0.2.3
32.10 s
[gammaloop-workspace-check] Checking unarray v0.1.4
32.17 s
[gammaloop-workspace-check] Checking similar-asserts v1.7.0
32.21 s
[gammaloop-workspace-check] Compiling test-log-macros v0.2.20
32.29 s
[gammaloop-workspace-check] Checking proptest v1.11.0
32.49 s
[gammaloop-workspace-check] Checking clinnet v0.1.8 (/build/source/crates/clinnet)
33.61 s
[gammaloop-workspace-check] Checking kurvst v0.1.0 (/build/source/crates/kurvst)
38.36 s
[gammaloop-workspace-check] Compiling graphica v2.1.0 (https://github.com/alphal00p/symbolica?rev=a277a8dadbaae5a8d6605f2f381991a601e1f345#a277a8da)
38.70 s
[gammaloop-workspace-check] Checking test-log v0.2.20
43.96 s
[gammaloop-workspace-check] Checking statrs v0.16.1
45.64 s
[gammaloop-workspace-check] Checking momtrop v0.3.0
45.89 s
[gammaloop-workspace-check] Checking gungraun v0.18.2
50.78 s
[gammaloop-workspace-check] Compiling pyo3-macros v0.28.3
51.96 s
[gammaloop-workspace-check] Compiling pyo3-stub-gen-derive v0.17.2
60.60 s
[gammaloop-workspace-check] Checking pyo3-stub-gen v0.17.2
68.27 s
[gammaloop-workspace-check] Checking symbolica-utils v0.1.0 (/build/source/crates/symbolica-utils)
68.27 s
[gammaloop-workspace-check] Checking spenso-macros v0.3.2 (/build/source/crates/spenso-macros)
231.87 s
[gammaloop-workspace-check] Compiling gammaloop-workspace-hack v0.1.0 (/build/source/crates/gammaloop-workspace-hack)
232.14 s
[gammaloop-workspace-check] Checking linnet v0.17.0 (/build/source/crates/linnet)
235.14 s
[gammaloop-workspace-check] Checking spenso v0.6.0 (/build/source/crates/spenso)
235.14 s
[gammaloop-workspace-check] Checking linnet-py v0.1.0 (/build/source/crates/linnet-py)
235.14 s
[gammaloop-workspace-check] Checking linnest v0.1.0 (/build/source/crates/linnest)
239.63 s
[gammaloop-workspace-check] Checking idenso v0.3.0 (/build/source/crates/idenso)
239.63 s
[gammaloop-workspace-check] Checking gammaloop-tracing-filter v0.1.0 (/build/source/crates/gammaloop-tracing-filter)
240.99 s
[gammaloop-workspace-check] Checking spenso-hep-lib v0.1.7 (/build/source/crates/spenso-hep-lib)
241.16 s
[gammaloop-workspace-check] Checking spynso3 v0.1.2 (/build/source/crates/spynso3)
261.60 s
[gammaloop-workspace-check] warning : method `reinterpret_loop_momenta_and_compute_prefactor` is never used
261.60 s
[gammaloop-workspace-check] --> crates/gammalooprs/src/integrands/process/mod.rs:2707:19
261.60 s
[gammaloop-workspace-check] |
261.60 s
[gammaloop-workspace-check] 2144 | impl LmbMultiChannelingSetup {
261.60 s
[gammaloop-workspace-check] | ---------------------------- method in this implementation
261.60 s
[gammaloop-workspace-check] ...
261.60 s
[gammaloop-workspace-check] 2707 | pub(crate) fn reinterpret_loop_momenta_and_compute_prefactor<T: FloatLike>(
261.60 s
[gammaloop-workspace-check] | ^^^^^^^^^^^^^^^^^^^^^^^^^^^^^^^^^^^^^^^^^^^^^^
261.60 s
[gammaloop-workspace-check] |
261.60 s
[gammaloop-workspace-check] = note : `#[warn(dead_code)]` (part of `#[warn(unused)]`) on by default
261.60 s
[gammaloop-workspace-check]
264.80 s
[gammaloop-workspace-check] warning : `gammalooprs` (lib) generated 1 warning
265.56 s
[gammaloop-workspace-check] warning : unused import: `GaussianReferenceFunction`
265.56 s
[gammaloop-workspace-check] --> crates/gammaloop-api/src/state.rs:38:27
265.56 s
[gammaloop-workspace-check] |
265.56 s
[gammaloop-workspace-check] 38 | integrands::process::{GaussianReferenceFunction, ProcessIntegrand},
265.56 s
[gammaloop-workspace-check] | ^^^^^^^^^^^^^^^^^^^^^^^^^
265.56 s
[gammaloop-workspace-check] |
265.56 s
[gammaloop-workspace-check] = note : `#[warn(unused_imports)]` (part of `#[warn(unused)]`) on by default
265.56 s
[gammaloop-workspace-check]
271.52 s
[gammaloop-workspace-check] warning : `gammaloop-api` (lib) generated 1 warning (run `cargo fix --lib -p gammaloop-api` to apply 1 suggestion)
272.03 s
[gammaloop-workspace-check] warning : `gammalooprs` (lib test) generated 1 warning (1 duplicate)
272.11 s
[gammaloop-workspace-check] error[E0560] : struct `CutInfo` has no field named `lmb_channel_id`
272.11 s
[gammaloop-workspace-check] --> tests/tests/test_differential.rs:86:13
272.11 s
[gammaloop-workspace-check] |
272.11 s
[gammaloop-workspace-check] 86 | lmb_channel_id: None,
272.11 s
[gammaloop-workspace-check] | ^^^^^^^^^^^^^^ `CutInfo` does not have this field
272.11 s
[gammaloop-workspace-check] |
272.11 s
[gammaloop-workspace-check] = note : available fields are: `sampling_channel_id`, `sampling_channel_edge_ids`
272.11 s
[gammaloop-workspace-check]
272.11 s
[gammaloop-workspace-check] error[E0560] : struct `CutInfo` has no field named `lmb_channel_edge_ids`
272.11 s
[gammaloop-workspace-check] --> tests/tests/test_differential.rs:87:13
272.11 s
[gammaloop-workspace-check] |
272.11 s
[gammaloop-workspace-check] 87 | lmb_channel_edge_ids: None,
272.11 s
[gammaloop-workspace-check] | ^^^^^^^^^^^^^^^^^^^^ `CutInfo` does not have this field
272.11 s
[gammaloop-workspace-check] |
272.11 s
[gammaloop-workspace-check] = note : available fields are: `sampling_channel_id`, `sampling_channel_edge_ids`
272.11 s
[gammaloop-workspace-check]
272.18 s
[gammaloop-workspace-check] For more information about this error, try `rustc --explain E0560`.
272.19 s
[gammaloop-workspace-check] error : could not compile `gammaloop-integration-tests` (test "test_differential") due to 2 previous errors
272.19 s
[gammaloop-workspace-check] warning : build failed, waiting for other jobs to finish...
272.44 s
[gammaloop-workspace-check] error[E0609] : no field `lmb_channel_edge_ids` on type `CutInfo`
272.44 s
[gammaloop-workspace-check] --> tests/tests/test_evaluation_api.rs:311:10
272.44 s
[gammaloop-workspace-check] |
272.44 s
[gammaloop-workspace-check] 311 | .lmb_channel_edge_ids
272.44 s
[gammaloop-workspace-check] | ^^^^^^^^^^^^^^^^^^^^ unknown field
272.44 s
[gammaloop-workspace-check] |
272.44 s
[gammaloop-workspace-check] = note : available fields are: `particle_pdgs`, `cut_id`, `graph_id`, `graph_group_id`, `orientation_id` ... and 2 others
272.44 s
[gammaloop-workspace-check]
272.46 s
[gammaloop-workspace-check] error[E0609] : no field `lmb_channel_edge_ids` on type `CutInfo`
272.46 s
[gammaloop-workspace-check] --> tests/tests/test_evaluation_api.rs:591:26
272.46 s
[gammaloop-workspace-check] |
272.46 s
[gammaloop-workspace-check] 591 | .lmb_channel_edge_ids
272.46 s
[gammaloop-workspace-check] | ^^^^^^^^^^^^^^^^^^^^ unknown field
272.46 s
[gammaloop-workspace-check] |
272.46 s
[gammaloop-workspace-check] = note : available fields are: `particle_pdgs`, `cut_id`, `graph_id`, `graph_group_id`, `orientation_id` ... and 2 others
272.46 s
[gammaloop-workspace-check]
272.51 s
[gammaloop-workspace-check] error[E0609] : no field `lmb_channel_edge_ids` on type `CutInfo`
272.51 s
[gammaloop-workspace-check] --> tests/tests/test_evaluation_api.rs:1177:18
272.51 s
[gammaloop-workspace-check] |
272.51 s
[gammaloop-workspace-check] 1177 | .lmb_channel_edge_ids
272.51 s
[gammaloop-workspace-check] | ^^^^^^^^^^^^^^^^^^^^ unknown field
272.51 s
[gammaloop-workspace-check] |
272.51 s
[gammaloop-workspace-check] = note : available fields are: `particle_pdgs`, `cut_id`, `graph_id`, `graph_group_id`, `orientation_id` ... and 2 others
272.51 s
[gammaloop-workspace-check]
272.60 s
[gammaloop-workspace-check] error[E0609] : no field `lmb_channel_edge_ids` on type `CutInfo`
272.60 s
[gammaloop-workspace-check] --> tests/tests/test_evaluation_api.rs:1222:22
272.60 s
[gammaloop-workspace-check] |
272.60 s
[gammaloop-workspace-check] 1222 | .lmb_channel_edge_ids
272.60 s
[gammaloop-workspace-check] | ^^^^^^^^^^^^^^^^^^^^ unknown field
272.60 s
[gammaloop-workspace-check] |
272.60 s
[gammaloop-workspace-check] = note : available fields are: `particle_pdgs`, `cut_id`, `graph_id`, `graph_group_id`, `orientation_id` ... and 2 others
272.60 s
[gammaloop-workspace-check]
272.61 s
[gammaloop-workspace-check] error[E0609] : no field `lmb_channel_edge_ids` on type `CutInfo`
272.61 s
[gammaloop-workspace-check] --> tests/tests/test_evaluation_api.rs:1281:14
272.61 s
[gammaloop-workspace-check] |
272.61 s
[gammaloop-workspace-check] 1281 | .lmb_channel_edge_ids
272.61 s
[gammaloop-workspace-check] | ^^^^^^^^^^^^^^^^^^^^ unknown field
272.61 s
[gammaloop-workspace-check] |
272.61 s
[gammaloop-workspace-check] = note : available fields are: `particle_pdgs`, `cut_id`, `graph_id`, `graph_group_id`, `orientation_id` ... and 2 others
272.61 s
[gammaloop-workspace-check]
272.66 s
[gammaloop-workspace-check] error[E0609] : no field `lmb_channel_edge_ids` on type `CutInfo`
272.66 s
[gammaloop-workspace-check] --> tests/tests/test_evaluation_api.rs:1428:18
272.66 s
[gammaloop-workspace-check] |
272.66 s
[gammaloop-workspace-check] 1428 | .lmb_channel_edge_ids
272.66 s
[gammaloop-workspace-check] | ^^^^^^^^^^^^^^^^^^^^ unknown field
272.66 s
[gammaloop-workspace-check] |
272.66 s
[gammaloop-workspace-check] = note : available fields are: `particle_pdgs`, `cut_id`, `graph_id`, `graph_group_id`, `orientation_id` ... and 2 others
272.66 s
[gammaloop-workspace-check]
272.74 s
[gammaloop-workspace-check] For more information about this error, try `rustc --explain E0609`.
272.76 s
[gammaloop-workspace-check] error : could not compile `gammaloop-integration-tests` (test "test_evaluation_api") due to 6 previous errors
273.36 s
[gammaloop-workspace-check] error[E0609] : no field `lmb_channel_id` on type `CutInfo`
273.36 s
[gammaloop-workspace-check] --> tests/tests/test_runs/utils.rs:568:36
273.36 s
[gammaloop-workspace-check] |
273.36 s
[gammaloop-workspace-check] 568 | event.cut_info.lmb_channel_id,
273.36 s
[gammaloop-workspace-check] | ^^^^^^^^^^^^^^ unknown field
273.36 s
[gammaloop-workspace-check] |
273.36 s
[gammaloop-workspace-check] = note : available fields are: `particle_pdgs`, `cut_id`, `graph_id`, `graph_group_id`, `orientation_id` ... and 2 others
273.36 s
[gammaloop-workspace-check]
273.36 s
[gammaloop-workspace-check] error[E0609] : no field `lmb_channel_id` on type `CutInfo`
273.36 s
[gammaloop-workspace-check] --> tests/tests/test_runs/utils.rs:580:36
273.36 s
[gammaloop-workspace-check] |
273.36 s
[gammaloop-workspace-check] 580 | event.cut_info.lmb_channel_id,
273.36 s
[gammaloop-workspace-check] | ^^^^^^^^^^^^^^ unknown field
273.36 s
[gammaloop-workspace-check] |
273.36 s
[gammaloop-workspace-check] = note : available fields are: `particle_pdgs`, `cut_id`, `graph_id`, `graph_group_id`, `orientation_id` ... and 2 others
273.36 s
[gammaloop-workspace-check]
273.92 s
[gammaloop-workspace-check] error : could not compile `gammaloop-integration-tests` (test "test_runs") due to 2 previous errors
274.58 s
Progress: 0 of 1 built (1 failed)
274.58 s
Failed to build gammaloop-workspace-check after 4m31s
274.60 s
Cannot build ' /nix/store/dwdr0078rsb6aq3cbband7h8345g8q87-gammaloop-workspace-check-0.1.0.drv '.
274.60 s
Reason: builder failed with exit code 101 .
274.60 s
Output paths:
274.60 s
/nix/store/s4yvjjly6igylkjb2qakqn4rqgs3i0yq-gammaloop-workspace-check-0.1.0
274.60 s
Last 533 log lines:
274.60 s
> Running phase: unpackPhase
274.60 s
> unpacking source archive /nix/store/vl8dldsrilgvjmfqpn2li3bab97z2cgm-source
274.60 s
> source root is source
274.60 s
> Running phase: patchPhase
274.60 s
> Executing configureCargoCommonVars
274.60 s
> decompressing cargo artifacts from /nix/store/50vpxlcgfxf2d57i27v3d10zjwxxbm2r-gammaloop-workspace-deps-deps-0.1.0/target.tar.zst to target
274.60 s
> Running phase: updateAutotoolsGnuConfigScriptsPhase
274.60 s
> Running phase: configurePhase
274.60 s
> will append /build/source/.cargo-home/config.toml with contents of /nix/store/5drf77x6km4ky7gwlrzdx9bbd6fz09g3-vendor-cargo-deps/config.toml
274.60 s
> default configurePhase, nothing to do
274.60 s
> Running phase: buildPhase
274.60 s
> +++ command cargo --version
274.60 s
> cargo 1.97.0 (c980f4866 2026-06-30)
274.60 s
> +++ command cargo check --profile ci-optim --locked --workspace --features gammaloop-tracing-filter/clap,gammaloop-tracing-filter/symbolica,idenso/bincode,idenso/reference-cases,linnet/bincode,linnet/drawing,linnet/rkyv,linnet/serde,linnet/symbolica,spenso-macros/shadowing,spenso/shadowing,symbolica/tracing_max_level_info,three-dimensional-reps/display,three-dimensional-reps/eval,three-dimensional-reps/serde --all-targets
274.60 s
> Checking cfg-if v1.0.4
274.60 s
> Checking memchr v2.8.0
274.60 s
> Checking once_cell v1.21.4
274.60 s
> Checking either v1.15.0
274.60 s
> Checking serde_core v1.0.228
274.60 s
> Checking libc v0.2.186
274.60 s
> Checking libm v0.2.16
274.60 s
> Checking itoa v1.0.18
274.60 s
> Checking log v0.4.29
274.60 s
> Checking regex-syntax v0.8.10
274.60 s
> Checking zerocopy v0.8.48
274.60 s
> Checking crossbeam-utils v0.8.21
274.60 s
> Checking equivalent v1.0.2
274.60 s
> Checking zmij v1.0.21
274.60 s
> Checking lazy_static v1.5.0
274.60 s
> Checking bytemuck v1.25.0
274.60 s
> Compiling target-lexicon v0.13.5
274.60 s
> Checking arrayvec v0.7.6
274.60 s
> Checking powerfmt v0.2.0
274.60 s
> Checking itertools v0.14.0
274.60 s
> Checking pin-project-lite v0.2.17
274.60 s
> Checking num-conv v0.2.1
274.60 s
> Checking num_threads v0.1.7
274.60 s
> Checking time-core v0.1.8
274.60 s
> Checking deranged v0.5.8
274.60 s
> Checking safe_arch v0.7.4
274.60 s
> Checking tracing-core v0.1.36
274.60 s
> Checking foldhash v0.2.0
274.60 s
> Checking allocator-api2 v0.2.21
274.60 s
> Checking const-random v0.1.18
274.60 s
> Checking static_assertions v1.1.0
274.60 s
> Checking crossbeam-epoch v0.9.18
274.60 s
> Checking winnow v1.0.2
274.60 s
> Checking unty v0.0.4
274.60 s
> Checking nu-ansi-term v0.50.3
274.60 s
> Checking aho-corasick v1.1.4
274.60 s
> Checking safe_arch v1.0.0
274.60 s
> Checking wide v0.7.33
274.60 s
> Checking crossbeam-deque v0.8.6
274.60 s
> Checking tracing-log v0.2.0
274.60 s
> Checking hashbrown v0.16.1
274.60 s
> Checking tracing v0.1.44
274.60 s
> Checking sharded-slab v0.1.7
274.60 s
> Checking rayon-core v1.13.0
274.60 s
> Checking thread_local v1.1.9
274.60 s
> Checking indenter v0.3.4
274.60 s
> Checking az v1.3.0
274.60 s
> Checking num-traits v0.2.19
274.60 s
> Checking toml_writer v1.1.1+spec-1.1.0
274.60 s
> Checking wide v1.3.0
274.60 s
> Checking rayon v1.12.0
274.60 s
> Compiling phf_shared v0.11.3
274.60 s
> Checking anyhow v1.0.102
274.60 s
> Checking rawpointer v0.2.1
274.60 s
> Checking utf8parse v0.2.2
274.60 s
> Checking toml_parser v1.1.2+spec-1.1.0
274.60 s
> Checking dyn-clone v1.0.20
274.60 s
> Checking alloc-no-stdlib v2.0.4
274.60 s
> Checking anstyle-parse v1.0.0
274.60 s
> Checking matrixmultiply v0.3.10
274.60 s
> Checking getrandom v0.3.4
274.60 s
> Checking time v0.3.47
274.60 s
> Checking gmp-mpfr-sys v1.7.1
274.60 s
> Checking alloc-stdlib v0.2.2
274.60 s
> Checking anstyle-query v1.1.5
274.60 s
> Checking approx v0.5.1
274.60 s
> Checking rand_core v0.9.5
274.60 s
> Checking num-integer v0.1.46
274.60 s
> Checking is_terminal_polyfill v1.70.2
274.60 s
> Checking colored v3.1.1
274.60 s
> Checking colorchoice v1.0.5
274.60 s
> Checking anstyle v1.0.14
274.60 s
> Checking regex-automata v0.4.14
274.60 s
> Compiling phf_generator v0.11.3
274.60 s
> Checking eyre v0.6.12
274.60 s
> Checking bitflags v1.3.2
274.60 s
> Compiling pyo3-build-config v0.28.3
274.60 s
> Checking unicode-width v0.2.2
274.60 s
> Checking brotli-decompressor v5.0.0
274.60 s
> Checking region v3.0.2
274.60 s
> Checking hugepage-rs v0.1.1
274.60 s
> Compiling phf_codegen v0.11.3
274.60 s
> Checking anstream v1.0.0
274.60 s
> Checking wasmtime-jit-icache-coherence v34.0.2
274.60 s
> Checking inventory v0.3.24
274.60 s
> Checking serde v1.0.228
274.60 s
> Checking serde_json v1.0.149
274.60 s
> Checking bitflags v2.11.1
274.60 s
> Checking serde_spanned v1.1.1
274.60 s
> Checking toml_datetime v1.1.1+spec-1.1.0
274.60 s
> Checking spec_math v0.1.6
274.60 s
> Checking thiserror v2.0.18
274.60 s
> Compiling getopts v0.2.24
274.60 s
> Checking libloading v0.9.0
274.60 s
> Checking append-only-vec v0.1.8
274.60 s
> Checking self_cell v1.2.2
274.60 s
> Checking byteorder v1.5.0
274.60 s
> Checking tinyjson v2.5.1
274.60 s
> Checking bytes v1.11.1
274.60 s
> Checking toml v1.1.2+spec-1.1.0
274.60 s
> Compiling unic-common v0.9.0
274.60 s
> Compiling unic-char-range v0.9.0
274.60 s
> Compiling unicode_names2_generator v1.3.0
274.60 s
> Checking linux-raw-sys v0.12.1
274.60 s
> Compiling unic-char-property v0.9.0
274.60 s
> Compiling unic-ucd-version v0.9.0
274.60 s
> Compiling is-macro v0.3.7
274.60 s
> Checking smallvec v1.15.1
274.60 s
> Checking num-complex v0.4.6
274.60 s
> Checking tracing-serde v0.2.0
274.60 s
> Checking bincode v2.0.1
274.60 s
> Checking smartstring v1.0.1
274.60 s
> Checking rustix v1.1.4
274.60 s
> Compiling rustpython-parser-vendored v0.4.0
274.60 s
> Checking iana-time-zone v0.1.65
274.60 s
> Checking simba v0.9.1
274.60 s
> Checking brotli v8.0.2
274.60 s
> Compiling rustpython-parser v0.4.0
274.60 s
> Checking chrono v0.4.44
274.60 s
> Compiling phf v0.11.3
274.60 s
> Checking rustc-hash v2.1.2
274.60 s
> Checking ndarray v0.17.2
274.60 s
> Compiling unic-emoji-char v0.9.0
274.60 s
> Compiling unic-ucd-ident v0.9.0
274.60 s
> Compiling lalrpop-util v0.20.2
274.60 s
> Compiling rustc-hash v1.1.0
274.60 s
> Checking rug v1.30.0
274.60 s
> Compiling symbolica v2.2.0 (https://github.com/alphal00p/symbolica?rev=a277a8dadbaae5a8d6605f2f381991a601e1f345#a277a8da)
274.60 s
> Checking ppv-lite86 v0.2.21
274.60 s
> Checking ahash v0.8.12
274.60 s
> Checking unicode-segmentation v1.13.2
274.60 s
> Checking typenum v1.20.0
274.60 s
> Checking getrandom v0.2.17
274.60 s
> Checking rand_chacha v0.9.0
274.60 s
> Checking scopeguard v1.2.0
274.60 s
> Checking parking_lot_core v0.9.12
274.60 s
> Checking lock_api v0.4.14
274.60 s
> Checking rand v0.9.4
274.60 s
> Checking unicode-ident v1.0.24
274.60 s
> Checking hashbrown v0.17.0
274.60 s
> Checking parking_lot v0.12.5
274.60 s
> Checking errno v0.3.14
274.60 s
> Checking strsim v0.11.1
274.60 s
> Checking unicase v2.9.0
274.60 s
> Checking matchers v0.2.0
274.60 s
> Checking regex v1.12.3
274.60 s
> Checking generic-array v0.14.7
274.60 s
> Checking clap_lex v1.1.0
274.60 s
> Checking signal-hook-registry v1.4.8
274.60 s
> Checking tracing-subscriber v0.3.23
274.60 s
> Checking symjit v2.21.0
274.60 s
> Checking vte v0.14.1
274.60 s
> Checking same-file v1.0.6
274.60 s
> Checking indexmap v2.14.0
274.60 s
> Checking terminal_size v0.4.4
274.60 s
> Checking walkdir v2.5.0
274.60 s
> Checking signal-hook v0.3.18
274.60 s
> Checking clap_builder v4.6.0
274.60 s
> Checking half v2.7.1
274.60 s
> Checking crypto-common v0.1.7
274.60 s
> Checking block-buffer v0.10.4
274.60 s
> Checking mio v1.2.0
274.60 s
> Checking ciborium-io v0.2.2
274.60 s
> Checking minimal-lexical v0.2.1
274.60 s
> Checking digest v0.10.7
274.60 s
> Checking nom v7.1.3
274.60 s
> Checking derive_more v2.1.1
274.60 s
> Checking num-bigint v0.4.6
274.60 s
> Checking signal-hook-mio v0.2.5
274.60 s
> Checking console v0.16.3
274.60 s
> Checking ciborium-ll v0.2.2
274.60 s
> Checking bstr v1.12.1
274.60 s
> Checking linux-raw-sys v0.4.15
274.60 s
> Checking winnow v0.7.15
274.60 s
> Checking cpufeatures v0.2.17
274.60 s
> Checking globset v0.4.18
274.60 s
> Checking sha2 v0.10.9
274.60 s
> Checking rustix v0.38.44
274.60 s
> Compiling unicode_names2 v1.3.0
274.60 s
> Checking ciborium v0.2.2
274.60 s
> Checking rand_core v0.6.4
274.60 s
> Checking getrandom v0.4.2
274.60 s
> Checking fnv v1.0.7
274.60 s
> Checking plotters-backend v0.3.7
274.60 s
> Checking xprec v0.2.2
274.60 s
> Checking fastrand v2.4.1
274.60 s
> Checking ansitok v0.3.0
274.60 s
> Checking rust-embed-utils v8.11.0
274.60 s
> Checking crossterm v0.28.1
274.60 s
> Checking plotters-svg v0.3.7
274.60 s
> Checking tempfile v3.27.0
274.60 s
> Checking toml_datetime v0.6.11
274.60 s
> Checking serde_spanned v0.6.9
274.60 s
> Checking clap v4.6.1
274.60 s
> Checking itertools v0.10.5
274.60 s
> Checking cast v0.3.0
274.60 s
> Checking tap v1.0.1
274.60 s
> Checking toml_write v0.1.2
274.60 s
> Checking plotters v0.3.7
274.60 s
> Checking ansi-str v0.9.0
274.60 s
> Checking rand_chacha v0.3.1
274.60 s
> Checking wyz v0.5.1
274.60 s
> Checking radium v0.7.0
274.60 s
> Checking typeid v1.0.3
274.60 s
> Checking similar v2.7.0
274.60 s
> Checking tinytemplate v1.2.1
274.60 s
> Checking is-terminal v0.4.17
274.60 s
> Checking oorandom v11.1.5
274.60 s
> Checking anes v0.1.6
274.60 s
> Checking bytecount v0.6.9
274.60 s
> Checking funty v2.0.0
274.60 s
> Checking papergrid v0.17.0
274.60 s
> Checking rand v0.8.6
274.60 s
> Checking ron v0.12.1
274.60 s
> Checking testing_table v0.3.0
274.60 s
> Checking toml_edit v0.25.11+spec-1.1.0
274.60 s
> Checking uncased v0.9.10
274.60 s
> Checking bitvec v1.0.1
274.60 s
> Checking env_filter v1.0.1
274.60 s
> Checking toml_edit v0.22.27
274.60 s
> Checking jiff v0.2.24
274.60 s
> Checking ptr_meta v0.1.4
274.60 s
> Checking ucd-trie v0.1.7
274.60 s
> Checking simdutf8 v0.1.5
274.60 s
> Checking pest v2.8.6
274.60 s
> Checking ahash v0.7.8
274.60 s
> Checking hashbrown v0.12.3
274.60 s
> Checking bytecheck v0.6.12
274.60 s
> Checking approx v0.4.0
274.60 s
> Checking seahash v4.1.0
274.60 s
> Checking cgmath v0.18.0
274.60 s
> Checking rend v0.4.2
274.60 s
> Checking num-rational v0.4.2
274.60 s
> Checking num-iter v0.1.45
274.60 s
> Checking insta v1.47.2
274.60 s
> Checking criterion-plot v0.5.0
274.60 s
> Checking ref-ops v0.2.5
274.60 s
> Checking rand_xoshiro v0.6.0
274.60 s
> Checking tabled v0.20.0
274.60 s
> Checking num v0.4.3
274.60 s
> Checking features v0.10.0
274.60 s
> Checking constcat v0.5.1
274.60 s
> Checking criterion v0.5.1
274.60 s
> Checking gat-lending-iterator v0.1.8
274.60 s
> Checking colored v2.2.0
274.60 s
> Checking arrayref v0.3.9
274.60 s
> Checking constant_time_eq v0.4.2
274.60 s
> Checking dot-parser v0.5.1
274.60 s
> Checking cpufeatures v0.3.0
274.60 s
> Checking blake3 v1.8.5
274.60 s
> Checking base64 v0.22.1
274.60 s
> Checking joinery v2.1.0
274.60 s
> Checking siphasher v1.0.2
274.60 s
> Checking phf_shared v0.13.1
274.60 s
> Checking titlecase v2.2.1
274.60 s
> Checking subprocess v0.2.15
274.60 s
> Checking rust_lisp v0.18.0
274.60 s
> Compiling vakint v0.1.2 (/build/source/crates/vakint)
274.60 s
> Checking phf v0.13.1
274.60 s
> Checking version-compare v0.2.1
274.60 s
> Checking xpct v0.5.1
274.60 s
> Checking ryu v1.0.23
274.60 s
> Compiling pyo3-ffi v0.28.3
274.60 s
> Compiling pyo3-macros-backend v0.28.3
274.60 s
> Compiling pyo3 v0.28.3
274.60 s
> Compiling numpy v0.28.0
274.60 s
> Checking string-template-plus v0.4.3
274.60 s
> Checking castaway v0.2.4
274.60 s
> Checking toml_datetime v0.7.5+spec-1.1.0
274.60 s
> Checking strum v0.27.2
274.60 s
> Checking toml v0.9.12+spec-1.1.0
274.60 s
> Checking compact_str v0.9.0
274.60 s
> Checking unicode-truncate v2.0.1
274.60 s
> Checking toml v0.8.23
274.60 s
> Checking kasuari v0.4.12
274.60 s
> Checking lru v0.16.4
274.60 s
> Checking vte v0.15.0
274.60 s
> Checking portable-atomic v1.13.1
274.60 s
> Checking unit-prefix v0.5.2
274.60 s
> Checking rand_distr v0.4.3
274.60 s
> Checking simba v0.6.0
274.60 s
> Checking vt100 v0.16.2
274.60 s
> Checking line-clipping v0.3.7
274.60 s
> Checking gimli v0.32.3
274.60 s
> Compiling three-dimensional-reps v0.1.0 (/build/source/crates/three-dimensional-reps)
274.60 s
> Checking ratatui-core v0.1.0
274.60 s
> Checking figment v0.10.19
274.60 s
> Checking adler2 v2.0.1
274.60 s
> Checking thiserror v1.0.69
274.60 s
> Checking miniz_oxide v0.8.9
274.60 s
> Checking derive_builder v0.11.2
274.60 s
> Checking owo-colors v4.3.0
274.60 s
> Checking crossterm v0.29.0
274.60 s
> Checking indicatif v0.18.4
274.60 s
> Checking object v0.37.3
274.60 s
> Checking tracing-error v0.2.1
274.60 s
> Compiling rustpython-parser-core v0.4.0
274.60 s
> Checking typed-index-collections v3.5.0
274.60 s
> Compiling rustpython-ast v0.4.0
274.60 s
> Checking serde-big-array v0.5.1
274.60 s
> Checking amd v0.2.2
274.60 s
> Checking itertools v0.11.0
274.60 s
> Compiling gammaloop-tracing-filter-macros v0.1.0 (/build/source/crates/gammaloop-tracing-filter-macros)
274.60 s
> Checking rustc-demangle v0.1.27
274.60 s
> Checking option-ext v0.2.0
274.60 s
> Checking rkyv v0.7.46
274.60 s
> Checking ratatui-widgets v0.3.0
274.60 s
> Checking dirs-sys v0.5.0
274.60 s
> Checking ref-cast v1.0.25
274.60 s
> Checking color-spantrace v0.3.0
274.60 s
> Checking nix v0.31.2
274.60 s
> Checking brotli-decompressor v4.0.3
274.60 s
> Checking integer-sqrt v0.1.5
274.60 s
> Checking crossbeam-channel v0.5.15
274.60 s
> Checking itertools v0.12.1
274.60 s
> Checking symlink v0.1.0
274.60 s
> Compiling gammalooprs v0.3.4 (/build/source/crates/gammalooprs)
274.60 s
> Checking ratatui-crossterm v0.1.0
274.60 s
> Checking unsafe-libyaml v0.2.11
274.60 s
> Checking tracing-appender v0.2.5
274.60 s
> Checking env_logger v0.11.10
274.60 s
> Checking include_dir v0.7.4
274.60 s
> Checking pathfinding v4.15.0
274.60 s
> Checking dirs v6.0.0
274.60 s
> Checking clarabel v0.11.1
274.60 s
> Checking schemars v1.2.1
274.60 s
> Checking slotmap v1.1.1
274.60 s
> Checking ctrlc v3.5.2
274.60 s
> Checking tracing-indicatif v0.3.14
274.60 s
> Checking brotli v7.0.0
274.60 s
> Checking serde_yaml v0.9.34+deprecated
274.60 s
> Checking ratatui-macros v0.7.0
274.60 s
> Checking json5 v0.4.1
274.60 s
> Checking ratatui v0.30.0
274.60 s
> Checking vectorize v0.2.0
274.60 s
> Checking ringbuffer v0.16.0
274.60 s
> Checking base62 v2.2.4
274.60 s
> Checking rust-embed v8.11.0
274.60 s
> Checking clap_complete v4.6.3
274.60 s
> Checking strip-ansi-escapes v0.2.1
274.60 s
> Checking fd-lock v4.0.4
274.60 s
> Compiling gammaloop-api v0.1.0 (/build/source/crates/gammaloop-api)
274.60 s
> Checking itertools v0.13.0
274.60 s
> Checking strum v0.26.3
274.60 s
> Checking sysinfo v0.33.1
274.60 s
> Checking shlex v1.3.0
274.60 s
> Checking addr2line v0.25.1
274.60 s
> Checking futures-task v0.3.32
274.60 s
> Checking futures-core v0.3.32
274.60 s
> Checking slab v0.4.12
274.60 s
> Checking clap_complete_nushell v4.6.0
274.60 s
> Checking sdd v3.0.10
274.60 s
> Checking futures-util v0.3.32
274.60 s
> Compiling gammaloop-integration-tests v0.1.0 (/build/source/tests)
274.60 s
> Compiling test-log-core v0.2.20
274.60 s
> Compiling rustc_version v0.4.1
274.60 s
> Checking which v8.0.2
274.60 s
> Checking scc v2.4.0
274.60 s
> Checking backtrace v0.3.76
274.60 s
> Checking bincode v1.3.3
274.60 s
> Compiling gungraun-runner v0.18.2
274.60 s
> Checking nalgebra v0.29.0
274.60 s
> Checking proc-macro2 v1.0.106
274.60 s
> Checking color-eyre v0.6.5
274.60 s
> Compiling gungraun-macros v0.8.0
274.60 s
> Checking reedline v0.42.0
274.60 s
> Checking base64 v0.21.7
274.60 s
> Checking quote v1.0.45
274.60 s
> Checking maplit v1.0.2
274.60 s
> Checking ron v0.8.1
274.60 s
> Compiling iai-callgrind-runner v0.14.2
274.60 s
> Checking kurbo v0.13.0
274.60 s
> Checking wait-timeout v0.2.1
274.60 s
> Compiling numerica v2.2.0 (https://github.com/alphal00p/symbolica?rev=a277a8dadbaae5a8d6605f2f381991a601e1f345#a277a8da)
274.60 s
> Checking futures-executor v0.3.32
274.60 s
> Compiling iai-callgrind v0.14.2
274.60 s
> Checking bit-vec v0.8.0
274.60 s
> Checking quick-error v1.2.3
274.60 s
> Checking bit-set v0.8.0
274.60 s
> Checking rusty-fork v0.3.1
274.60 s
> Checking syn v2.0.117
274.60 s
> Compiling iai-callgrind-macros v0.5.1
274.60 s
> Checking serial_test v3.4.0
274.60 s
> Checking rand_xorshift v0.4.0
274.60 s
> Checking console v0.15.11
274.60 s
> Checking pathdiff v0.2.3
274.60 s
> Checking unarray v0.1.4
274.60 s
> Checking similar-asserts v1.7.0
274.60 s
> Compiling test-log-macros v0.2.20
274.60 s
> Checking proptest v1.11.0
274.60 s
> Checking clinnet v0.1.8 (/build/source/crates/clinnet)
274.60 s
> Checking kurvst v0.1.0 (/build/source/crates/kurvst)
274.60 s
> Compiling graphica v2.1.0 (https://github.com/alphal00p/symbolica?rev=a277a8dadbaae5a8d6605f2f381991a601e1f345#a277a8da)
274.60 s
> Checking test-log v0.2.20
274.60 s
> Checking statrs v0.16.1
274.60 s
> Checking momtrop v0.3.0
274.60 s
> Checking gungraun v0.18.2
274.60 s
> Compiling pyo3-macros v0.28.3
274.60 s
> Compiling pyo3-stub-gen-derive v0.17.2
274.60 s
> Checking pyo3-stub-gen v0.17.2
274.60 s
> Checking symbolica-utils v0.1.0 (/build/source/crates/symbolica-utils)
274.60 s
> Checking spenso-macros v0.3.2 (/build/source/crates/spenso-macros)
274.60 s
> Compiling gammaloop-workspace-hack v0.1.0 (/build/source/crates/gammaloop-workspace-hack)
274.60 s
> Checking linnet v0.17.0 (/build/source/crates/linnet)
274.60 s
> Checking spenso v0.6.0 (/build/source/crates/spenso)
274.60 s
> Checking linnet-py v0.1.0 (/build/source/crates/linnet-py)
274.60 s
> Checking linnest v0.1.0 (/build/source/crates/linnest)
274.60 s
> Checking idenso v0.3.0 (/build/source/crates/idenso)
274.60 s
> Checking gammaloop-tracing-filter v0.1.0 (/build/source/crates/gammaloop-tracing-filter)
274.60 s
> Checking spenso-hep-lib v0.1.7 (/build/source/crates/spenso-hep-lib)
274.60 s
> Checking spynso3 v0.1.2 (/build/source/crates/spynso3)
274.60 s
> warning : method `reinterpret_loop_momenta_and_compute_prefactor` is never used
274.60 s
> --> crates/gammalooprs/src/integrands/process/mod.rs:2707:19
274.60 s
> |
274.60 s
> 2144 | impl LmbMultiChannelingSetup {
274.60 s
> | ---------------------------- method in this implementation
274.60 s
> ...
274.60 s
> 2707 | pub(crate) fn reinterpret_loop_momenta_and_compute_prefactor<T: FloatLike>(
274.60 s
> | ^^^^^^^^^^^^^^^^^^^^^^^^^^^^^^^^^^^^^^^^^^^^^^
274.60 s
> |
274.60 s
> = note : `#[warn(dead_code)]` (part of `#[warn(unused)]`) on by default
274.60 s
>
274.60 s
> warning : `gammalooprs` (lib) generated 1 warning
274.60 s
> warning : unused import: `GaussianReferenceFunction`
274.60 s
> --> crates/gammaloop-api/src/state.rs:38:27
274.60 s
> |
274.60 s
> 38 | integrands::process::{GaussianReferenceFunction, ProcessIntegrand},
274.60 s
> | ^^^^^^^^^^^^^^^^^^^^^^^^^
274.60 s
> |
274.60 s
> = note : `#[warn(unused_imports)]` (part of `#[warn(unused)]`) on by default
274.60 s
>
274.60 s
> warning : `gammaloop-api` (lib) generated 1 warning (run `cargo fix --lib -p gammaloop-api` to apply 1 suggestion)
274.60 s
> warning : `gammalooprs` (lib test) generated 1 warning (1 duplicate)
274.60 s
> error[E0560] : struct `CutInfo` has no field named `lmb_channel_id`
274.60 s
> --> tests/tests/test_differential.rs:86:13
274.60 s
> |
274.60 s
> 86 | lmb_channel_id: None,
274.60 s
> | ^^^^^^^^^^^^^^ `CutInfo` does not have this field
274.60 s
> |
274.60 s
> = note : available fields are: `sampling_channel_id`, `sampling_channel_edge_ids`
274.60 s
>
274.60 s
> error[E0560] : struct `CutInfo` has no field named `lmb_channel_edge_ids`
274.60 s
> --> tests/tests/test_differential.rs:87:13
274.60 s
> |
274.60 s
> 87 | lmb_channel_edge_ids: None,
274.60 s
> | ^^^^^^^^^^^^^^^^^^^^ `CutInfo` does not have this field
274.60 s
> |
274.60 s
> = note : available fields are: `sampling_channel_id`, `sampling_channel_edge_ids`
274.60 s
>
274.60 s
> For more information about this error, try `rustc --explain E0560`.
274.60 s
> error : could not compile `gammaloop-integration-tests` (test "test_differential") due to 2 previous errors
274.60 s
> warning : build failed, waiting for other jobs to finish...
274.60 s
> error[E0609] : no field `lmb_channel_edge_ids` on type `CutInfo`
274.60 s
> --> tests/tests/test_evaluation_api.rs:311:10
274.60 s
> |
274.60 s
> 311 | .lmb_channel_edge_ids
274.60 s
> | ^^^^^^^^^^^^^^^^^^^^ unknown field
274.60 s
> |
274.60 s
> = note : available fields are: `particle_pdgs`, `cut_id`, `graph_id`, `graph_group_id`, `orientation_id` ... and 2 others
274.60 s
>
274.60 s
> error[E0609] : no field `lmb_channel_edge_ids` on type `CutInfo`
274.60 s
> --> tests/tests/test_evaluation_api.rs:591:26
274.60 s
> |
274.60 s
> 591 | .lmb_channel_edge_ids
274.60 s
> | ^^^^^^^^^^^^^^^^^^^^ unknown field
274.60 s
> |
274.60 s
> = note : available fields are: `particle_pdgs`, `cut_id`, `graph_id`, `graph_group_id`, `orientation_id` ... and 2 others
274.60 s
>
274.60 s
> error[E0609] : no field `lmb_channel_edge_ids` on type `CutInfo`
274.60 s
> --> tests/tests/test_evaluation_api.rs:1177:18
274.60 s
> |
274.60 s
> 1177 | .lmb_channel_edge_ids
274.60 s
> | ^^^^^^^^^^^^^^^^^^^^ unknown field
274.60 s
> |
274.60 s
> = note : available fields are: `particle_pdgs`, `cut_id`, `graph_id`, `graph_group_id`, `orientation_id` ... and 2 others
274.60 s
>
274.60 s
> error[E0609] : no field `lmb_channel_edge_ids` on type `CutInfo`
274.60 s
> --> tests/tests/test_evaluation_api.rs:1222:22
274.60 s
> |
274.60 s
> 1222 | .lmb_channel_edge_ids
274.60 s
> | ^^^^^^^^^^^^^^^^^^^^ unknown field
274.60 s
> |
274.60 s
> = note : available fields are: `particle_pdgs`, `cut_id`, `graph_id`, `graph_group_id`, `orientation_id` ... and 2 others
274.60 s
>
274.60 s
> error[E0609] : no field `lmb_channel_edge_ids` on type `CutInfo`
274.60 s
> --> tests/tests/test_evaluation_api.rs:1281:14
274.60 s
> |
274.60 s
> 1281 | .lmb_channel_edge_ids
274.60 s
> | ^^^^^^^^^^^^^^^^^^^^ unknown field
274.60 s
> |
274.60 s
> = note : available fields are: `particle_pdgs`, `cut_id`, `graph_id`, `graph_group_id`, `orientation_id` ... and 2 others
274.60 s
>
274.60 s
> error[E0609] : no field `lmb_channel_edge_ids` on type `CutInfo`
274.60 s
> --> tests/tests/test_evaluation_api.rs:1428:18
274.60 s
> |
274.60 s
> 1428 | .lmb_channel_edge_ids
274.60 s
> | ^^^^^^^^^^^^^^^^^^^^ unknown field
274.60 s
> |
274.60 s
> = note : available fields are: `particle_pdgs`, `cut_id`, `graph_id`, `graph_group_id`, `orientation_id` ... and 2 others
274.60 s
>
274.60 s
> For more information about this error, try `rustc --explain E0609`.
274.60 s
> error : could not compile `gammaloop-integration-tests` (test "test_evaluation_api") due to 6 previous errors
274.60 s
> error[E0609] : no field `lmb_channel_id` on type `CutInfo`
274.60 s
> --> tests/tests/test_runs/utils.rs:568:36
274.60 s
> |
274.60 s
> 568 | event.cut_info.lmb_channel_id,
274.60 s
> | ^^^^^^^^^^^^^^ unknown field
274.60 s
> |
274.60 s
> = note : available fields are: `particle_pdgs`, `cut_id`, `graph_id`, `graph_group_id`, `orientation_id` ... and 2 others
274.60 s
>
274.60 s
> error[E0609] : no field `lmb_channel_id` on type `CutInfo`
274.60 s
> --> tests/tests/test_runs/utils.rs:580:36
274.60 s
> |
274.60 s
> 580 | event.cut_info.lmb_channel_id,
274.60 s
> | ^^^^^^^^^^^^^^ unknown field
274.60 s
> |
274.60 s
> = note : available fields are: `particle_pdgs`, `cut_id`, `graph_id`, `graph_group_id`, `orientation_id` ... and 2 others
274.60 s
>
274.60 s
> error : could not compile `gammaloop-integration-tests` (test "test_runs") due to 2 previous errors
274.60 s
For full logs, run:
274.60 s
nix log /nix/store/dwdr0078rsb6aq3cbband7h8345g8q87-gammaloop-workspace-check-0.1.0.drv
274.71 s
Build failed.