0.00 s
$ /nix/store/9ypz3flqsrl5xl495mm8h645gadjsxi1-coreutils-9.11/bin/timeout --kill-after=15s 7200s /nix/store/23zk8sgzamrbmj1fday15szf7f2279s8-nix-2.34.7/bin/nix --extra-experimental-features nix-command --extra-experimental-features flakes --log-format internal-json build --no-link --print-out-paths git+https://github.com/alphal00p/gammaloop?ref=advanced_sampling&rev=e9031dcd251401a6700423d61fd2a0a090245bcf&shallow=1#checks.x86_64-linux.gammaloop-check --print-build-logs
0.33 s
error (ignored): SQLite database '/var/cache/nix-ci-worker/eval-cache-v6/b20626d1bc1175f729e8a70cc2eb83402c8ea1609789f5e1588870fa9fba19ec.sqlite ' is busy
2.33 s
2.74 s
Building /nix/store/678qn1yyh3j4046ys9sarqm9q60571r7-gammaloop-workspace-check-0.1.0.drv
2.81 s
[gammaloop-workspace-check] Phase: unpackPhase
2.81 s
[gammaloop-workspace-check] unpacking source archive /nix/store/3jj3smp74rs9m6ykxsf11s7cz9qgyqb0-source
2.96 s
[gammaloop-workspace-check] source root is source
2.99 s
[gammaloop-workspace-check] Phase: patchPhase
2.99 s
[gammaloop-workspace-check] Executing configureCargoCommonVars
2.99 s
[gammaloop-workspace-check] decompressing cargo artifacts from /nix/store/50vpxlcgfxf2d57i27v3d10zjwxxbm2r-gammaloop-workspace-deps-deps-0.1.0/target.tar.zst to target
4.23 s
[gammaloop-workspace-check] Phase: updateAutotoolsGnuConfigScriptsPhase
4.27 s
[gammaloop-workspace-check] Phase: configurePhase
4.28 s
[gammaloop-workspace-check] will append /build/source/.cargo-home/config.toml with contents of /nix/store/5drf77x6km4ky7gwlrzdx9bbd6fz09g3-vendor-cargo-deps/config.toml
4.28 s
[gammaloop-workspace-check] default configurePhase, nothing to do
4.28 s
[gammaloop-workspace-check] Phase: buildPhase
4.29 s
[gammaloop-workspace-check] +++ command cargo --version
4.29 s
[gammaloop-workspace-check] cargo 1.97.0 (c980f4866 2026-06-30)
4.32 s
[gammaloop-workspace-check] +++ command cargo check --profile ci-optim --locked --workspace --features gammaloop-tracing-filter/clap,gammaloop-tracing-filter/symbolica,idenso/bincode,idenso/reference-cases,linnet/bincode,linnet/drawing,linnet/rkyv,linnet/serde,linnet/symbolica,spenso-macros/shadowing,spenso/shadowing,symbolica/tracing_max_level_info,three-dimensional-reps/display,three-dimensional-reps/eval,three-dimensional-reps/serde --all-targets
5.04 s
[gammaloop-workspace-check] Checking cfg-if v1.0.4
5.04 s
[gammaloop-workspace-check] Checking memchr v2.8.0
5.04 s
[gammaloop-workspace-check] Checking once_cell v1.21.4
5.05 s
[gammaloop-workspace-check] Checking either v1.15.0
5.06 s
[gammaloop-workspace-check] Checking serde_core v1.0.228
5.07 s
[gammaloop-workspace-check] Checking libc v0.2.186
5.07 s
[gammaloop-workspace-check] Checking libm v0.2.16
5.07 s
[gammaloop-workspace-check] Checking itoa v1.0.18
5.09 s
[gammaloop-workspace-check] Checking log v0.4.29
5.09 s
[gammaloop-workspace-check] Checking regex-syntax v0.8.10
5.10 s
[gammaloop-workspace-check] Checking zerocopy v0.8.48
5.10 s
[gammaloop-workspace-check] Checking crossbeam-utils v0.8.21
5.11 s
[gammaloop-workspace-check] Checking equivalent v1.0.2
5.11 s
[gammaloop-workspace-check] Checking zmij v1.0.21
5.13 s
[gammaloop-workspace-check] Checking lazy_static v1.5.0
5.13 s
[gammaloop-workspace-check] Checking bytemuck v1.25.0
5.14 s
[gammaloop-workspace-check] Compiling target-lexicon v0.13.5
5.18 s
[gammaloop-workspace-check] Checking arrayvec v0.7.6
5.30 s
[gammaloop-workspace-check] Checking powerfmt v0.2.0
5.30 s
[gammaloop-workspace-check] Checking num_threads v0.1.7
5.35 s
[gammaloop-workspace-check] Checking itertools v0.14.0
5.36 s
[gammaloop-workspace-check] Checking num-conv v0.2.1
5.36 s
[gammaloop-workspace-check] Checking pin-project-lite v0.2.17
5.38 s
[gammaloop-workspace-check] Checking time-core v0.1.8
5.40 s
[gammaloop-workspace-check] Checking safe_arch v0.7.4
5.45 s
[gammaloop-workspace-check] Checking allocator-api2 v0.2.21
5.46 s
[gammaloop-workspace-check] Checking foldhash v0.2.0
5.52 s
[gammaloop-workspace-check] Checking deranged v0.5.8
5.56 s
[gammaloop-workspace-check] Checking const-random v0.1.18
5.58 s
[gammaloop-workspace-check] Checking nu-ansi-term v0.50.3
5.61 s
[gammaloop-workspace-check] Checking unty v0.0.4
5.61 s
[gammaloop-workspace-check] Checking aho-corasick v1.1.4
5.67 s
[gammaloop-workspace-check] Checking static_assertions v1.1.0
5.68 s
[gammaloop-workspace-check] Checking wide v0.7.33
5.73 s
[gammaloop-workspace-check] Checking winnow v1.0.2
5.82 s
[gammaloop-workspace-check] Checking safe_arch v1.0.0
5.86 s
[gammaloop-workspace-check] Checking hashbrown v0.16.1
5.92 s
[gammaloop-workspace-check] Checking tracing-core v0.1.36
5.94 s
[gammaloop-workspace-check] Checking sharded-slab v0.1.7
6.55 s
[gammaloop-workspace-check] Checking thread_local v1.1.9
6.64 s
[gammaloop-workspace-check] Checking crossbeam-epoch v0.9.18
6.68 s
[gammaloop-workspace-check] Checking getrandom v0.3.4
6.76 s
[gammaloop-workspace-check] Checking tracing-log v0.2.0
6.84 s
[gammaloop-workspace-check] Checking crossbeam-deque v0.8.6
6.95 s
[gammaloop-workspace-check] Checking rayon-core v1.13.0
6.99 s
[gammaloop-workspace-check] Checking tracing v0.1.44
7.04 s
[gammaloop-workspace-check] Checking rand_core v0.9.5
7.05 s
[gammaloop-workspace-check] Checking gmp-mpfr-sys v1.7.1
7.05 s
[gammaloop-workspace-check] Checking toml_writer v1.1.1+spec-1.1.0
7.15 s
[gammaloop-workspace-check] Checking az v1.3.0
7.17 s
[gammaloop-workspace-check] Checking indenter v0.3.4
7.22 s
[gammaloop-workspace-check] Checking wide v1.3.0
7.29 s
[gammaloop-workspace-check] Compiling phf_shared v0.11.3
7.32 s
[gammaloop-workspace-check] Checking anyhow v1.0.102
7.32 s
[gammaloop-workspace-check] Checking rawpointer v0.2.1
7.33 s
[gammaloop-workspace-check] Checking rayon v1.12.0
7.38 s
[gammaloop-workspace-check] Checking dyn-clone v1.0.20
7.41 s
[gammaloop-workspace-check] Checking utf8parse v0.2.2
7.52 s
[gammaloop-workspace-check] Checking alloc-no-stdlib v2.0.4
7.54 s
[gammaloop-workspace-check] Checking anstyle-parse v1.0.0
7.64 s
[gammaloop-workspace-check] Checking alloc-stdlib v0.2.2
7.68 s
[gammaloop-workspace-check] Checking matrixmultiply v0.3.10
7.71 s
[gammaloop-workspace-check] Checking anstyle-query v1.1.5
7.75 s
[gammaloop-workspace-check] Checking time v0.3.47
7.77 s
[gammaloop-workspace-check] Checking anstyle v1.0.14
7.79 s
[gammaloop-workspace-check] Checking toml_parser v1.1.2+spec-1.1.0
7.81 s
[gammaloop-workspace-check] Checking colorchoice v1.0.5
7.90 s
[gammaloop-workspace-check] Checking num-traits v0.2.19
7.91 s
[gammaloop-workspace-check] Checking colored v3.1.1
7.93 s
[gammaloop-workspace-check] Checking is_terminal_polyfill v1.70.2
7.96 s
[gammaloop-workspace-check] Compiling phf_generator v0.11.3
7.97 s
[gammaloop-workspace-check] Checking eyre v0.6.12
8.01 s
[gammaloop-workspace-check] Checking anstream v1.0.0
8.10 s
[gammaloop-workspace-check] Checking unicode-width v0.2.2
8.19 s
[gammaloop-workspace-check] Compiling pyo3-build-config v0.28.3
8.29 s
[gammaloop-workspace-check] Checking bitflags v1.3.2
8.33 s
[gammaloop-workspace-check] Compiling phf_codegen v0.11.3
8.60 s
[gammaloop-workspace-check] Checking region v3.0.2
8.65 s
[gammaloop-workspace-check] Checking wasmtime-jit-icache-coherence v34.0.2
8.69 s
[gammaloop-workspace-check] Checking brotli-decompressor v5.0.0
8.72 s
[gammaloop-workspace-check] Checking hugepage-rs v0.1.1
8.74 s
[gammaloop-workspace-check] Checking inventory v0.3.24
8.82 s
[gammaloop-workspace-check] Checking spec_math v0.1.6
8.87 s
[gammaloop-workspace-check] Checking thiserror v2.0.18
8.88 s
[gammaloop-workspace-check] Compiling getopts v0.2.24
8.93 s
[gammaloop-workspace-check] Checking libloading v0.9.0
8.94 s
[gammaloop-workspace-check] Checking tinyjson v2.5.1
9.31 s
[gammaloop-workspace-check] Checking self_cell v1.2.2
9.39 s
[gammaloop-workspace-check] Checking approx v0.5.1
9.41 s
[gammaloop-workspace-check] Checking num-integer v0.1.46
9.41 s
[gammaloop-workspace-check] Checking byteorder v1.5.0
9.42 s
[gammaloop-workspace-check] Checking append-only-vec v0.1.8
9.48 s
[gammaloop-workspace-check] Checking bytes v1.11.1
9.56 s
[gammaloop-workspace-check] Compiling unicode_names2_generator v1.3.0
9.56 s
[gammaloop-workspace-check] Compiling unic-char-range v0.9.0
9.57 s
[gammaloop-workspace-check] Checking linux-raw-sys v0.12.1
9.70 s
[gammaloop-workspace-check] Compiling unic-common v0.9.0
9.78 s
[gammaloop-workspace-check] Compiling unic-ucd-version v0.9.0
9.81 s
[gammaloop-workspace-check] Compiling unic-char-property v0.9.0
9.86 s
[gammaloop-workspace-check] Compiling is-macro v0.3.7
9.90 s
[gammaloop-workspace-check] Compiling rustpython-parser-vendored v0.4.0
10.02 s
[gammaloop-workspace-check] Checking iana-time-zone v0.1.65
10.10 s
[gammaloop-workspace-check] Checking serde v1.0.228
10.15 s
[gammaloop-workspace-check] Checking serde_json v1.0.149
10.23 s
[gammaloop-workspace-check] Checking bitflags v2.11.1
10.36 s
[gammaloop-workspace-check] Checking serde_spanned v1.1.1
10.46 s
[gammaloop-workspace-check] Checking toml_datetime v1.1.1+spec-1.1.0
10.49 s
[gammaloop-workspace-check] Checking rustix v1.1.4
10.60 s
[gammaloop-workspace-check] Compiling rustpython-parser v0.4.0
10.73 s
[gammaloop-workspace-check] Compiling phf v0.11.3
10.81 s
[gammaloop-workspace-check] Checking regex-automata v0.4.14
10.84 s
[gammaloop-workspace-check] Checking rustc-hash v2.1.2
10.90 s
[gammaloop-workspace-check] Compiling unic-ucd-ident v0.9.0
10.92 s
[gammaloop-workspace-check] Compiling unic-emoji-char v0.9.0
10.99 s
[gammaloop-workspace-check] Checking toml v1.1.2+spec-1.1.0
11.05 s
[gammaloop-workspace-check] Checking brotli v8.0.2
11.13 s
[gammaloop-workspace-check] Compiling rustc-hash v1.1.0
11.28 s
[gammaloop-workspace-check] Compiling lalrpop-util v0.20.2
11.40 s
[gammaloop-workspace-check] Checking unicode-segmentation v1.13.2
11.57 s
[gammaloop-workspace-check] Compiling symbolica v2.2.0 (https://github.com/alphal00p/symbolica?rev=a277a8dadbaae5a8d6605f2f381991a601e1f345#a277a8da)
11.86 s
[gammaloop-workspace-check] Checking smallvec v1.15.1
12.25 s
[gammaloop-workspace-check] Checking num-complex v0.4.6
12.37 s
[gammaloop-workspace-check] Checking tracing-serde v0.2.0
12.45 s
[gammaloop-workspace-check] Checking bincode v2.0.1
12.47 s
[gammaloop-workspace-check] Checking smartstring v1.0.1
12.54 s
[gammaloop-workspace-check] Checking chrono v0.4.44
12.58 s
[gammaloop-workspace-check] Checking rug v1.30.0
12.68 s
[gammaloop-workspace-check] Checking typenum v1.20.0
12.83 s
[gammaloop-workspace-check] Checking getrandom v0.2.17
12.86 s
[gammaloop-workspace-check] Checking simba v0.9.1
12.97 s
[gammaloop-workspace-check] Checking ndarray v0.17.2
13.55 s
[gammaloop-workspace-check] Checking scopeguard v1.2.0
13.57 s
[gammaloop-workspace-check] Checking parking_lot_core v0.9.12
13.59 s
[gammaloop-workspace-check] Checking hashbrown v0.17.0
13.64 s
[gammaloop-workspace-check] Checking lock_api v0.4.14
13.96 s
[gammaloop-workspace-check] Checking unicode-ident v1.0.24
14.07 s
[gammaloop-workspace-check] Checking terminal_size v0.4.4
14.08 s
[gammaloop-workspace-check] Checking ppv-lite86 v0.2.21
14.09 s
[gammaloop-workspace-check] Checking ahash v0.8.12
14.15 s
[gammaloop-workspace-check] Checking errno v0.3.14
14.17 s
[gammaloop-workspace-check] Checking strsim v0.11.1
14.20 s
[gammaloop-workspace-check] Checking parking_lot v0.12.5
14.28 s
[gammaloop-workspace-check] Checking generic-array v0.14.7
14.29 s
[gammaloop-workspace-check] Checking unicase v2.9.0
14.32 s
[gammaloop-workspace-check] Checking clap_lex v1.1.0
14.36 s
[gammaloop-workspace-check] Checking signal-hook-registry v1.4.8
14.39 s
[gammaloop-workspace-check] Checking vte v0.14.1
14.42 s
[gammaloop-workspace-check] Checking same-file v1.0.6
14.50 s
[gammaloop-workspace-check] Checking walkdir v2.5.0
14.58 s
[gammaloop-workspace-check] Checking signal-hook v0.3.18
14.61 s
[gammaloop-workspace-check] Checking clap_builder v4.6.0
14.65 s
[gammaloop-workspace-check] Checking half v2.7.1
14.71 s
[gammaloop-workspace-check] Checking indexmap v2.14.0
14.73 s
[gammaloop-workspace-check] Checking mio v1.2.0
14.92 s
[gammaloop-workspace-check] Checking rand_chacha v0.9.0
14.95 s
[gammaloop-workspace-check] Checking ciborium-io v0.2.2
15.02 s
[gammaloop-workspace-check] Checking minimal-lexical v0.2.1
15.08 s
[gammaloop-workspace-check] Checking ciborium-ll v0.2.2
15.14 s
[gammaloop-workspace-check] Checking block-buffer v0.10.4
15.16 s
[gammaloop-workspace-check] Checking rand v0.9.4
15.22 s
[gammaloop-workspace-check] Checking crypto-common v0.1.7
15.30 s
[gammaloop-workspace-check] Checking signal-hook-mio v0.2.5
15.31 s
[gammaloop-workspace-check] Checking derive_more v2.1.1
15.38 s
[gammaloop-workspace-check] Checking digest v0.10.7
15.39 s
[gammaloop-workspace-check] Checking num-bigint v0.4.6
15.43 s
[gammaloop-workspace-check] Checking console v0.16.3
15.55 s
[gammaloop-workspace-check] Checking nom v7.1.3
15.65 s
[gammaloop-workspace-check] Checking bstr v1.12.1
15.81 s
[gammaloop-workspace-check] Checking winnow v0.7.15
16.00 s
[gammaloop-workspace-check] Checking cpufeatures v0.2.17
16.07 s
[gammaloop-workspace-check] Checking linux-raw-sys v0.4.15
16.13 s
[gammaloop-workspace-check] Checking sha2 v0.10.9
16.36 s
[gammaloop-workspace-check] Checking symjit v2.21.0
16.47 s
[gammaloop-workspace-check] Checking ciborium v0.2.2
16.90 s
[gammaloop-workspace-check] Checking rustix v0.38.44
17.04 s
[gammaloop-workspace-check] Checking rand_core v0.6.4
17.12 s
[gammaloop-workspace-check] Compiling unicode_names2 v1.3.0
17.18 s
[gammaloop-workspace-check] Checking getrandom v0.4.2
17.30 s
[gammaloop-workspace-check] Checking fnv v1.0.7
17.40 s
[gammaloop-workspace-check] Checking plotters-backend v0.3.7
17.51 s
[gammaloop-workspace-check] Checking fastrand v2.4.1
17.64 s
[gammaloop-workspace-check] Checking crossterm v0.28.1
18.79 s
[gammaloop-workspace-check] Checking tempfile v3.27.0
18.81 s
[gammaloop-workspace-check] Checking ansitok v0.3.0
18.86 s
[gammaloop-workspace-check] Checking plotters-svg v0.3.7
18.94 s
[gammaloop-workspace-check] Checking serde_spanned v0.6.9
19.09 s
[gammaloop-workspace-check] Checking toml_datetime v0.6.11
19.11 s
[gammaloop-workspace-check] Checking itertools v0.10.5
19.32 s
[gammaloop-workspace-check] Checking tap v1.0.1
19.40 s
[gammaloop-workspace-check] Checking toml_write v0.1.2
19.44 s
[gammaloop-workspace-check] Checking cast v0.3.0
19.49 s
[gammaloop-workspace-check] Checking wyz v0.5.1
19.54 s
[gammaloop-workspace-check] Checking ansi-str v0.9.0
19.57 s
[gammaloop-workspace-check] Checking toml_edit v0.22.27
19.71 s
[gammaloop-workspace-check] Checking clap v4.6.1
19.80 s
[gammaloop-workspace-check] Checking plotters v0.3.7
19.81 s
[gammaloop-workspace-check] Checking rand_chacha v0.3.1
20.10 s
[gammaloop-workspace-check] Checking radium v0.7.0
20.13 s
[gammaloop-workspace-check] Checking typeid v1.0.3
20.16 s
[gammaloop-workspace-check] Checking matchers v0.2.0
20.21 s
[gammaloop-workspace-check] Checking regex v1.12.3
20.35 s
[gammaloop-workspace-check] Checking tracing-subscriber v0.3.23
20.61 s
[gammaloop-workspace-check] Checking globset v0.4.18
20.85 s
[gammaloop-workspace-check] Checking similar v2.7.0
20.87 s
[gammaloop-workspace-check] Checking tinytemplate v1.2.1
21.22 s
[gammaloop-workspace-check] Compiling pyo3-ffi v0.28.3
21.28 s
[gammaloop-workspace-check] Compiling pyo3-macros-backend v0.28.3
21.57 s
[gammaloop-workspace-check] Compiling pyo3 v0.28.3
21.75 s
[gammaloop-workspace-check] Compiling numpy v0.28.0
21.78 s
[gammaloop-workspace-check] Checking rust-embed-utils v8.11.0
21.78 s
[gammaloop-workspace-check] Checking xprec v0.2.2
21.90 s
[gammaloop-workspace-check] Checking is-terminal v0.4.17
22.00 s
[gammaloop-workspace-check] Checking funty v2.0.0
22.11 s
[gammaloop-workspace-check] Checking bytecount v0.6.9
22.13 s
[gammaloop-workspace-check] Checking anes v0.1.6
22.20 s
[gammaloop-workspace-check] Checking oorandom v11.1.5
22.22 s
[gammaloop-workspace-check] Checking papergrid v0.17.0
22.31 s
[gammaloop-workspace-check] Checking env_filter v1.0.1
22.39 s
[gammaloop-workspace-check] Checking ron v0.12.1
22.48 s
[gammaloop-workspace-check] Checking rand v0.8.6
22.48 s
[gammaloop-workspace-check] Checking testing_table v0.3.0
22.52 s
[gammaloop-workspace-check] Checking toml_edit v0.25.11+spec-1.1.0
22.55 s
[gammaloop-workspace-check] Checking uncased v0.9.10
22.57 s
[gammaloop-workspace-check] Checking bitvec v1.0.1
22.64 s
[gammaloop-workspace-check] Checking jiff v0.2.24
22.64 s
[gammaloop-workspace-check] Checking ptr_meta v0.1.4
22.73 s
[gammaloop-workspace-check] Checking simdutf8 v0.1.5
22.74 s
[gammaloop-workspace-check] Checking ucd-trie v0.1.7
22.79 s
[gammaloop-workspace-check] Checking ahash v0.7.8
23.01 s
[gammaloop-workspace-check] Checking pest v2.8.6
23.06 s
[gammaloop-workspace-check] Checking bytecheck v0.6.12
23.15 s
[gammaloop-workspace-check] Checking hashbrown v0.12.3
23.44 s
[gammaloop-workspace-check] Checking criterion-plot v0.5.0
23.61 s
[gammaloop-workspace-check] Checking approx v0.4.0
23.70 s
[gammaloop-workspace-check] Checking toml v0.8.23
23.74 s
[gammaloop-workspace-check] Checking seahash v4.1.0
23.83 s
[gammaloop-workspace-check] Checking cgmath v0.18.0
23.89 s
[gammaloop-workspace-check] Checking num-rational v0.4.2
24.11 s
[gammaloop-workspace-check] Checking num-iter v0.1.45
24.13 s
[gammaloop-workspace-check] Checking rend v0.4.2
24.21 s
[gammaloop-workspace-check] Checking criterion v0.5.1
24.24 s
[gammaloop-workspace-check] Checking ref-ops v0.2.5
24.25 s
[gammaloop-workspace-check] Checking rand_xoshiro v0.6.0
24.34 s
[gammaloop-workspace-check] Checking num v0.4.3
24.41 s
[gammaloop-workspace-check] Checking features v0.10.0
24.44 s
[gammaloop-workspace-check] Checking gat-lending-iterator v0.1.8
24.47 s
[gammaloop-workspace-check] Checking constcat v0.5.1
24.51 s
[gammaloop-workspace-check] Checking colored v2.2.0
24.57 s
[gammaloop-workspace-check] Checking tabled v0.20.0
24.64 s
[gammaloop-workspace-check] Checking insta v1.47.2
24.65 s
[gammaloop-workspace-check] Checking figment v0.10.19
24.68 s
[gammaloop-workspace-check] Compiling rustpython-parser-core v0.4.0
24.82 s
[gammaloop-workspace-check] Checking constant_time_eq v0.4.2
24.84 s
[gammaloop-workspace-check] Checking arrayref v0.3.9
24.91 s
[gammaloop-workspace-check] Checking cpufeatures v0.3.0
24.95 s
[gammaloop-workspace-check] Checking base64 v0.22.1
24.99 s
[gammaloop-workspace-check] Compiling rustpython-ast v0.4.0
25.06 s
[gammaloop-workspace-check] Checking blake3 v1.8.5
25.16 s
[gammaloop-workspace-check] Checking joinery v2.1.0
25.25 s
[gammaloop-workspace-check] Checking siphasher v1.0.2
25.39 s
[gammaloop-workspace-check] Checking titlecase v2.2.1
25.41 s
[gammaloop-workspace-check] Checking dot-parser v0.5.1
25.58 s
[gammaloop-workspace-check] Checking rust_lisp v0.18.0
25.65 s
[gammaloop-workspace-check] Checking phf_shared v0.13.1
25.99 s
[gammaloop-workspace-check] Checking subprocess v0.2.15
26.05 s
[gammaloop-workspace-check] Compiling vakint v0.1.2 (/build/source/crates/vakint)
26.07 s
[gammaloop-workspace-check] Checking phf v0.13.1
26.24 s
[gammaloop-workspace-check] Checking version-compare v0.2.1
26.40 s
[gammaloop-workspace-check] Checking xpct v0.5.1
26.47 s
[gammaloop-workspace-check] Checking ryu v1.0.23
26.50 s
[gammaloop-workspace-check] Checking castaway v0.2.4
26.52 s
[gammaloop-workspace-check] Checking string-template-plus v0.4.3
26.56 s
[gammaloop-workspace-check] Checking toml_datetime v0.7.5+spec-1.1.0
26.62 s
[gammaloop-workspace-check] Checking strum v0.27.2
26.66 s
[gammaloop-workspace-check] Checking compact_str v0.9.0
26.75 s
[gammaloop-workspace-check] Checking unicode-truncate v2.0.1
26.76 s
[gammaloop-workspace-check] Checking kasuari v0.4.12
26.94 s
[gammaloop-workspace-check] Checking lru v0.16.4
27.02 s
[gammaloop-workspace-check] Checking vte v0.15.0
27.14 s
[gammaloop-workspace-check] Checking toml v0.9.12+spec-1.1.0
27.19 s
[gammaloop-workspace-check] Checking portable-atomic v1.13.1
27.25 s
[gammaloop-workspace-check] Checking unit-prefix v0.5.2
27.30 s
[gammaloop-workspace-check] Checking vt100 v0.16.2
27.52 s
[gammaloop-workspace-check] Checking rand_distr v0.4.3
27.56 s
[gammaloop-workspace-check] Checking simba v0.6.0
27.61 s
[gammaloop-workspace-check] Checking ratatui-core v0.1.0
27.74 s
[gammaloop-workspace-check] Checking line-clipping v0.3.7
27.74 s
[gammaloop-workspace-check] Checking gimli v0.32.3
27.79 s
[gammaloop-workspace-check] Compiling three-dimensional-reps v0.1.0 (/build/source/crates/three-dimensional-reps)
27.84 s
[gammaloop-workspace-check] Checking adler2 v2.0.1
27.96 s
[gammaloop-workspace-check] Checking miniz_oxide v0.8.9
28.12 s
[gammaloop-workspace-check] Checking thiserror v1.0.69
28.14 s
[gammaloop-workspace-check] Checking derive_builder v0.11.2
28.14 s
[gammaloop-workspace-check] Checking crossterm v0.29.0
28.19 s
[gammaloop-workspace-check] Checking indicatif v0.18.4
28.21 s
[gammaloop-workspace-check] Checking owo-colors v4.3.0
28.23 s
[gammaloop-workspace-check] Checking object v0.37.3
28.26 s
[gammaloop-workspace-check] Checking tracing-error v0.2.1
28.52 s
[gammaloop-workspace-check] Checking typed-index-collections v3.5.0
28.84 s
[gammaloop-workspace-check] Checking serde-big-array v0.5.1
28.99 s
[gammaloop-workspace-check] Checking amd v0.2.2
29.08 s
[gammaloop-workspace-check] Checking rkyv v0.7.46
29.13 s
[gammaloop-workspace-check] Checking itertools v0.11.0
29.32 s
[gammaloop-workspace-check] Compiling gammaloop-tracing-filter-macros v0.1.0 (/build/source/crates/gammaloop-tracing-filter-macros)
29.33 s
[gammaloop-workspace-check] Checking option-ext v0.2.0
29.40 s
[gammaloop-workspace-check] Checking rustc-demangle v0.1.27
29.55 s
[gammaloop-workspace-check] Checking color-spantrace v0.3.0
29.55 s
[gammaloop-workspace-check] Checking dirs-sys v0.5.0
29.57 s
[gammaloop-workspace-check] Checking ref-cast v1.0.25
29.63 s
[gammaloop-workspace-check] Checking nix v0.31.2
29.63 s
[gammaloop-workspace-check] Checking integer-sqrt v0.1.5
29.66 s
[gammaloop-workspace-check] Checking brotli-decompressor v4.0.3
29.69 s
[gammaloop-workspace-check] Checking crossbeam-channel v0.5.15
29.80 s
[gammaloop-workspace-check] Compiling numerica v2.2.0 (https://github.com/alphal00p/symbolica?rev=a277a8dadbaae5a8d6605f2f381991a601e1f345#a277a8da)
29.86 s
[gammaloop-workspace-check] Checking env_logger v0.11.10
29.97 s
[gammaloop-workspace-check] Checking itertools v0.12.1
30.06 s
[gammaloop-workspace-check] Compiling gammalooprs v0.3.4 (/build/source/crates/gammalooprs)
30.49 s
[gammaloop-workspace-check] Checking symlink v0.1.0
30.57 s
[gammaloop-workspace-check] Checking unsafe-libyaml v0.2.11
30.61 s
[gammaloop-workspace-check] Checking tracing-appender v0.2.5
30.93 s
[gammaloop-workspace-check] Checking ratatui-widgets v0.3.0
31.06 s
[gammaloop-workspace-check] Checking ratatui-crossterm v0.1.0
31.08 s
[gammaloop-workspace-check] Checking brotli v7.0.0
31.36 s
[gammaloop-workspace-check] Checking ctrlc v3.5.2
31.47 s
[gammaloop-workspace-check] Checking include_dir v0.7.4
31.51 s
[gammaloop-workspace-check] Checking pathfinding v4.15.0
31.57 s
[gammaloop-workspace-check] Checking dirs v6.0.0
31.63 s
[gammaloop-workspace-check] Checking schemars v1.2.1
31.65 s
[gammaloop-workspace-check] Checking tracing-indicatif v0.3.14
32.06 s
[gammaloop-workspace-check] Checking slotmap v1.1.1
32.14 s
[gammaloop-workspace-check] Checking addr2line v0.25.1
32.24 s
[gammaloop-workspace-check] Checking clarabel v0.11.1
32.30 s
[gammaloop-workspace-check] Checking json5 v0.4.1
32.49 s
[gammaloop-workspace-check] Checking serde_yaml v0.9.34+deprecated
32.49 s
[gammaloop-workspace-check] Checking vectorize v0.2.0
32.57 s
[gammaloop-workspace-check] Checking base62 v2.2.4
32.95 s
[gammaloop-workspace-check] Checking ringbuffer v0.16.0
32.99 s
[gammaloop-workspace-check] Checking rust-embed v8.11.0
33.02 s
[gammaloop-workspace-check] Checking clap_complete v4.6.3
33.12 s
[gammaloop-workspace-check] Checking strip-ansi-escapes v0.2.1
33.13 s
[gammaloop-workspace-check] Checking fd-lock v4.0.4
33.27 s
[gammaloop-workspace-check] Compiling gammaloop-api v0.1.0 (/build/source/crates/gammaloop-api)
33.32 s
[gammaloop-workspace-check] Checking itertools v0.13.0
33.43 s
[gammaloop-workspace-check] Checking ratatui-macros v0.7.0
33.46 s
[gammaloop-workspace-check] Checking strum v0.26.3
33.48 s
[gammaloop-workspace-check] Checking sysinfo v0.33.1
33.51 s
[gammaloop-workspace-check] Checking ratatui v0.30.0
33.55 s
[gammaloop-workspace-check] Checking shlex v1.3.0
33.58 s
[gammaloop-workspace-check] Checking futures-core v0.3.32
33.64 s
[gammaloop-workspace-check] Checking futures-task v0.3.32
33.74 s
[gammaloop-workspace-check] Checking slab v0.4.12
33.74 s
[gammaloop-workspace-check] Checking sdd v3.0.10
33.75 s
[gammaloop-workspace-check] Compiling gammaloop-integration-tests v0.1.0 (/build/source/tests)
33.87 s
[gammaloop-workspace-check] Checking futures-util v0.3.32
33.89 s
[gammaloop-workspace-check] Compiling test-log-core v0.2.20
33.91 s
[gammaloop-workspace-check] Checking clap_complete_nushell v4.6.0
33.98 s
[gammaloop-workspace-check] Checking scc v2.4.0
34.25 s
[gammaloop-workspace-check] Compiling rustc_version v0.4.1
34.83 s
[gammaloop-workspace-check] Checking which v8.0.2
35.19 s
[gammaloop-workspace-check] Checking bincode v1.3.3
35.21 s
[gammaloop-workspace-check] Compiling gungraun-runner v0.18.2
35.33 s
[gammaloop-workspace-check] Checking nalgebra v0.29.0
35.53 s
[gammaloop-workspace-check] Compiling gungraun-macros v0.8.0
36.00 s
[gammaloop-workspace-check] Checking proc-macro2 v1.0.106
36.03 s
[gammaloop-workspace-check] Checking backtrace v0.3.76
36.57 s
[gammaloop-workspace-check] Checking color-eyre v0.6.5
36.89 s
[gammaloop-workspace-check] Checking reedline v0.42.0
37.03 s
[gammaloop-workspace-check] Checking quote v1.0.45
37.12 s
[gammaloop-workspace-check] Checking maplit v1.0.2
37.20 s
[gammaloop-workspace-check] Checking base64 v0.21.7
37.21 s
[gammaloop-workspace-check] Checking futures-executor v0.3.32
37.35 s
[gammaloop-workspace-check] Checking serial_test v3.4.0
37.38 s
[gammaloop-workspace-check] Compiling iai-callgrind-runner v0.14.2
37.47 s
[gammaloop-workspace-check] Checking kurbo v0.13.0
37.50 s
[gammaloop-workspace-check] Checking wait-timeout v0.2.1
37.52 s
[gammaloop-workspace-check] Checking bit-vec v0.8.0
37.56 s
[gammaloop-workspace-check] Checking quick-error v1.2.3
37.60 s
[gammaloop-workspace-check] Compiling iai-callgrind v0.14.2
37.64 s
[gammaloop-workspace-check] Checking rusty-fork v0.3.1
37.76 s
[gammaloop-workspace-check] Checking bit-set v0.8.0
37.77 s
[gammaloop-workspace-check] Checking syn v2.0.117
37.79 s
[gammaloop-workspace-check] Compiling test-log-macros v0.2.20
37.86 s
[gammaloop-workspace-check] Compiling iai-callgrind-macros v0.5.1
37.87 s
[gammaloop-workspace-check] Checking ron v0.8.1
37.99 s
[gammaloop-workspace-check] Checking rand_xorshift v0.4.0
38.11 s
[gammaloop-workspace-check] Checking console v0.15.11
38.79 s
[gammaloop-workspace-check] Checking unarray v0.1.4
38.89 s
[gammaloop-workspace-check] Checking pathdiff v0.2.3
38.98 s
[gammaloop-workspace-check] Checking proptest v1.11.0
39.18 s
[gammaloop-workspace-check] Compiling graphica v2.1.0 (https://github.com/alphal00p/symbolica?rev=a277a8dadbaae5a8d6605f2f381991a601e1f345#a277a8da)
39.23 s
[gammaloop-workspace-check] Checking similar-asserts v1.7.0
39.31 s
[gammaloop-workspace-check] Checking kurvst v0.1.0 (/build/source/crates/kurvst)
40.89 s
[gammaloop-workspace-check] Checking clinnet v0.1.8 (/build/source/crates/clinnet)
43.16 s
[gammaloop-workspace-check] Checking test-log v0.2.20
50.64 s
[gammaloop-workspace-check] Checking statrs v0.16.1
51.90 s
[gammaloop-workspace-check] Checking gungraun v0.18.2
52.78 s
[gammaloop-workspace-check] Checking momtrop v0.3.0
55.60 s
[gammaloop-workspace-check] Compiling pyo3-macros v0.28.3
56.44 s
[gammaloop-workspace-check] Compiling pyo3-stub-gen-derive v0.17.2
66.56 s
[gammaloop-workspace-check] Checking pyo3-stub-gen v0.17.2
81.37 s
[gammaloop-workspace-check] Checking symbolica-utils v0.1.0 (/build/source/crates/symbolica-utils)
81.37 s
[gammaloop-workspace-check] Checking spenso-macros v0.3.2 (/build/source/crates/spenso-macros)
337.97 s
[gammaloop-workspace-check] Compiling gammaloop-workspace-hack v0.1.0 (/build/source/crates/gammaloop-workspace-hack)
338.45 s
[gammaloop-workspace-check] Checking linnet v0.17.0 (/build/source/crates/linnet)
343.50 s
[gammaloop-workspace-check] Checking spenso v0.6.0 (/build/source/crates/spenso)
343.50 s
[gammaloop-workspace-check] Checking linnet-py v0.1.0 (/build/source/crates/linnet-py)
343.50 s
[gammaloop-workspace-check] Checking linnest v0.1.0 (/build/source/crates/linnest)
350.94 s
[gammaloop-workspace-check] Checking idenso v0.3.0 (/build/source/crates/idenso)
350.94 s
[gammaloop-workspace-check] Checking gammaloop-tracing-filter v0.1.0 (/build/source/crates/gammaloop-tracing-filter)
354.08 s
[gammaloop-workspace-check] Checking spenso-hep-lib v0.1.7 (/build/source/crates/spenso-hep-lib)
354.62 s
[gammaloop-workspace-check] Checking spynso3 v0.1.2 (/build/source/crates/spynso3)
398.23 s
[gammaloop-workspace-check] error[E0609] : no field `lmb_channel_id` on type `CutInfo`
398.23 s
[gammaloop-workspace-check] --> tests/tests/test_runs/utils.rs:568:36
398.23 s
[gammaloop-workspace-check] |
398.23 s
[gammaloop-workspace-check] 568 | event.cut_info.lmb_channel_id,
398.23 s
[gammaloop-workspace-check] | ^^^^^^^^^^^^^^ unknown field
398.23 s
[gammaloop-workspace-check] |
398.23 s
[gammaloop-workspace-check] = note : available fields are: `particle_pdgs`, `cut_id`, `graph_id`, `graph_group_id`, `orientation_id` ... and 2 others
398.23 s
[gammaloop-workspace-check]
398.23 s
[gammaloop-workspace-check] error[E0609] : no field `lmb_channel_id` on type `CutInfo`
398.23 s
[gammaloop-workspace-check] --> tests/tests/test_runs/utils.rs:580:36
398.23 s
[gammaloop-workspace-check] |
398.23 s
[gammaloop-workspace-check] 580 | event.cut_info.lmb_channel_id,
398.23 s
[gammaloop-workspace-check] | ^^^^^^^^^^^^^^ unknown field
398.23 s
[gammaloop-workspace-check] |
398.23 s
[gammaloop-workspace-check] = note : available fields are: `particle_pdgs`, `cut_id`, `graph_id`, `graph_group_id`, `orientation_id` ... and 2 others
398.23 s
[gammaloop-workspace-check]
398.75 s
[gammaloop-workspace-check] For more information about this error, try `rustc --explain E0609`.
398.77 s
[gammaloop-workspace-check] error : could not compile `gammaloop-integration-tests` (test "test_runs") due to 2 previous errors
399.35 s
Progress: 0 of 1 built (1 failed)
399.35 s
Failed to build gammaloop-workspace-check after 6m36s
399.36 s
Cannot build ' /nix/store/678qn1yyh3j4046ys9sarqm9q60571r7-gammaloop-workspace-check-0.1.0.drv '.
399.36 s
Reason: builder failed with exit code 101 .
399.36 s
Output paths:
399.36 s
/nix/store/164617w7wk11sv41wc87zhpky9g3qq80-gammaloop-workspace-check-0.1.0
399.36 s
Last 443 log lines:
399.36 s
> Running phase: unpackPhase
399.36 s
> unpacking source archive /nix/store/3jj3smp74rs9m6ykxsf11s7cz9qgyqb0-source
399.36 s
> source root is source
399.36 s
> Running phase: patchPhase
399.36 s
> Executing configureCargoCommonVars
399.36 s
> decompressing cargo artifacts from /nix/store/50vpxlcgfxf2d57i27v3d10zjwxxbm2r-gammaloop-workspace-deps-deps-0.1.0/target.tar.zst to target
399.36 s
> Running phase: updateAutotoolsGnuConfigScriptsPhase
399.36 s
> Running phase: configurePhase
399.36 s
> will append /build/source/.cargo-home/config.toml with contents of /nix/store/5drf77x6km4ky7gwlrzdx9bbd6fz09g3-vendor-cargo-deps/config.toml
399.36 s
> default configurePhase, nothing to do
399.36 s
> Running phase: buildPhase
399.36 s
> +++ command cargo --version
399.36 s
> cargo 1.97.0 (c980f4866 2026-06-30)
399.36 s
> +++ command cargo check --profile ci-optim --locked --workspace --features gammaloop-tracing-filter/clap,gammaloop-tracing-filter/symbolica,idenso/bincode,idenso/reference-cases,linnet/bincode,linnet/drawing,linnet/rkyv,linnet/serde,linnet/symbolica,spenso-macros/shadowing,spenso/shadowing,symbolica/tracing_max_level_info,three-dimensional-reps/display,three-dimensional-reps/eval,three-dimensional-reps/serde --all-targets
399.36 s
> Checking cfg-if v1.0.4
399.36 s
> Checking memchr v2.8.0
399.36 s
> Checking once_cell v1.21.4
399.36 s
> Checking either v1.15.0
399.36 s
> Checking serde_core v1.0.228
399.36 s
> Checking libc v0.2.186
399.36 s
> Checking libm v0.2.16
399.36 s
> Checking itoa v1.0.18
399.36 s
> Checking log v0.4.29
399.36 s
> Checking regex-syntax v0.8.10
399.36 s
> Checking zerocopy v0.8.48
399.36 s
> Checking crossbeam-utils v0.8.21
399.36 s
> Checking equivalent v1.0.2
399.36 s
> Checking zmij v1.0.21
399.36 s
> Checking lazy_static v1.5.0
399.36 s
> Checking bytemuck v1.25.0
399.36 s
> Compiling target-lexicon v0.13.5
399.36 s
> Checking arrayvec v0.7.6
399.36 s
> Checking powerfmt v0.2.0
399.36 s
> Checking num_threads v0.1.7
399.36 s
> Checking itertools v0.14.0
399.36 s
> Checking num-conv v0.2.1
399.36 s
> Checking pin-project-lite v0.2.17
399.36 s
> Checking time-core v0.1.8
399.36 s
> Checking safe_arch v0.7.4
399.36 s
> Checking allocator-api2 v0.2.21
399.36 s
> Checking foldhash v0.2.0
399.36 s
> Checking deranged v0.5.8
399.36 s
> Checking const-random v0.1.18
399.36 s
> Checking nu-ansi-term v0.50.3
399.36 s
> Checking unty v0.0.4
399.36 s
> Checking aho-corasick v1.1.4
399.36 s
> Checking static_assertions v1.1.0
399.36 s
> Checking wide v0.7.33
399.36 s
> Checking winnow v1.0.2
399.36 s
> Checking safe_arch v1.0.0
399.36 s
> Checking hashbrown v0.16.1
399.36 s
> Checking tracing-core v0.1.36
399.36 s
> Checking sharded-slab v0.1.7
399.36 s
> Checking thread_local v1.1.9
399.36 s
> Checking crossbeam-epoch v0.9.18
399.36 s
> Checking getrandom v0.3.4
399.36 s
> Checking tracing-log v0.2.0
399.36 s
> Checking crossbeam-deque v0.8.6
399.36 s
> Checking rayon-core v1.13.0
399.36 s
> Checking tracing v0.1.44
399.36 s
> Checking rand_core v0.9.5
399.36 s
> Checking gmp-mpfr-sys v1.7.1
399.36 s
> Checking toml_writer v1.1.1+spec-1.1.0
399.36 s
> Checking az v1.3.0
399.36 s
> Checking indenter v0.3.4
399.36 s
> Checking wide v1.3.0
399.36 s
> Compiling phf_shared v0.11.3
399.36 s
> Checking anyhow v1.0.102
399.36 s
> Checking rawpointer v0.2.1
399.36 s
> Checking rayon v1.12.0
399.36 s
> Checking dyn-clone v1.0.20
399.36 s
> Checking utf8parse v0.2.2
399.36 s
> Checking alloc-no-stdlib v2.0.4
399.36 s
> Checking anstyle-parse v1.0.0
399.36 s
> Checking alloc-stdlib v0.2.2
399.36 s
> Checking matrixmultiply v0.3.10
399.36 s
> Checking anstyle-query v1.1.5
399.36 s
> Checking time v0.3.47
399.36 s
> Checking anstyle v1.0.14
399.36 s
> Checking toml_parser v1.1.2+spec-1.1.0
399.36 s
> Checking colorchoice v1.0.5
399.36 s
> Checking num-traits v0.2.19
399.36 s
> Checking colored v3.1.1
399.36 s
> Checking is_terminal_polyfill v1.70.2
399.36 s
> Compiling phf_generator v0.11.3
399.36 s
> Checking eyre v0.6.12
399.36 s
> Checking anstream v1.0.0
399.36 s
> Checking unicode-width v0.2.2
399.36 s
> Compiling pyo3-build-config v0.28.3
399.36 s
> Checking bitflags v1.3.2
399.36 s
> Compiling phf_codegen v0.11.3
399.36 s
> Checking region v3.0.2
399.36 s
> Checking wasmtime-jit-icache-coherence v34.0.2
399.36 s
> Checking brotli-decompressor v5.0.0
399.36 s
> Checking hugepage-rs v0.1.1
399.36 s
> Checking inventory v0.3.24
399.36 s
> Checking spec_math v0.1.6
399.36 s
> Checking thiserror v2.0.18
399.36 s
> Compiling getopts v0.2.24
399.36 s
> Checking libloading v0.9.0
399.36 s
> Checking tinyjson v2.5.1
399.36 s
> Checking self_cell v1.2.2
399.36 s
> Checking approx v0.5.1
399.36 s
> Checking num-integer v0.1.46
399.36 s
> Checking byteorder v1.5.0
399.36 s
> Checking append-only-vec v0.1.8
399.36 s
> Checking bytes v1.11.1
399.36 s
> Compiling unicode_names2_generator v1.3.0
399.36 s
> Compiling unic-char-range v0.9.0
399.36 s
> Checking linux-raw-sys v0.12.1
399.36 s
> Compiling unic-common v0.9.0
399.36 s
> Compiling unic-ucd-version v0.9.0
399.36 s
> Compiling unic-char-property v0.9.0
399.36 s
> Compiling is-macro v0.3.7
399.36 s
> Compiling rustpython-parser-vendored v0.4.0
399.36 s
> Checking iana-time-zone v0.1.65
399.36 s
> Checking serde v1.0.228
399.36 s
> Checking serde_json v1.0.149
399.36 s
> Checking bitflags v2.11.1
399.36 s
> Checking serde_spanned v1.1.1
399.36 s
> Checking toml_datetime v1.1.1+spec-1.1.0
399.36 s
> Checking rustix v1.1.4
399.36 s
> Compiling rustpython-parser v0.4.0
399.36 s
> Compiling phf v0.11.3
399.36 s
> Checking regex-automata v0.4.14
399.36 s
> Checking rustc-hash v2.1.2
399.36 s
> Compiling unic-ucd-ident v0.9.0
399.36 s
> Compiling unic-emoji-char v0.9.0
399.36 s
> Checking toml v1.1.2+spec-1.1.0
399.36 s
> Checking brotli v8.0.2
399.36 s
> Compiling rustc-hash v1.1.0
399.36 s
> Compiling lalrpop-util v0.20.2
399.36 s
> Checking unicode-segmentation v1.13.2
399.36 s
> Compiling symbolica v2.2.0 (https://github.com/alphal00p/symbolica?rev=a277a8dadbaae5a8d6605f2f381991a601e1f345#a277a8da)
399.36 s
> Checking smallvec v1.15.1
399.36 s
> Checking num-complex v0.4.6
399.36 s
> Checking tracing-serde v0.2.0
399.36 s
> Checking bincode v2.0.1
399.36 s
> Checking smartstring v1.0.1
399.36 s
> Checking chrono v0.4.44
399.36 s
> Checking rug v1.30.0
399.36 s
> Checking typenum v1.20.0
399.36 s
> Checking getrandom v0.2.17
399.36 s
> Checking simba v0.9.1
399.36 s
> Checking ndarray v0.17.2
399.36 s
> Checking scopeguard v1.2.0
399.36 s
> Checking parking_lot_core v0.9.12
399.36 s
> Checking hashbrown v0.17.0
399.36 s
> Checking lock_api v0.4.14
399.36 s
> Checking unicode-ident v1.0.24
399.36 s
> Checking terminal_size v0.4.4
399.36 s
> Checking ppv-lite86 v0.2.21
399.36 s
> Checking ahash v0.8.12
399.36 s
> Checking errno v0.3.14
399.36 s
> Checking strsim v0.11.1
399.36 s
> Checking parking_lot v0.12.5
399.36 s
> Checking generic-array v0.14.7
399.36 s
> Checking unicase v2.9.0
399.36 s
> Checking clap_lex v1.1.0
399.36 s
> Checking signal-hook-registry v1.4.8
399.36 s
> Checking vte v0.14.1
399.36 s
> Checking same-file v1.0.6
399.36 s
> Checking walkdir v2.5.0
399.36 s
> Checking signal-hook v0.3.18
399.36 s
> Checking clap_builder v4.6.0
399.36 s
> Checking half v2.7.1
399.36 s
> Checking indexmap v2.14.0
399.36 s
> Checking mio v1.2.0
399.36 s
> Checking rand_chacha v0.9.0
399.36 s
> Checking ciborium-io v0.2.2
399.36 s
> Checking minimal-lexical v0.2.1
399.36 s
> Checking ciborium-ll v0.2.2
399.36 s
> Checking block-buffer v0.10.4
399.36 s
> Checking rand v0.9.4
399.36 s
> Checking crypto-common v0.1.7
399.36 s
> Checking signal-hook-mio v0.2.5
399.36 s
> Checking derive_more v2.1.1
399.36 s
> Checking digest v0.10.7
399.36 s
> Checking num-bigint v0.4.6
399.36 s
> Checking console v0.16.3
399.36 s
> Checking nom v7.1.3
399.36 s
> Checking bstr v1.12.1
399.36 s
> Checking winnow v0.7.15
399.36 s
> Checking cpufeatures v0.2.17
399.36 s
> Checking linux-raw-sys v0.4.15
399.36 s
> Checking sha2 v0.10.9
399.36 s
> Checking symjit v2.21.0
399.36 s
> Checking ciborium v0.2.2
399.36 s
> Checking rustix v0.38.44
399.36 s
> Checking rand_core v0.6.4
399.36 s
> Compiling unicode_names2 v1.3.0
399.36 s
> Checking getrandom v0.4.2
399.36 s
> Checking fnv v1.0.7
399.36 s
> Checking plotters-backend v0.3.7
399.36 s
> Checking fastrand v2.4.1
399.36 s
> Checking crossterm v0.28.1
399.36 s
> Checking tempfile v3.27.0
399.36 s
> Checking ansitok v0.3.0
399.36 s
> Checking plotters-svg v0.3.7
399.36 s
> Checking serde_spanned v0.6.9
399.36 s
> Checking toml_datetime v0.6.11
399.36 s
> Checking itertools v0.10.5
399.36 s
> Checking tap v1.0.1
399.36 s
> Checking toml_write v0.1.2
399.36 s
> Checking cast v0.3.0
399.36 s
> Checking wyz v0.5.1
399.36 s
> Checking ansi-str v0.9.0
399.36 s
> Checking toml_edit v0.22.27
399.36 s
> Checking clap v4.6.1
399.36 s
> Checking plotters v0.3.7
399.36 s
> Checking rand_chacha v0.3.1
399.36 s
> Checking radium v0.7.0
399.36 s
> Checking typeid v1.0.3
399.36 s
> Checking matchers v0.2.0
399.36 s
> Checking regex v1.12.3
399.36 s
> Checking tracing-subscriber v0.3.23
399.36 s
> Checking globset v0.4.18
399.36 s
> Checking similar v2.7.0
399.36 s
> Checking tinytemplate v1.2.1
399.36 s
> Compiling pyo3-ffi v0.28.3
399.36 s
> Compiling pyo3-macros-backend v0.28.3
399.36 s
> Compiling pyo3 v0.28.3
399.36 s
> Compiling numpy v0.28.0
399.36 s
> Checking rust-embed-utils v8.11.0
399.36 s
> Checking xprec v0.2.2
399.36 s
> Checking is-terminal v0.4.17
399.36 s
> Checking funty v2.0.0
399.36 s
> Checking bytecount v0.6.9
399.36 s
> Checking anes v0.1.6
399.36 s
> Checking oorandom v11.1.5
399.36 s
> Checking papergrid v0.17.0
399.36 s
> Checking env_filter v1.0.1
399.36 s
> Checking ron v0.12.1
399.36 s
> Checking rand v0.8.6
399.36 s
> Checking testing_table v0.3.0
399.36 s
> Checking toml_edit v0.25.11+spec-1.1.0
399.36 s
> Checking uncased v0.9.10
399.36 s
> Checking bitvec v1.0.1
399.36 s
> Checking jiff v0.2.24
399.36 s
> Checking ptr_meta v0.1.4
399.36 s
> Checking simdutf8 v0.1.5
399.36 s
> Checking ucd-trie v0.1.7
399.36 s
> Checking ahash v0.7.8
399.36 s
> Checking pest v2.8.6
399.36 s
> Checking bytecheck v0.6.12
399.36 s
> Checking hashbrown v0.12.3
399.36 s
> Checking criterion-plot v0.5.0
399.36 s
> Checking approx v0.4.0
399.36 s
> Checking toml v0.8.23
399.36 s
> Checking seahash v4.1.0
399.36 s
> Checking cgmath v0.18.0
399.36 s
> Checking num-rational v0.4.2
399.36 s
> Checking num-iter v0.1.45
399.36 s
> Checking rend v0.4.2
399.36 s
> Checking criterion v0.5.1
399.36 s
> Checking ref-ops v0.2.5
399.36 s
> Checking rand_xoshiro v0.6.0
399.36 s
> Checking num v0.4.3
399.36 s
> Checking features v0.10.0
399.36 s
> Checking gat-lending-iterator v0.1.8
399.36 s
> Checking constcat v0.5.1
399.36 s
> Checking colored v2.2.0
399.36 s
> Checking tabled v0.20.0
399.36 s
> Checking insta v1.47.2
399.36 s
> Checking figment v0.10.19
399.36 s
> Compiling rustpython-parser-core v0.4.0
399.36 s
> Checking constant_time_eq v0.4.2
399.36 s
> Checking arrayref v0.3.9
399.36 s
> Checking cpufeatures v0.3.0
399.36 s
> Checking base64 v0.22.1
399.36 s
> Compiling rustpython-ast v0.4.0
399.36 s
> Checking blake3 v1.8.5
399.36 s
> Checking joinery v2.1.0
399.36 s
> Checking siphasher v1.0.2
399.36 s
> Checking titlecase v2.2.1
399.36 s
> Checking dot-parser v0.5.1
399.36 s
> Checking rust_lisp v0.18.0
399.36 s
> Checking phf_shared v0.13.1
399.36 s
> Checking subprocess v0.2.15
399.36 s
> Compiling vakint v0.1.2 (/build/source/crates/vakint)
399.36 s
> Checking phf v0.13.1
399.36 s
> Checking version-compare v0.2.1
399.36 s
> Checking xpct v0.5.1
399.36 s
> Checking ryu v1.0.23
399.36 s
> Checking castaway v0.2.4
399.36 s
> Checking string-template-plus v0.4.3
399.36 s
> Checking toml_datetime v0.7.5+spec-1.1.0
399.36 s
> Checking strum v0.27.2
399.36 s
> Checking compact_str v0.9.0
399.36 s
> Checking unicode-truncate v2.0.1
399.36 s
> Checking kasuari v0.4.12
399.36 s
> Checking lru v0.16.4
399.36 s
> Checking vte v0.15.0
399.36 s
> Checking toml v0.9.12+spec-1.1.0
399.36 s
> Checking portable-atomic v1.13.1
399.36 s
> Checking unit-prefix v0.5.2
399.36 s
> Checking vt100 v0.16.2
399.36 s
> Checking rand_distr v0.4.3
399.36 s
> Checking simba v0.6.0
399.36 s
> Checking ratatui-core v0.1.0
399.36 s
> Checking line-clipping v0.3.7
399.36 s
> Checking gimli v0.32.3
399.36 s
> Compiling three-dimensional-reps v0.1.0 (/build/source/crates/three-dimensional-reps)
399.36 s
> Checking adler2 v2.0.1
399.36 s
> Checking miniz_oxide v0.8.9
399.36 s
> Checking thiserror v1.0.69
399.36 s
> Checking derive_builder v0.11.2
399.36 s
> Checking crossterm v0.29.0
399.36 s
> Checking indicatif v0.18.4
399.36 s
> Checking owo-colors v4.3.0
399.36 s
> Checking object v0.37.3
399.36 s
> Checking tracing-error v0.2.1
399.36 s
> Checking typed-index-collections v3.5.0
399.36 s
> Checking serde-big-array v0.5.1
399.36 s
> Checking amd v0.2.2
399.36 s
> Checking rkyv v0.7.46
399.36 s
> Checking itertools v0.11.0
399.36 s
> Compiling gammaloop-tracing-filter-macros v0.1.0 (/build/source/crates/gammaloop-tracing-filter-macros)
399.36 s
> Checking option-ext v0.2.0
399.36 s
> Checking rustc-demangle v0.1.27
399.36 s
> Checking color-spantrace v0.3.0
399.36 s
> Checking dirs-sys v0.5.0
399.36 s
> Checking ref-cast v1.0.25
399.36 s
> Checking nix v0.31.2
399.36 s
> Checking integer-sqrt v0.1.5
399.36 s
> Checking brotli-decompressor v4.0.3
399.36 s
> Checking crossbeam-channel v0.5.15
399.36 s
> Compiling numerica v2.2.0 (https://github.com/alphal00p/symbolica?rev=a277a8dadbaae5a8d6605f2f381991a601e1f345#a277a8da)
399.36 s
> Checking env_logger v0.11.10
399.36 s
> Checking itertools v0.12.1
399.36 s
> Compiling gammalooprs v0.3.4 (/build/source/crates/gammalooprs)
399.36 s
> Checking symlink v0.1.0
399.36 s
> Checking unsafe-libyaml v0.2.11
399.36 s
> Checking tracing-appender v0.2.5
399.36 s
> Checking ratatui-widgets v0.3.0
399.36 s
> Checking ratatui-crossterm v0.1.0
399.36 s
> Checking brotli v7.0.0
399.36 s
> Checking ctrlc v3.5.2
399.36 s
> Checking include_dir v0.7.4
399.36 s
> Checking pathfinding v4.15.0
399.36 s
> Checking dirs v6.0.0
399.36 s
> Checking schemars v1.2.1
399.36 s
> Checking tracing-indicatif v0.3.14
399.36 s
> Checking slotmap v1.1.1
399.36 s
> Checking addr2line v0.25.1
399.36 s
> Checking clarabel v0.11.1
399.36 s
> Checking json5 v0.4.1
399.36 s
> Checking serde_yaml v0.9.34+deprecated
399.36 s
> Checking vectorize v0.2.0
399.36 s
> Checking base62 v2.2.4
399.36 s
> Checking ringbuffer v0.16.0
399.36 s
> Checking rust-embed v8.11.0
399.36 s
> Checking clap_complete v4.6.3
399.36 s
> Checking strip-ansi-escapes v0.2.1
399.36 s
> Checking fd-lock v4.0.4
399.36 s
> Compiling gammaloop-api v0.1.0 (/build/source/crates/gammaloop-api)
399.36 s
> Checking itertools v0.13.0
399.36 s
> Checking ratatui-macros v0.7.0
399.36 s
> Checking strum v0.26.3
399.36 s
> Checking sysinfo v0.33.1
399.36 s
> Checking ratatui v0.30.0
399.36 s
> Checking shlex v1.3.0
399.36 s
> Checking futures-core v0.3.32
399.36 s
> Checking futures-task v0.3.32
399.36 s
> Checking slab v0.4.12
399.36 s
> Checking sdd v3.0.10
399.36 s
> Compiling gammaloop-integration-tests v0.1.0 (/build/source/tests)
399.36 s
> Checking futures-util v0.3.32
399.36 s
> Compiling test-log-core v0.2.20
399.36 s
> Checking clap_complete_nushell v4.6.0
399.36 s
> Checking scc v2.4.0
399.36 s
> Compiling rustc_version v0.4.1
399.36 s
> Checking which v8.0.2
399.36 s
> Checking bincode v1.3.3
399.36 s
> Compiling gungraun-runner v0.18.2
399.36 s
> Checking nalgebra v0.29.0
399.36 s
> Compiling gungraun-macros v0.8.0
399.36 s
> Checking proc-macro2 v1.0.106
399.36 s
> Checking backtrace v0.3.76
399.36 s
> Checking color-eyre v0.6.5
399.36 s
> Checking reedline v0.42.0
399.36 s
> Checking quote v1.0.45
399.36 s
> Checking maplit v1.0.2
399.36 s
> Checking base64 v0.21.7
399.36 s
> Checking futures-executor v0.3.32
399.36 s
> Checking serial_test v3.4.0
399.36 s
> Compiling iai-callgrind-runner v0.14.2
399.36 s
> Checking kurbo v0.13.0
399.36 s
> Checking wait-timeout v0.2.1
399.36 s
> Checking bit-vec v0.8.0
399.36 s
> Checking quick-error v1.2.3
399.36 s
> Compiling iai-callgrind v0.14.2
399.36 s
> Checking rusty-fork v0.3.1
399.36 s
> Checking bit-set v0.8.0
399.36 s
> Checking syn v2.0.117
399.36 s
> Compiling test-log-macros v0.2.20
399.36 s
> Compiling iai-callgrind-macros v0.5.1
399.36 s
> Checking ron v0.8.1
399.36 s
> Checking rand_xorshift v0.4.0
399.36 s
> Checking console v0.15.11
399.36 s
> Checking unarray v0.1.4
399.36 s
> Checking pathdiff v0.2.3
399.36 s
> Checking proptest v1.11.0
399.36 s
> Compiling graphica v2.1.0 (https://github.com/alphal00p/symbolica?rev=a277a8dadbaae5a8d6605f2f381991a601e1f345#a277a8da)
399.36 s
> Checking similar-asserts v1.7.0
399.36 s
> Checking kurvst v0.1.0 (/build/source/crates/kurvst)
399.36 s
> Checking clinnet v0.1.8 (/build/source/crates/clinnet)
399.36 s
> Checking test-log v0.2.20
399.36 s
> Checking statrs v0.16.1
399.36 s
> Checking gungraun v0.18.2
399.36 s
> Checking momtrop v0.3.0
399.36 s
> Compiling pyo3-macros v0.28.3
399.36 s
> Compiling pyo3-stub-gen-derive v0.17.2
399.36 s
> Checking pyo3-stub-gen v0.17.2
399.36 s
> Checking symbolica-utils v0.1.0 (/build/source/crates/symbolica-utils)
399.36 s
> Checking spenso-macros v0.3.2 (/build/source/crates/spenso-macros)
399.36 s
> Compiling gammaloop-workspace-hack v0.1.0 (/build/source/crates/gammaloop-workspace-hack)
399.36 s
> Checking linnet v0.17.0 (/build/source/crates/linnet)
399.36 s
> Checking spenso v0.6.0 (/build/source/crates/spenso)
399.36 s
> Checking linnet-py v0.1.0 (/build/source/crates/linnet-py)
399.36 s
> Checking linnest v0.1.0 (/build/source/crates/linnest)
399.36 s
> Checking idenso v0.3.0 (/build/source/crates/idenso)
399.36 s
> Checking gammaloop-tracing-filter v0.1.0 (/build/source/crates/gammaloop-tracing-filter)
399.36 s
> Checking spenso-hep-lib v0.1.7 (/build/source/crates/spenso-hep-lib)
399.36 s
> Checking spynso3 v0.1.2 (/build/source/crates/spynso3)
399.36 s
> error[E0609] : no field `lmb_channel_id` on type `CutInfo`
399.36 s
> --> tests/tests/test_runs/utils.rs:568:36
399.36 s
> |
399.36 s
> 568 | event.cut_info.lmb_channel_id,
399.36 s
> | ^^^^^^^^^^^^^^ unknown field
399.36 s
> |
399.36 s
> = note : available fields are: `particle_pdgs`, `cut_id`, `graph_id`, `graph_group_id`, `orientation_id` ... and 2 others
399.36 s
>
399.36 s
> error[E0609] : no field `lmb_channel_id` on type `CutInfo`
399.36 s
> --> tests/tests/test_runs/utils.rs:580:36
399.36 s
> |
399.36 s
> 580 | event.cut_info.lmb_channel_id,
399.36 s
> | ^^^^^^^^^^^^^^ unknown field
399.36 s
> |
399.36 s
> = note : available fields are: `particle_pdgs`, `cut_id`, `graph_id`, `graph_group_id`, `orientation_id` ... and 2 others
399.36 s
>
399.36 s
> For more information about this error, try `rustc --explain E0609`.
399.36 s
> error : could not compile `gammaloop-integration-tests` (test "test_runs") due to 2 previous errors
399.36 s
For full logs, run:
399.36 s
nix log /nix/store/678qn1yyh3j4046ys9sarqm9q60571r7-gammaloop-workspace-check-0.1.0.drv
399.39 s
Build failed.