1. 0.00 s $ /nix/store/9ypz3flqsrl5xl495mm8h645gadjsxi1-coreutils-9.11/bin/timeout --kill-after=15s 7200s /nix/store/23zk8sgzamrbmj1fday15szf7f2279s8-nix-2.34.7/bin/nix --extra-experimental-features nix-command --extra-experimental-features flakes --log-format internal-json build --no-link --print-out-paths git+https://github.com/alphal00p/gammaloop?ref=advanced_sampling&rev=f2f64fb17dd5dab588eca298dc61f1100fa4962d&shallow=1#checks.x86_64-linux.gammaloop-check --print-build-logs
  2. 2.46 s
  3. 2.93 s Building /nix/store/01wv2cvlxmkwk15rfvw73pimfsfm321c-gammaloop-workspace-check-0.1.0.drv
  4. 3.00 s [gammaloop-workspace-check] Phase: unpackPhase
  5. 3.00 s [gammaloop-workspace-check] unpacking source archive /nix/store/p4kvydb95jp9jm0ylgbb2r217q4zaj95-source
  6. 3.14 s [gammaloop-workspace-check] source root is source
  7. 3.17 s [gammaloop-workspace-check] Phase: patchPhase
  8. 3.17 s [gammaloop-workspace-check] Executing configureCargoCommonVars
  9. 3.18 s [gammaloop-workspace-check] decompressing cargo artifacts from /nix/store/50vpxlcgfxf2d57i27v3d10zjwxxbm2r-gammaloop-workspace-deps-deps-0.1.0/target.tar.zst to target
  10. 4.42 s [gammaloop-workspace-check] Phase: updateAutotoolsGnuConfigScriptsPhase
  11. 4.46 s [gammaloop-workspace-check] Phase: configurePhase
  12. 4.46 s [gammaloop-workspace-check] will append /build/source/.cargo-home/config.toml with contents of /nix/store/5drf77x6km4ky7gwlrzdx9bbd6fz09g3-vendor-cargo-deps/config.toml
  13. 4.46 s [gammaloop-workspace-check] default configurePhase, nothing to do
  14. 4.47 s [gammaloop-workspace-check] Phase: buildPhase
  15. 4.47 s [gammaloop-workspace-check] +++ command cargo --version
  16. 4.47 s [gammaloop-workspace-check] cargo 1.97.0 (c980f4866 2026-06-30)
  17. 4.50 s [gammaloop-workspace-check] +++ command cargo check --profile ci-optim --locked --workspace --features gammaloop-tracing-filter/clap,gammaloop-tracing-filter/symbolica,idenso/bincode,idenso/reference-cases,linnet/bincode,linnet/drawing,linnet/rkyv,linnet/serde,linnet/symbolica,spenso-macros/shadowing,spenso/shadowing,symbolica/tracing_max_level_info,three-dimensional-reps/display,three-dimensional-reps/eval,three-dimensional-reps/serde --all-targets
  18. 4.94 s [gammaloop-workspace-check] Checking cfg-if v1.0.4
  19. 4.94 s [gammaloop-workspace-check] Checking memchr v2.8.0
  20. 4.94 s [gammaloop-workspace-check] Checking once_cell v1.21.4
  21. 4.95 s [gammaloop-workspace-check] Checking either v1.15.0
  22. 4.95 s [gammaloop-workspace-check] Checking serde_core v1.0.228
  23. 4.95 s [gammaloop-workspace-check] Checking libc v0.2.186
  24. 4.95 s [gammaloop-workspace-check] Checking libm v0.2.16
  25. 4.96 s [gammaloop-workspace-check] Checking itoa v1.0.18
  26. 4.97 s [gammaloop-workspace-check] Checking log v0.4.29
  27. 4.97 s [gammaloop-workspace-check] Checking regex-syntax v0.8.10
  28. 4.98 s [gammaloop-workspace-check] Checking zerocopy v0.8.48
  29. 4.98 s [gammaloop-workspace-check] Checking crossbeam-utils v0.8.21
  30. 4.98 s [gammaloop-workspace-check] Checking equivalent v1.0.2
  31. 4.99 s [gammaloop-workspace-check] Checking zmij v1.0.21
  32. 4.99 s [gammaloop-workspace-check] Checking bytemuck v1.25.0
  33. 4.99 s [gammaloop-workspace-check] Checking lazy_static v1.5.0
  34. 5.01 s [gammaloop-workspace-check] Compiling target-lexicon v0.13.5
  35. 5.03 s [gammaloop-workspace-check] Checking arrayvec v0.7.6
  36. 5.04 s [gammaloop-workspace-check] Checking powerfmt v0.2.0
  37. 5.05 s [gammaloop-workspace-check] Checking time-core v0.1.8
  38. 5.06 s [gammaloop-workspace-check] Checking pin-project-lite v0.2.17
  39. 5.08 s [gammaloop-workspace-check] Checking itertools v0.14.0
  40. 5.11 s [gammaloop-workspace-check] Checking num-conv v0.2.1
  41. 5.14 s [gammaloop-workspace-check] Checking safe_arch v0.7.4
  42. 5.14 s [gammaloop-workspace-check] Checking num_threads v0.1.7
  43. 5.16 s [gammaloop-workspace-check] Checking tracing-core v0.1.36
  44. 5.17 s [gammaloop-workspace-check] Checking deranged v0.5.8
  45. 5.17 s [gammaloop-workspace-check] Checking foldhash v0.2.0
  46. 5.21 s [gammaloop-workspace-check] Checking allocator-api2 v0.2.21
  47. 5.21 s [gammaloop-workspace-check] Checking const-random v0.1.18
  48. 5.22 s [gammaloop-workspace-check] Checking nu-ansi-term v0.50.3
  49. 5.29 s [gammaloop-workspace-check] Checking static_assertions v1.1.0
  50. 5.30 s [gammaloop-workspace-check] Checking winnow v1.0.2
  51. 5.33 s [gammaloop-workspace-check] Checking aho-corasick v1.1.4
  52. 5.35 s [gammaloop-workspace-check] Checking unty v0.0.4
  53. 5.38 s [gammaloop-workspace-check] Checking crossbeam-epoch v0.9.18
  54. 5.40 s [gammaloop-workspace-check] Checking wide v0.7.33
  55. 5.40 s [gammaloop-workspace-check] Checking safe_arch v1.0.0
  56. 5.42 s [gammaloop-workspace-check] Checking hashbrown v0.16.1
  57. 5.46 s [gammaloop-workspace-check] Checking sharded-slab v0.1.7
  58. 5.48 s [gammaloop-workspace-check] Checking tracing v0.1.44
  59. 5.61 s [gammaloop-workspace-check] Checking crossbeam-deque v0.8.6
  60. 5.70 s [gammaloop-workspace-check] Checking rayon-core v1.13.0
  61. 5.71 s [gammaloop-workspace-check] Checking tracing-log v0.2.0
  62. 5.73 s [gammaloop-workspace-check] Checking thread_local v1.1.9
  63. 5.76 s [gammaloop-workspace-check] Checking indenter v0.3.4
  64. 5.81 s [gammaloop-workspace-check] Checking az v1.3.0
  65. 5.92 s [gammaloop-workspace-check] Checking toml_writer v1.1.1+spec-1.1.0
  66. 5.93 s [gammaloop-workspace-check] Checking wide v1.3.0
  67. 5.98 s [gammaloop-workspace-check] Checking num-traits v0.2.19
  68. 6.00 s [gammaloop-workspace-check] Checking rayon v1.12.0
  69. 6.06 s [gammaloop-workspace-check] Compiling phf_shared v0.11.3
  70. 6.10 s [gammaloop-workspace-check] Checking anyhow v1.0.102
  71. 6.18 s [gammaloop-workspace-check] Checking alloc-no-stdlib v2.0.4
  72. 6.21 s [gammaloop-workspace-check] Checking getrandom v0.3.4
  73. 6.23 s [gammaloop-workspace-check] Checking time v0.3.47
  74. 6.25 s [gammaloop-workspace-check] Checking gmp-mpfr-sys v1.7.1
  75. 6.31 s [gammaloop-workspace-check] Checking rawpointer v0.2.1
  76. 6.36 s [gammaloop-workspace-check] Checking rand_core v0.9.5
  77. 6.37 s [gammaloop-workspace-check] Checking utf8parse v0.2.2
  78. 6.38 s [gammaloop-workspace-check] Checking dyn-clone v1.0.20
  79. 6.38 s [gammaloop-workspace-check] Checking matrixmultiply v0.3.10
  80. 6.40 s [gammaloop-workspace-check] Checking toml_parser v1.1.2+spec-1.1.0
  81. 6.45 s [gammaloop-workspace-check] Checking anstyle-parse v1.0.0
  82. 6.48 s [gammaloop-workspace-check] Checking alloc-stdlib v0.2.2
  83. 6.49 s [gammaloop-workspace-check] Checking is_terminal_polyfill v1.70.2
  84. 6.52 s [gammaloop-workspace-check] Checking anstyle-query v1.1.5
  85. 6.52 s [gammaloop-workspace-check] Compiling pyo3-build-config v0.28.3
  86. 6.54 s [gammaloop-workspace-check] Checking colorchoice v1.0.5
  87. 6.55 s [gammaloop-workspace-check] Checking anstyle v1.0.14
  88. 6.56 s [gammaloop-workspace-check] Checking colored v3.1.1
  89. 6.58 s [gammaloop-workspace-check] Compiling phf_generator v0.11.3
  90. 6.60 s [gammaloop-workspace-check] Checking eyre v0.6.12
  91. 6.61 s [gammaloop-workspace-check] Checking unicode-width v0.2.2
  92. 6.63 s [gammaloop-workspace-check] Checking serde v1.0.228
  93. 6.67 s [gammaloop-workspace-check] Checking serde_json v1.0.149
  94. 6.68 s [gammaloop-workspace-check] Checking bitflags v2.11.1
  95. 6.70 s [gammaloop-workspace-check] Checking serde_spanned v1.1.1
  96. 6.73 s [gammaloop-workspace-check] Checking approx v0.5.1
  97. 6.78 s [gammaloop-workspace-check] Checking num-integer v0.1.46
  98. 6.79 s [gammaloop-workspace-check] Checking toml_datetime v1.1.1+spec-1.1.0
  99. 6.80 s [gammaloop-workspace-check] Checking regex-automata v0.4.14
  100. 6.81 s [gammaloop-workspace-check] Checking anstream v1.0.0
  101. 6.83 s [gammaloop-workspace-check] Checking bitflags v1.3.2
  102. 6.85 s [gammaloop-workspace-check] Compiling phf_codegen v0.11.3
  103. 6.86 s [gammaloop-workspace-check] Checking brotli-decompressor v5.0.0
  104. 6.88 s [gammaloop-workspace-check] Checking wasmtime-jit-icache-coherence v34.0.2
  105. 6.89 s [gammaloop-workspace-check] Checking region v3.0.2
  106. 6.94 s [gammaloop-workspace-check] Checking hugepage-rs v0.1.1
  107. 6.96 s [gammaloop-workspace-check] Checking spec_math v0.1.6
  108. 6.96 s [gammaloop-workspace-check] Checking toml v1.1.2+spec-1.1.0
  109. 6.97 s [gammaloop-workspace-check] Checking inventory v0.3.24
  110. 7.00 s [gammaloop-workspace-check] Checking thiserror v2.0.18
  111. 7.01 s [gammaloop-workspace-check] Compiling getopts v0.2.24
  112. 7.01 s [gammaloop-workspace-check] Checking libloading v0.9.0
  113. 7.04 s [gammaloop-workspace-check] Checking bytes v1.11.1
  114. 7.05 s [gammaloop-workspace-check] Checking self_cell v1.2.2
  115. 7.06 s [gammaloop-workspace-check] Checking tinyjson v2.5.1
  116. 7.08 s [gammaloop-workspace-check] Checking smallvec v1.15.1
  117. 7.12 s [gammaloop-workspace-check] Checking num-complex v0.4.6
  118. 7.13 s [gammaloop-workspace-check] Checking bincode v2.0.1
  119. 7.22 s [gammaloop-workspace-check] Checking tracing-serde v0.2.0
  120. 7.31 s [gammaloop-workspace-check] Checking smartstring v1.0.1
  121. 7.32 s [gammaloop-workspace-check] Checking append-only-vec v0.1.8
  122. 7.45 s [gammaloop-workspace-check] Checking byteorder v1.5.0
  123. 7.46 s [gammaloop-workspace-check] Compiling unicode_names2_generator v1.3.0
  124. 7.46 s [gammaloop-workspace-check] Compiling unic-common v0.9.0
  125. 7.53 s [gammaloop-workspace-check] Compiling unic-char-range v0.9.0
  126. 7.54 s [gammaloop-workspace-check] Checking linux-raw-sys v0.12.1
  127. 7.55 s [gammaloop-workspace-check] Compiling unic-ucd-version v0.9.0
  128. 7.56 s [gammaloop-workspace-check] Checking simba v0.9.1
  129. 7.60 s [gammaloop-workspace-check] Compiling unic-char-property v0.9.0
  130. 7.63 s [gammaloop-workspace-check] Compiling is-macro v0.3.7
  131. 7.67 s [gammaloop-workspace-check] Checking brotli v8.0.2
  132. 7.68 s [gammaloop-workspace-check] Compiling rustpython-parser-vendored v0.4.0
  133. 7.70 s [gammaloop-workspace-check] Checking iana-time-zone v0.1.65
  134. 7.74 s [gammaloop-workspace-check] Compiling rustpython-parser v0.4.0
  135. 7.76 s [gammaloop-workspace-check] Compiling phf v0.11.3
  136. 7.80 s [gammaloop-workspace-check] Checking rustc-hash v2.1.2
  137. 7.82 s [gammaloop-workspace-check] Checking chrono v0.4.44
  138. 7.86 s [gammaloop-workspace-check] Checking rustix v1.1.4
  139. 7.88 s [gammaloop-workspace-check] Compiling unic-emoji-char v0.9.0
  140. 7.91 s [gammaloop-workspace-check] Compiling unic-ucd-ident v0.9.0
  141. 7.93 s [gammaloop-workspace-check] Checking ndarray v0.17.2
  142. 8.08 s [gammaloop-workspace-check] Compiling rustc-hash v1.1.0
  143. 8.08 s [gammaloop-workspace-check] Compiling lalrpop-util v0.20.2
  144. 8.10 s [gammaloop-workspace-check] Checking rug v1.30.0
  145. 8.12 s [gammaloop-workspace-check] Checking unicode-segmentation v1.13.2
  146. 8.20 s [gammaloop-workspace-check] Compiling symbolica v2.2.0 (https://github.com/alphal00p/symbolica?rev=a277a8dadbaae5a8d6605f2f381991a601e1f345#a277a8da)
  147. 8.34 s [gammaloop-workspace-check] Checking typenum v1.20.0
  148. 8.35 s [gammaloop-workspace-check] Checking getrandom v0.2.17
  149. 8.62 s [gammaloop-workspace-check] Checking scopeguard v1.2.0
  150. 8.64 s [gammaloop-workspace-check] Checking parking_lot_core v0.9.12
  151. 8.71 s [gammaloop-workspace-check] Checking lock_api v0.4.14
  152. 8.87 s [gammaloop-workspace-check] Checking unicode-ident v1.0.24
  153. 8.95 s [gammaloop-workspace-check] Checking hashbrown v0.17.0
  154. 8.99 s [gammaloop-workspace-check] Checking errno v0.3.14
  155. 9.01 s [gammaloop-workspace-check] Checking parking_lot v0.12.5
  156. 9.14 s [gammaloop-workspace-check] Checking strsim v0.11.1
  157. 9.15 s [gammaloop-workspace-check] Checking unicase v2.9.0
  158. 9.21 s [gammaloop-workspace-check] Checking clap_lex v1.1.0
  159. 9.32 s [gammaloop-workspace-check] Checking ppv-lite86 v0.2.21
  160. 9.33 s [gammaloop-workspace-check] Checking ahash v0.8.12
  161. 9.34 s [gammaloop-workspace-check] Checking signal-hook-registry v1.4.8
  162. 9.37 s [gammaloop-workspace-check] Checking vte v0.14.1
  163. 9.39 s [gammaloop-workspace-check] Checking same-file v1.0.6
  164. 9.49 s [gammaloop-workspace-check] Checking walkdir v2.5.0
  165. 9.58 s [gammaloop-workspace-check] Checking generic-array v0.14.7
  166. 9.62 s [gammaloop-workspace-check] Checking signal-hook v0.3.18
  167. 9.64 s [gammaloop-workspace-check] Checking half v2.7.1
  168. 9.74 s [gammaloop-workspace-check] Checking mio v1.2.0
  169. 9.75 s [gammaloop-workspace-check] Checking indexmap v2.14.0
  170. 9.76 s [gammaloop-workspace-check] Checking rand_chacha v0.9.0
  171. 9.90 s [gammaloop-workspace-check] Checking minimal-lexical v0.2.1
  172. 9.92 s [gammaloop-workspace-check] Checking matchers v0.2.0
  173. 10.03 s [gammaloop-workspace-check] Checking rand v0.9.4
  174. 10.10 s [gammaloop-workspace-check] Checking tracing-subscriber v0.3.23
  175. 10.11 s [gammaloop-workspace-check] Checking regex v1.12.3
  176. 10.26 s [gammaloop-workspace-check] Checking ciborium-io v0.2.2
  177. 10.32 s [gammaloop-workspace-check] Checking signal-hook-mio v0.2.5
  178. 10.33 s [gammaloop-workspace-check] Checking ciborium-ll v0.2.2
  179. 10.35 s [gammaloop-workspace-check] Checking block-buffer v0.10.4
  180. 10.43 s [gammaloop-workspace-check] Checking crypto-common v0.1.7
  181. 10.47 s [gammaloop-workspace-check] Checking terminal_size v0.4.4
  182. 10.48 s [gammaloop-workspace-check] Checking nom v7.1.3
  183. 10.53 s [gammaloop-workspace-check] Checking digest v0.10.7
  184. 10.54 s [gammaloop-workspace-check] Checking derive_more v2.1.1
  185. 10.60 s [gammaloop-workspace-check] Checking clap_builder v4.6.0
  186. 10.63 s [gammaloop-workspace-check] Checking num-bigint v0.4.6
  187. 10.66 s [gammaloop-workspace-check] Checking console v0.16.3
  188. 10.71 s [gammaloop-workspace-check] Checking bstr v1.12.1
  189. 10.72 s [gammaloop-workspace-check] Checking winnow v0.7.15
  190. 10.72 s [gammaloop-workspace-check] Checking symjit v2.21.0
  191. 11.11 s [gammaloop-workspace-check] Checking linux-raw-sys v0.4.15
  192. 11.39 s [gammaloop-workspace-check] Checking cpufeatures v0.2.17
  193. 11.45 s [gammaloop-workspace-check] Checking sha2 v0.10.9
  194. 11.50 s [gammaloop-workspace-check] Checking rustix v0.38.44
  195. 11.80 s [gammaloop-workspace-check] Checking globset v0.4.18
  196. 11.84 s [gammaloop-workspace-check] Checking ciborium v0.2.2
  197. 11.98 s [gammaloop-workspace-check] Checking rand_core v0.6.4
  198. 12.12 s [gammaloop-workspace-check] Checking getrandom v0.4.2
  199. 12.14 s [gammaloop-workspace-check] Checking fnv v1.0.7
  200. 12.17 s [gammaloop-workspace-check] Checking fastrand v2.4.1
  201. 12.19 s [gammaloop-workspace-check] Checking xprec v0.2.2
  202. 12.21 s [gammaloop-workspace-check] Checking plotters-backend v0.3.7
  203. 12.27 s [gammaloop-workspace-check] Compiling unicode_names2 v1.3.0
  204. 12.35 s [gammaloop-workspace-check] Checking ansitok v0.3.0
  205. 12.36 s [gammaloop-workspace-check] Checking rust-embed-utils v8.11.0
  206. 12.39 s [gammaloop-workspace-check] Checking serde_spanned v0.6.9
  207. 12.50 s [gammaloop-workspace-check] Checking tempfile v3.27.0
  208. 12.53 s [gammaloop-workspace-check] Checking plotters-svg v0.3.7
  209. 12.57 s [gammaloop-workspace-check] Checking toml_datetime v0.6.11
  210. 12.58 s [gammaloop-workspace-check] Checking itertools v0.10.5
  211. 12.61 s [gammaloop-workspace-check] Checking tap v1.0.1
  212. 12.72 s [gammaloop-workspace-check] Checking toml_write v0.1.2
  213. 12.74 s [gammaloop-workspace-check] Checking cast v0.3.0
  214. 12.76 s [gammaloop-workspace-check] Checking plotters v0.3.7
  215. 12.79 s [gammaloop-workspace-check] Checking crossterm v0.28.1
  216. 12.88 s [gammaloop-workspace-check] Checking wyz v0.5.1
  217. 12.90 s [gammaloop-workspace-check] Checking rand_chacha v0.3.1
  218. 12.93 s [gammaloop-workspace-check] Checking radium v0.7.0
  219. 12.98 s [gammaloop-workspace-check] Checking ansi-str v0.9.0
  220. 13.03 s [gammaloop-workspace-check] Checking typeid v1.0.3
  221. 13.13 s [gammaloop-workspace-check] Checking similar v2.7.0
  222. 13.17 s [gammaloop-workspace-check] Checking tinytemplate v1.2.1
  223. 13.22 s [gammaloop-workspace-check] Checking clap v4.6.1
  224. 13.24 s [gammaloop-workspace-check] Checking is-terminal v0.4.17
  225. 13.25 s [gammaloop-workspace-check] Checking oorandom v11.1.5
  226. 13.31 s [gammaloop-workspace-check] Checking bytecount v0.6.9
  227. 13.32 s [gammaloop-workspace-check] Checking toml_edit v0.22.27
  228. 13.38 s [gammaloop-workspace-check] Checking funty v2.0.0
  229. 13.40 s [gammaloop-workspace-check] Checking anes v0.1.6
  230. 13.43 s [gammaloop-workspace-check] Checking rand v0.8.6
  231. 13.47 s [gammaloop-workspace-check] Checking papergrid v0.17.0
  232. 13.77 s [gammaloop-workspace-check] Checking ron v0.12.1
  233. 13.88 s [gammaloop-workspace-check] Checking testing_table v0.3.0
  234. 14.02 s [gammaloop-workspace-check] Checking toml_edit v0.25.11+spec-1.1.0
  235. 14.13 s [gammaloop-workspace-check] Checking bitvec v1.0.1
  236. 14.32 s [gammaloop-workspace-check] Checking env_filter v1.0.1
  237. 14.44 s [gammaloop-workspace-check] Checking uncased v0.9.10
  238. 14.47 s [gammaloop-workspace-check] Checking jiff v0.2.24
  239. 14.58 s [gammaloop-workspace-check] Checking ptr_meta v0.1.4
  240. 14.65 s [gammaloop-workspace-check] Compiling pyo3-macros-backend v0.28.3
  241. 14.71 s [gammaloop-workspace-check] Compiling pyo3-ffi v0.28.3
  242. 14.71 s [gammaloop-workspace-check] Compiling pyo3 v0.28.3
  243. 14.73 s [gammaloop-workspace-check] Compiling numpy v0.28.0
  244. 14.96 s [gammaloop-workspace-check] Checking ucd-trie v0.1.7
  245. 15.10 s [gammaloop-workspace-check] Checking criterion-plot v0.5.0
  246. 15.17 s [gammaloop-workspace-check] Checking simdutf8 v0.1.5
  247. 15.24 s [gammaloop-workspace-check] Checking ahash v0.7.8
  248. 15.32 s [gammaloop-workspace-check] Checking tabled v0.20.0
  249. 15.48 s [gammaloop-workspace-check] Checking pest v2.8.6
  250. 15.53 s [gammaloop-workspace-check] Checking bytecheck v0.6.12
  251. 15.54 s [gammaloop-workspace-check] Checking hashbrown v0.12.3
  252. 15.55 s [gammaloop-workspace-check] Checking approx v0.4.0
  253. 15.70 s [gammaloop-workspace-check] Checking seahash v4.1.0
  254. 15.73 s [gammaloop-workspace-check] Checking toml v0.8.23
  255. 15.74 s [gammaloop-workspace-check] Checking criterion v0.5.1
  256. 15.76 s [gammaloop-workspace-check] Checking cgmath v0.18.0
  257. 15.78 s [gammaloop-workspace-check] Checking insta v1.47.2
  258. 15.83 s [gammaloop-workspace-check] Checking num-rational v0.4.2
  259. 16.00 s [gammaloop-workspace-check] Checking rend v0.4.2
  260. 16.23 s [gammaloop-workspace-check] Checking num-iter v0.1.45
  261. 16.32 s [gammaloop-workspace-check] Checking figment v0.10.19
  262. 16.34 s [gammaloop-workspace-check] Checking ref-ops v0.2.5
  263. 16.43 s [gammaloop-workspace-check] Checking num v0.4.3
  264. 16.46 s [gammaloop-workspace-check] Checking rand_xoshiro v0.6.0
  265. 16.47 s [gammaloop-workspace-check] Checking features v0.10.0
  266. 16.51 s [gammaloop-workspace-check] Checking gat-lending-iterator v0.1.8
  267. 16.52 s [gammaloop-workspace-check] Checking constcat v0.5.1
  268. 16.59 s [gammaloop-workspace-check] Checking colored v2.2.0
  269. 16.80 s [gammaloop-workspace-check] Checking constant_time_eq v0.4.2
  270. 16.90 s [gammaloop-workspace-check] Checking cpufeatures v0.3.0
  271. 16.98 s [gammaloop-workspace-check] Checking arrayref v0.3.9
  272. 17.00 s [gammaloop-workspace-check] Checking base64 v0.22.1
  273. 17.01 s [gammaloop-workspace-check] Checking dot-parser v0.5.1
  274. 17.01 s [gammaloop-workspace-check] Checking joinery v2.1.0
  275. 17.03 s [gammaloop-workspace-check] Checking blake3 v1.8.5
  276. 17.08 s [gammaloop-workspace-check] Checking siphasher v1.0.2
  277. 17.11 s [gammaloop-workspace-check] Checking subprocess v0.2.15
  278. 17.15 s [gammaloop-workspace-check] Checking titlecase v2.2.1
  279. 17.24 s [gammaloop-workspace-check] Checking phf_shared v0.13.1
  280. 17.38 s [gammaloop-workspace-check] Checking rust_lisp v0.18.0
  281. 17.41 s [gammaloop-workspace-check] Compiling vakint v0.1.2 (/build/source/crates/vakint)
  282. 17.54 s [gammaloop-workspace-check] Checking phf v0.13.1
  283. 17.55 s [gammaloop-workspace-check] Checking version-compare v0.2.1
  284. 17.58 s [gammaloop-workspace-check] Compiling rustpython-parser-core v0.4.0
  285. 17.61 s [gammaloop-workspace-check] Checking xpct v0.5.1
  286. 17.71 s [gammaloop-workspace-check] Checking ryu v1.0.23
  287. 17.72 s [gammaloop-workspace-check] Checking castaway v0.2.4
  288. 17.75 s [gammaloop-workspace-check] Compiling rustpython-ast v0.4.0
  289. 17.78 s [gammaloop-workspace-check] Checking toml_datetime v0.7.5+spec-1.1.0
  290. 17.81 s [gammaloop-workspace-check] Checking strum v0.27.2
  291. 17.88 s [gammaloop-workspace-check] Checking unicode-truncate v2.0.1
  292. 17.91 s [gammaloop-workspace-check] Checking compact_str v0.9.0
  293. 17.92 s [gammaloop-workspace-check] Checking string-template-plus v0.4.3
  294. 17.93 s [gammaloop-workspace-check] Checking kasuari v0.4.12
  295. 18.02 s [gammaloop-workspace-check] Checking lru v0.16.4
  296. 18.04 s [gammaloop-workspace-check] Checking toml v0.9.12+spec-1.1.0
  297. 18.06 s [gammaloop-workspace-check] Checking vte v0.15.0
  298. 18.12 s [gammaloop-workspace-check] Checking portable-atomic v1.13.1
  299. 18.14 s [gammaloop-workspace-check] Checking unit-prefix v0.5.2
  300. 18.17 s [gammaloop-workspace-check] Checking rand_distr v0.4.3
  301. 18.22 s [gammaloop-workspace-check] Checking simba v0.6.0
  302. 18.25 s [gammaloop-workspace-check] Checking line-clipping v0.3.7
  303. 18.27 s [gammaloop-workspace-check] Checking vt100 v0.16.2
  304. 18.27 s [gammaloop-workspace-check] Compiling three-dimensional-reps v0.1.0 (/build/source/crates/three-dimensional-reps)
  305. 18.36 s [gammaloop-workspace-check] Checking adler2 v2.0.1
  306. 18.42 s [gammaloop-workspace-check] Checking gimli v0.32.3
  307. 18.49 s [gammaloop-workspace-check] Checking miniz_oxide v0.8.9
  308. 18.54 s [gammaloop-workspace-check] Checking thiserror v1.0.69
  309. 18.56 s [gammaloop-workspace-check] Checking derive_builder v0.11.2
  310. 18.58 s [gammaloop-workspace-check] Checking ratatui-core v0.1.0
  311. 18.62 s [gammaloop-workspace-check] Checking crossterm v0.29.0
  312. 18.65 s [gammaloop-workspace-check] Checking owo-colors v4.3.0
  313. 18.66 s [gammaloop-workspace-check] Checking object v0.37.3
  314. 18.67 s [gammaloop-workspace-check] Checking tracing-error v0.2.1
  315. 18.74 s [gammaloop-workspace-check] Checking typed-index-collections v3.5.0
  316. 18.76 s [gammaloop-workspace-check] Checking indicatif v0.18.4
  317. 18.80 s [gammaloop-workspace-check] Checking serde-big-array v0.5.1
  318. 18.86 s [gammaloop-workspace-check] Checking amd v0.2.2
  319. 18.94 s [gammaloop-workspace-check] Checking itertools v0.11.0
  320. 19.08 s [gammaloop-workspace-check] Compiling gammaloop-tracing-filter-macros v0.1.0 (/build/source/crates/gammaloop-tracing-filter-macros)
  321. 19.12 s [gammaloop-workspace-check] Checking env_logger v0.11.10
  322. 19.20 s [gammaloop-workspace-check] Checking rustc-demangle v0.1.27
  323. 19.38 s [gammaloop-workspace-check] Checking option-ext v0.2.0
  324. 19.41 s [gammaloop-workspace-check] Checking ref-cast v1.0.25
  325. 19.45 s [gammaloop-workspace-check] Checking nix v0.31.2
  326. 19.49 s [gammaloop-workspace-check] Checking dirs-sys v0.5.0
  327. 19.50 s [gammaloop-workspace-check] Checking integer-sqrt v0.1.5
  328. 19.52 s [gammaloop-workspace-check] Checking brotli-decompressor v4.0.3
  329. 19.53 s [gammaloop-workspace-check] Checking crossbeam-channel v0.5.15
  330. 19.56 s [gammaloop-workspace-check] Checking itertools v0.12.1
  331. 19.62 s [gammaloop-workspace-check] Compiling gammalooprs v0.3.4 (/build/source/crates/gammalooprs)
  332. 19.64 s [gammaloop-workspace-check] Checking unsafe-libyaml v0.2.11
  333. 19.66 s [gammaloop-workspace-check] Checking color-spantrace v0.3.0
  334. 19.82 s [gammaloop-workspace-check] Checking symlink v0.1.0
  335. 19.92 s [gammaloop-workspace-check] Checking rkyv v0.7.46
  336. 19.99 s [gammaloop-workspace-check] Checking dirs v6.0.0
  337. 20.01 s [gammaloop-workspace-check] Checking ratatui-widgets v0.3.0
  338. 20.07 s [gammaloop-workspace-check] Checking ratatui-crossterm v0.1.0
  339. 20.17 s [gammaloop-workspace-check] Checking tracing-appender v0.2.5
  340. 20.23 s [gammaloop-workspace-check] Checking ctrlc v3.5.2
  341. 20.27 s [gammaloop-workspace-check] Checking include_dir v0.7.4
  342. 20.40 s [gammaloop-workspace-check] Checking clarabel v0.11.1
  343. 20.45 s [gammaloop-workspace-check] Checking pathfinding v4.15.0
  344. 20.46 s [gammaloop-workspace-check] Checking tracing-indicatif v0.3.14
  345. 20.50 s [gammaloop-workspace-check] Checking schemars v1.2.1
  346. 20.56 s [gammaloop-workspace-check] Checking brotli v7.0.0
  347. 20.58 s [gammaloop-workspace-check] Checking serde_yaml v0.9.34+deprecated
  348. 20.71 s [gammaloop-workspace-check] Checking slotmap v1.1.1
  349. 21.08 s [gammaloop-workspace-check] Checking addr2line v0.25.1
  350. 21.09 s [gammaloop-workspace-check] Checking json5 v0.4.1
  351. 21.14 s [gammaloop-workspace-check] Compiling numerica v2.2.0 (https://github.com/alphal00p/symbolica?rev=a277a8dadbaae5a8d6605f2f381991a601e1f345#a277a8da)
  352. 21.41 s [gammaloop-workspace-check] Checking ratatui-macros v0.7.0
  353. 21.42 s [gammaloop-workspace-check] Checking vectorize v0.2.0
  354. 21.48 s [gammaloop-workspace-check] Checking ringbuffer v0.16.0
  355. 21.50 s [gammaloop-workspace-check] Checking ratatui v0.30.0
  356. 21.51 s [gammaloop-workspace-check] Checking base62 v2.2.4
  357. 21.51 s [gammaloop-workspace-check] Checking rust-embed v8.11.0
  358. 21.53 s [gammaloop-workspace-check] Checking clap_complete v4.6.3
  359. 21.60 s [gammaloop-workspace-check] Checking fd-lock v4.0.4
  360. 21.64 s [gammaloop-workspace-check] Checking strip-ansi-escapes v0.2.1
  361. 21.73 s [gammaloop-workspace-check] Compiling gammaloop-api v0.1.0 (/build/source/crates/gammaloop-api)
  362. 21.76 s [gammaloop-workspace-check] Checking itertools v0.13.0
  363. 21.77 s [gammaloop-workspace-check] Checking strum v0.26.3
  364. 21.78 s [gammaloop-workspace-check] Checking sysinfo v0.33.1
  365. 21.87 s [gammaloop-workspace-check] Checking shlex v1.3.0
  366. 21.95 s [gammaloop-workspace-check] Checking futures-task v0.3.32
  367. 22.00 s [gammaloop-workspace-check] Checking clap_complete_nushell v4.6.0
  368. 22.05 s [gammaloop-workspace-check] Checking slab v0.4.12
  369. 22.09 s [gammaloop-workspace-check] Checking futures-core v0.3.32
  370. 22.14 s [gammaloop-workspace-check] Checking sdd v3.0.10
  371. 22.18 s [gammaloop-workspace-check] Compiling gammaloop-integration-tests v0.1.0 (/build/source/tests)
  372. 22.25 s [gammaloop-workspace-check] Checking futures-util v0.3.32
  373. 22.30 s [gammaloop-workspace-check] Compiling test-log-core v0.2.20
  374. 22.43 s [gammaloop-workspace-check] Checking scc v2.4.0
  375. 22.56 s [gammaloop-workspace-check] Compiling rustc_version v0.4.1
  376. 22.73 s [gammaloop-workspace-check] Checking which v8.0.2
  377. 22.76 s [gammaloop-workspace-check] Checking bincode v1.3.3
  378. 22.76 s [gammaloop-workspace-check] Compiling gungraun-runner v0.18.2
  379. 23.13 s [gammaloop-workspace-check] Checking backtrace v0.3.76
  380. 23.19 s [gammaloop-workspace-check] Checking proc-macro2 v1.0.106
  381. 23.22 s [gammaloop-workspace-check] Checking nalgebra v0.29.0
  382. 23.40 s [gammaloop-workspace-check] Checking reedline v0.42.0
  383. 23.50 s [gammaloop-workspace-check] Compiling gungraun-macros v0.8.0
  384. 23.62 s [gammaloop-workspace-check] Checking color-eyre v0.6.5
  385. 23.70 s [gammaloop-workspace-check] Checking quote v1.0.45
  386. 23.89 s [gammaloop-workspace-check] Checking base64 v0.21.7
  387. 24.11 s [gammaloop-workspace-check] Checking maplit v1.0.2
  388. 24.18 s [gammaloop-workspace-check] Compiling iai-callgrind-runner v0.14.2
  389. 24.20 s [gammaloop-workspace-check] Checking kurbo v0.13.0
  390. 24.32 s [gammaloop-workspace-check] Checking ron v0.8.1
  391. 24.60 s [gammaloop-workspace-check] Checking wait-timeout v0.2.1
  392. 24.61 s [gammaloop-workspace-check] Checking quick-error v1.2.3
  393. 24.69 s [gammaloop-workspace-check] Checking futures-executor v0.3.32
  394. 24.73 s [gammaloop-workspace-check] Checking bit-vec v0.8.0
  395. 24.74 s [gammaloop-workspace-check] Compiling iai-callgrind v0.14.2
  396. 24.76 s [gammaloop-workspace-check] Checking rusty-fork v0.3.1
  397. 24.89 s [gammaloop-workspace-check] Checking serial_test v3.4.0
  398. 24.95 s [gammaloop-workspace-check] Compiling test-log-macros v0.2.20
  399. 25.01 s [gammaloop-workspace-check] Checking bit-set v0.8.0
  400. 25.11 s [gammaloop-workspace-check] Checking syn v2.0.117
  401. 25.23 s [gammaloop-workspace-check] Compiling iai-callgrind-macros v0.5.1
  402. 25.24 s [gammaloop-workspace-check] Checking rand_xorshift v0.4.0
  403. 25.30 s [gammaloop-workspace-check] Checking console v0.15.11
  404. 25.38 s [gammaloop-workspace-check] Checking unarray v0.1.4
  405. 25.53 s [gammaloop-workspace-check] Checking pathdiff v0.2.3
  406. 25.57 s [gammaloop-workspace-check] Checking proptest v1.11.0
  407. 25.63 s [gammaloop-workspace-check] Checking clinnet v0.1.8 (/build/source/crates/clinnet)
  408. 25.71 s [gammaloop-workspace-check] Checking similar-asserts v1.7.0
  409. 25.89 s [gammaloop-workspace-check] Checking kurvst v0.1.0 (/build/source/crates/kurvst)
  410. 26.09 s [gammaloop-workspace-check] Compiling graphica v2.1.0 (https://github.com/alphal00p/symbolica?rev=a277a8dadbaae5a8d6605f2f381991a601e1f345#a277a8da)
  411. 28.14 s [gammaloop-workspace-check] Checking test-log v0.2.20
  412. 31.00 s [gammaloop-workspace-check] Checking statrs v0.16.1
  413. 32.32 s [gammaloop-workspace-check] Checking momtrop v0.3.0
  414. 35.39 s [gammaloop-workspace-check] Compiling pyo3-macros v0.28.3
  415. 36.27 s [gammaloop-workspace-check] Compiling pyo3-stub-gen-derive v0.17.2
  416. 37.28 s [gammaloop-workspace-check] Checking gungraun v0.18.2
  417. 45.11 s [gammaloop-workspace-check] Checking pyo3-stub-gen v0.17.2
  418. 53.50 s [gammaloop-workspace-check] Checking symbolica-utils v0.1.0 (/build/source/crates/symbolica-utils)
  419. 53.50 s [gammaloop-workspace-check] Checking spenso-macros v0.3.2 (/build/source/crates/spenso-macros)
  420. 250.71 s [gammaloop-workspace-check] Compiling gammaloop-workspace-hack v0.1.0 (/build/source/crates/gammaloop-workspace-hack)
  421. 250.99 s [gammaloop-workspace-check] Checking linnet v0.17.0 (/build/source/crates/linnet)
  422. 254.20 s [gammaloop-workspace-check] Checking spenso v0.6.0 (/build/source/crates/spenso)
  423. 254.34 s [gammaloop-workspace-check] Checking linnet-py v0.1.0 (/build/source/crates/linnet-py)
  424. 254.34 s [gammaloop-workspace-check] Checking linnest v0.1.0 (/build/source/crates/linnest)
  425. 259.02 s [gammaloop-workspace-check] Checking idenso v0.3.0 (/build/source/crates/idenso)
  426. 259.02 s [gammaloop-workspace-check] Checking gammaloop-tracing-filter v0.1.0 (/build/source/crates/gammaloop-tracing-filter)
  427. 260.46 s [gammaloop-workspace-check] Checking spenso-hep-lib v0.1.7 (/build/source/crates/spenso-hep-lib)
  428. 260.60 s [gammaloop-workspace-check] Checking spynso3 v0.1.2 (/build/source/crates/spynso3)
  429. 291.59 s [gammaloop-workspace-check] error[E0609]: no field `lmb_channel_id` on type `CutInfo`
  430. 291.59 s [gammaloop-workspace-check] --> tests/tests/test_runs/utils.rs:568:36
  431. 291.59 s [gammaloop-workspace-check] |
  432. 291.59 s [gammaloop-workspace-check] 568 | event.cut_info.lmb_channel_id,
  433. 291.59 s [gammaloop-workspace-check] | ^^^^^^^^^^^^^^ unknown field
  434. 291.59 s [gammaloop-workspace-check] |
  435. 291.59 s [gammaloop-workspace-check] = note: available fields are: `particle_pdgs`, `cut_id`, `graph_id`, `graph_group_id`, `orientation_id` ... and 2 others
  436. 291.59 s [gammaloop-workspace-check]
  437. 291.59 s [gammaloop-workspace-check] error[E0609]: no field `lmb_channel_id` on type `CutInfo`
  438. 291.59 s [gammaloop-workspace-check] --> tests/tests/test_runs/utils.rs:580:36
  439. 291.59 s [gammaloop-workspace-check] |
  440. 291.59 s [gammaloop-workspace-check] 580 | event.cut_info.lmb_channel_id,
  441. 291.59 s [gammaloop-workspace-check] | ^^^^^^^^^^^^^^ unknown field
  442. 291.59 s [gammaloop-workspace-check] |
  443. 291.59 s [gammaloop-workspace-check] = note: available fields are: `particle_pdgs`, `cut_id`, `graph_id`, `graph_group_id`, `orientation_id` ... and 2 others
  444. 291.59 s [gammaloop-workspace-check]
  445. 292.16 s [gammaloop-workspace-check] For more information about this error, try `rustc --explain E0609`.
  446. 292.18 s [gammaloop-workspace-check] error: could not compile `gammaloop-integration-tests` (test "test_runs") due to 2 previous errors
  447. 292.80 s Progress: 0 of 1 built (1 failed)
  448. 292.80 s Failed to build gammaloop-workspace-check after 4m49s
  449. 292.81 s Cannot build '/nix/store/01wv2cvlxmkwk15rfvw73pimfsfm321c-gammaloop-workspace-check-0.1.0.drv'.
  450. 292.81 s Reason: builder failed with exit code 101.
  451. 292.81 s Output paths:
  452. 292.81 s /nix/store/yxmn18c7b66m3gq4ry6q3s28b9ipm4q2-gammaloop-workspace-check-0.1.0
  453. 292.81 s Last 443 log lines:
  454. 292.81 s > Running phase: unpackPhase
  455. 292.81 s > unpacking source archive /nix/store/p4kvydb95jp9jm0ylgbb2r217q4zaj95-source
  456. 292.81 s > source root is source
  457. 292.81 s > Running phase: patchPhase
  458. 292.81 s > Executing configureCargoCommonVars
  459. 292.81 s > decompressing cargo artifacts from /nix/store/50vpxlcgfxf2d57i27v3d10zjwxxbm2r-gammaloop-workspace-deps-deps-0.1.0/target.tar.zst to target
  460. 292.81 s > Running phase: updateAutotoolsGnuConfigScriptsPhase
  461. 292.81 s > Running phase: configurePhase
  462. 292.81 s > will append /build/source/.cargo-home/config.toml with contents of /nix/store/5drf77x6km4ky7gwlrzdx9bbd6fz09g3-vendor-cargo-deps/config.toml
  463. 292.81 s > default configurePhase, nothing to do
  464. 292.81 s > Running phase: buildPhase
  465. 292.81 s > +++ command cargo --version
  466. 292.81 s > cargo 1.97.0 (c980f4866 2026-06-30)
  467. 292.81 s > +++ command cargo check --profile ci-optim --locked --workspace --features gammaloop-tracing-filter/clap,gammaloop-tracing-filter/symbolica,idenso/bincode,idenso/reference-cases,linnet/bincode,linnet/drawing,linnet/rkyv,linnet/serde,linnet/symbolica,spenso-macros/shadowing,spenso/shadowing,symbolica/tracing_max_level_info,three-dimensional-reps/display,three-dimensional-reps/eval,three-dimensional-reps/serde --all-targets
  468. 292.81 s > Checking cfg-if v1.0.4
  469. 292.81 s > Checking memchr v2.8.0
  470. 292.81 s > Checking once_cell v1.21.4
  471. 292.81 s > Checking either v1.15.0
  472. 292.81 s > Checking serde_core v1.0.228
  473. 292.81 s > Checking libc v0.2.186
  474. 292.81 s > Checking libm v0.2.16
  475. 292.81 s > Checking itoa v1.0.18
  476. 292.81 s > Checking log v0.4.29
  477. 292.81 s > Checking regex-syntax v0.8.10
  478. 292.81 s > Checking zerocopy v0.8.48
  479. 292.81 s > Checking crossbeam-utils v0.8.21
  480. 292.81 s > Checking equivalent v1.0.2
  481. 292.81 s > Checking zmij v1.0.21
  482. 292.81 s > Checking bytemuck v1.25.0
  483. 292.81 s > Checking lazy_static v1.5.0
  484. 292.81 s > Compiling target-lexicon v0.13.5
  485. 292.81 s > Checking arrayvec v0.7.6
  486. 292.81 s > Checking powerfmt v0.2.0
  487. 292.81 s > Checking time-core v0.1.8
  488. 292.81 s > Checking pin-project-lite v0.2.17
  489. 292.81 s > Checking itertools v0.14.0
  490. 292.81 s > Checking num-conv v0.2.1
  491. 292.81 s > Checking safe_arch v0.7.4
  492. 292.81 s > Checking num_threads v0.1.7
  493. 292.81 s > Checking tracing-core v0.1.36
  494. 292.81 s > Checking deranged v0.5.8
  495. 292.81 s > Checking foldhash v0.2.0
  496. 292.81 s > Checking allocator-api2 v0.2.21
  497. 292.81 s > Checking const-random v0.1.18
  498. 292.81 s > Checking nu-ansi-term v0.50.3
  499. 292.81 s > Checking static_assertions v1.1.0
  500. 292.81 s > Checking winnow v1.0.2
  501. 292.81 s > Checking aho-corasick v1.1.4
  502. 292.81 s > Checking unty v0.0.4
  503. 292.81 s > Checking crossbeam-epoch v0.9.18
  504. 292.81 s > Checking wide v0.7.33
  505. 292.81 s > Checking safe_arch v1.0.0
  506. 292.81 s > Checking hashbrown v0.16.1
  507. 292.81 s > Checking sharded-slab v0.1.7
  508. 292.81 s > Checking tracing v0.1.44
  509. 292.81 s > Checking crossbeam-deque v0.8.6
  510. 292.81 s > Checking rayon-core v1.13.0
  511. 292.81 s > Checking tracing-log v0.2.0
  512. 292.81 s > Checking thread_local v1.1.9
  513. 292.81 s > Checking indenter v0.3.4
  514. 292.81 s > Checking az v1.3.0
  515. 292.81 s > Checking toml_writer v1.1.1+spec-1.1.0
  516. 292.81 s > Checking wide v1.3.0
  517. 292.81 s > Checking num-traits v0.2.19
  518. 292.81 s > Checking rayon v1.12.0
  519. 292.81 s > Compiling phf_shared v0.11.3
  520. 292.81 s > Checking anyhow v1.0.102
  521. 292.81 s > Checking alloc-no-stdlib v2.0.4
  522. 292.81 s > Checking getrandom v0.3.4
  523. 292.81 s > Checking time v0.3.47
  524. 292.81 s > Checking gmp-mpfr-sys v1.7.1
  525. 292.81 s > Checking rawpointer v0.2.1
  526. 292.81 s > Checking rand_core v0.9.5
  527. 292.81 s > Checking utf8parse v0.2.2
  528. 292.81 s > Checking dyn-clone v1.0.20
  529. 292.81 s > Checking matrixmultiply v0.3.10
  530. 292.81 s > Checking toml_parser v1.1.2+spec-1.1.0
  531. 292.81 s > Checking anstyle-parse v1.0.0
  532. 292.81 s > Checking alloc-stdlib v0.2.2
  533. 292.81 s > Checking is_terminal_polyfill v1.70.2
  534. 292.81 s > Checking anstyle-query v1.1.5
  535. 292.81 s > Compiling pyo3-build-config v0.28.3
  536. 292.81 s > Checking colorchoice v1.0.5
  537. 292.81 s > Checking anstyle v1.0.14
  538. 292.81 s > Checking colored v3.1.1
  539. 292.81 s > Compiling phf_generator v0.11.3
  540. 292.81 s > Checking eyre v0.6.12
  541. 292.81 s > Checking unicode-width v0.2.2
  542. 292.81 s > Checking serde v1.0.228
  543. 292.81 s > Checking serde_json v1.0.149
  544. 292.81 s > Checking bitflags v2.11.1
  545. 292.81 s > Checking serde_spanned v1.1.1
  546. 292.81 s > Checking approx v0.5.1
  547. 292.81 s > Checking num-integer v0.1.46
  548. 292.81 s > Checking toml_datetime v1.1.1+spec-1.1.0
  549. 292.81 s > Checking regex-automata v0.4.14
  550. 292.81 s > Checking anstream v1.0.0
  551. 292.81 s > Checking bitflags v1.3.2
  552. 292.81 s > Compiling phf_codegen v0.11.3
  553. 292.81 s > Checking brotli-decompressor v5.0.0
  554. 292.81 s > Checking wasmtime-jit-icache-coherence v34.0.2
  555. 292.81 s > Checking region v3.0.2
  556. 292.81 s > Checking hugepage-rs v0.1.1
  557. 292.81 s > Checking spec_math v0.1.6
  558. 292.81 s > Checking toml v1.1.2+spec-1.1.0
  559. 292.81 s > Checking inventory v0.3.24
  560. 292.81 s > Checking thiserror v2.0.18
  561. 292.81 s > Compiling getopts v0.2.24
  562. 292.81 s > Checking libloading v0.9.0
  563. 292.81 s > Checking bytes v1.11.1
  564. 292.81 s > Checking self_cell v1.2.2
  565. 292.81 s > Checking tinyjson v2.5.1
  566. 292.81 s > Checking smallvec v1.15.1
  567. 292.81 s > Checking num-complex v0.4.6
  568. 292.81 s > Checking bincode v2.0.1
  569. 292.81 s > Checking tracing-serde v0.2.0
  570. 292.81 s > Checking smartstring v1.0.1
  571. 292.81 s > Checking append-only-vec v0.1.8
  572. 292.81 s > Checking byteorder v1.5.0
  573. 292.81 s > Compiling unicode_names2_generator v1.3.0
  574. 292.81 s > Compiling unic-common v0.9.0
  575. 292.81 s > Compiling unic-char-range v0.9.0
  576. 292.81 s > Checking linux-raw-sys v0.12.1
  577. 292.81 s > Compiling unic-ucd-version v0.9.0
  578. 292.81 s > Checking simba v0.9.1
  579. 292.81 s > Compiling unic-char-property v0.9.0
  580. 292.81 s > Compiling is-macro v0.3.7
  581. 292.81 s > Checking brotli v8.0.2
  582. 292.81 s > Compiling rustpython-parser-vendored v0.4.0
  583. 292.81 s > Checking iana-time-zone v0.1.65
  584. 292.81 s > Compiling rustpython-parser v0.4.0
  585. 292.81 s > Compiling phf v0.11.3
  586. 292.81 s > Checking rustc-hash v2.1.2
  587. 292.81 s > Checking chrono v0.4.44
  588. 292.81 s > Checking rustix v1.1.4
  589. 292.81 s > Compiling unic-emoji-char v0.9.0
  590. 292.81 s > Compiling unic-ucd-ident v0.9.0
  591. 292.81 s > Checking ndarray v0.17.2
  592. 292.81 s > Compiling rustc-hash v1.1.0
  593. 292.81 s > Compiling lalrpop-util v0.20.2
  594. 292.81 s > Checking rug v1.30.0
  595. 292.81 s > Checking unicode-segmentation v1.13.2
  596. 292.81 s > Compiling symbolica v2.2.0 (https://github.com/alphal00p/symbolica?rev=a277a8dadbaae5a8d6605f2f381991a601e1f345#a277a8da)
  597. 292.81 s > Checking typenum v1.20.0
  598. 292.81 s > Checking getrandom v0.2.17
  599. 292.81 s > Checking scopeguard v1.2.0
  600. 292.81 s > Checking parking_lot_core v0.9.12
  601. 292.81 s > Checking lock_api v0.4.14
  602. 292.81 s > Checking unicode-ident v1.0.24
  603. 292.81 s > Checking hashbrown v0.17.0
  604. 292.81 s > Checking errno v0.3.14
  605. 292.81 s > Checking parking_lot v0.12.5
  606. 292.81 s > Checking strsim v0.11.1
  607. 292.81 s > Checking unicase v2.9.0
  608. 292.81 s > Checking clap_lex v1.1.0
  609. 292.81 s > Checking ppv-lite86 v0.2.21
  610. 292.81 s > Checking ahash v0.8.12
  611. 292.81 s > Checking signal-hook-registry v1.4.8
  612. 292.81 s > Checking vte v0.14.1
  613. 292.81 s > Checking same-file v1.0.6
  614. 292.81 s > Checking walkdir v2.5.0
  615. 292.81 s > Checking generic-array v0.14.7
  616. 292.81 s > Checking signal-hook v0.3.18
  617. 292.81 s > Checking half v2.7.1
  618. 292.81 s > Checking mio v1.2.0
  619. 292.81 s > Checking indexmap v2.14.0
  620. 292.81 s > Checking rand_chacha v0.9.0
  621. 292.81 s > Checking minimal-lexical v0.2.1
  622. 292.81 s > Checking matchers v0.2.0
  623. 292.81 s > Checking rand v0.9.4
  624. 292.81 s > Checking tracing-subscriber v0.3.23
  625. 292.81 s > Checking regex v1.12.3
  626. 292.81 s > Checking ciborium-io v0.2.2
  627. 292.81 s > Checking signal-hook-mio v0.2.5
  628. 292.81 s > Checking ciborium-ll v0.2.2
  629. 292.81 s > Checking block-buffer v0.10.4
  630. 292.81 s > Checking crypto-common v0.1.7
  631. 292.81 s > Checking terminal_size v0.4.4
  632. 292.81 s > Checking nom v7.1.3
  633. 292.81 s > Checking digest v0.10.7
  634. 292.81 s > Checking derive_more v2.1.1
  635. 292.81 s > Checking clap_builder v4.6.0
  636. 292.81 s > Checking num-bigint v0.4.6
  637. 292.81 s > Checking console v0.16.3
  638. 292.81 s > Checking bstr v1.12.1
  639. 292.81 s > Checking winnow v0.7.15
  640. 292.81 s > Checking symjit v2.21.0
  641. 292.81 s > Checking linux-raw-sys v0.4.15
  642. 292.81 s > Checking cpufeatures v0.2.17
  643. 292.81 s > Checking sha2 v0.10.9
  644. 292.81 s > Checking rustix v0.38.44
  645. 292.81 s > Checking globset v0.4.18
  646. 292.81 s > Checking ciborium v0.2.2
  647. 292.81 s > Checking rand_core v0.6.4
  648. 292.81 s > Checking getrandom v0.4.2
  649. 292.81 s > Checking fnv v1.0.7
  650. 292.81 s > Checking fastrand v2.4.1
  651. 292.81 s > Checking xprec v0.2.2
  652. 292.81 s > Checking plotters-backend v0.3.7
  653. 292.81 s > Compiling unicode_names2 v1.3.0
  654. 292.81 s > Checking ansitok v0.3.0
  655. 292.81 s > Checking rust-embed-utils v8.11.0
  656. 292.81 s > Checking serde_spanned v0.6.9
  657. 292.81 s > Checking tempfile v3.27.0
  658. 292.81 s > Checking plotters-svg v0.3.7
  659. 292.81 s > Checking toml_datetime v0.6.11
  660. 292.81 s > Checking itertools v0.10.5
  661. 292.81 s > Checking tap v1.0.1
  662. 292.81 s > Checking toml_write v0.1.2
  663. 292.81 s > Checking cast v0.3.0
  664. 292.81 s > Checking plotters v0.3.7
  665. 292.81 s > Checking crossterm v0.28.1
  666. 292.81 s > Checking wyz v0.5.1
  667. 292.81 s > Checking rand_chacha v0.3.1
  668. 292.81 s > Checking radium v0.7.0
  669. 292.81 s > Checking ansi-str v0.9.0
  670. 292.81 s > Checking typeid v1.0.3
  671. 292.81 s > Checking similar v2.7.0
  672. 292.81 s > Checking tinytemplate v1.2.1
  673. 292.81 s > Checking clap v4.6.1
  674. 292.81 s > Checking is-terminal v0.4.17
  675. 292.81 s > Checking oorandom v11.1.5
  676. 292.81 s > Checking bytecount v0.6.9
  677. 292.81 s > Checking toml_edit v0.22.27
  678. 292.81 s > Checking funty v2.0.0
  679. 292.81 s > Checking anes v0.1.6
  680. 292.81 s > Checking rand v0.8.6
  681. 292.81 s > Checking papergrid v0.17.0
  682. 292.81 s > Checking ron v0.12.1
  683. 292.81 s > Checking testing_table v0.3.0
  684. 292.81 s > Checking toml_edit v0.25.11+spec-1.1.0
  685. 292.81 s > Checking bitvec v1.0.1
  686. 292.81 s > Checking env_filter v1.0.1
  687. 292.81 s > Checking uncased v0.9.10
  688. 292.81 s > Checking jiff v0.2.24
  689. 292.81 s > Checking ptr_meta v0.1.4
  690. 292.81 s > Compiling pyo3-macros-backend v0.28.3
  691. 292.81 s > Compiling pyo3-ffi v0.28.3
  692. 292.81 s > Compiling pyo3 v0.28.3
  693. 292.81 s > Compiling numpy v0.28.0
  694. 292.81 s > Checking ucd-trie v0.1.7
  695. 292.81 s > Checking criterion-plot v0.5.0
  696. 292.81 s > Checking simdutf8 v0.1.5
  697. 292.81 s > Checking ahash v0.7.8
  698. 292.81 s > Checking tabled v0.20.0
  699. 292.81 s > Checking pest v2.8.6
  700. 292.81 s > Checking bytecheck v0.6.12
  701. 292.81 s > Checking hashbrown v0.12.3
  702. 292.81 s > Checking approx v0.4.0
  703. 292.81 s > Checking seahash v4.1.0
  704. 292.81 s > Checking toml v0.8.23
  705. 292.81 s > Checking criterion v0.5.1
  706. 292.81 s > Checking cgmath v0.18.0
  707. 292.81 s > Checking insta v1.47.2
  708. 292.81 s > Checking num-rational v0.4.2
  709. 292.81 s > Checking rend v0.4.2
  710. 292.81 s > Checking num-iter v0.1.45
  711. 292.81 s > Checking figment v0.10.19
  712. 292.81 s > Checking ref-ops v0.2.5
  713. 292.81 s > Checking num v0.4.3
  714. 292.81 s > Checking rand_xoshiro v0.6.0
  715. 292.81 s > Checking features v0.10.0
  716. 292.81 s > Checking gat-lending-iterator v0.1.8
  717. 292.81 s > Checking constcat v0.5.1
  718. 292.81 s > Checking colored v2.2.0
  719. 292.81 s > Checking constant_time_eq v0.4.2
  720. 292.81 s > Checking cpufeatures v0.3.0
  721. 292.81 s > Checking arrayref v0.3.9
  722. 292.81 s > Checking base64 v0.22.1
  723. 292.81 s > Checking dot-parser v0.5.1
  724. 292.81 s > Checking joinery v2.1.0
  725. 292.81 s > Checking blake3 v1.8.5
  726. 292.81 s > Checking siphasher v1.0.2
  727. 292.81 s > Checking subprocess v0.2.15
  728. 292.81 s > Checking titlecase v2.2.1
  729. 292.81 s > Checking phf_shared v0.13.1
  730. 292.81 s > Checking rust_lisp v0.18.0
  731. 292.81 s > Compiling vakint v0.1.2 (/build/source/crates/vakint)
  732. 292.81 s > Checking phf v0.13.1
  733. 292.81 s > Checking version-compare v0.2.1
  734. 292.81 s > Compiling rustpython-parser-core v0.4.0
  735. 292.81 s > Checking xpct v0.5.1
  736. 292.81 s > Checking ryu v1.0.23
  737. 292.81 s > Checking castaway v0.2.4
  738. 292.81 s > Compiling rustpython-ast v0.4.0
  739. 292.81 s > Checking toml_datetime v0.7.5+spec-1.1.0
  740. 292.81 s > Checking strum v0.27.2
  741. 292.81 s > Checking unicode-truncate v2.0.1
  742. 292.81 s > Checking compact_str v0.9.0
  743. 292.81 s > Checking string-template-plus v0.4.3
  744. 292.81 s > Checking kasuari v0.4.12
  745. 292.81 s > Checking lru v0.16.4
  746. 292.81 s > Checking toml v0.9.12+spec-1.1.0
  747. 292.81 s > Checking vte v0.15.0
  748. 292.81 s > Checking portable-atomic v1.13.1
  749. 292.81 s > Checking unit-prefix v0.5.2
  750. 292.81 s > Checking rand_distr v0.4.3
  751. 292.81 s > Checking simba v0.6.0
  752. 292.81 s > Checking line-clipping v0.3.7
  753. 292.81 s > Checking vt100 v0.16.2
  754. 292.81 s > Compiling three-dimensional-reps v0.1.0 (/build/source/crates/three-dimensional-reps)
  755. 292.81 s > Checking adler2 v2.0.1
  756. 292.81 s > Checking gimli v0.32.3
  757. 292.81 s > Checking miniz_oxide v0.8.9
  758. 292.81 s > Checking thiserror v1.0.69
  759. 292.81 s > Checking derive_builder v0.11.2
  760. 292.81 s > Checking ratatui-core v0.1.0
  761. 292.81 s > Checking crossterm v0.29.0
  762. 292.81 s > Checking owo-colors v4.3.0
  763. 292.81 s > Checking object v0.37.3
  764. 292.81 s > Checking tracing-error v0.2.1
  765. 292.81 s > Checking typed-index-collections v3.5.0
  766. 292.81 s > Checking indicatif v0.18.4
  767. 292.81 s > Checking serde-big-array v0.5.1
  768. 292.81 s > Checking amd v0.2.2
  769. 292.81 s > Checking itertools v0.11.0
  770. 292.81 s > Compiling gammaloop-tracing-filter-macros v0.1.0 (/build/source/crates/gammaloop-tracing-filter-macros)
  771. 292.81 s > Checking env_logger v0.11.10
  772. 292.81 s > Checking rustc-demangle v0.1.27
  773. 292.81 s > Checking option-ext v0.2.0
  774. 292.81 s > Checking ref-cast v1.0.25
  775. 292.81 s > Checking nix v0.31.2
  776. 292.81 s > Checking dirs-sys v0.5.0
  777. 292.81 s > Checking integer-sqrt v0.1.5
  778. 292.81 s > Checking brotli-decompressor v4.0.3
  779. 292.81 s > Checking crossbeam-channel v0.5.15
  780. 292.81 s > Checking itertools v0.12.1
  781. 292.81 s > Compiling gammalooprs v0.3.4 (/build/source/crates/gammalooprs)
  782. 292.81 s > Checking unsafe-libyaml v0.2.11
  783. 292.81 s > Checking color-spantrace v0.3.0
  784. 292.81 s > Checking symlink v0.1.0
  785. 292.81 s > Checking rkyv v0.7.46
  786. 292.81 s > Checking dirs v6.0.0
  787. 292.81 s > Checking ratatui-widgets v0.3.0
  788. 292.81 s > Checking ratatui-crossterm v0.1.0
  789. 292.81 s > Checking tracing-appender v0.2.5
  790. 292.81 s > Checking ctrlc v3.5.2
  791. 292.81 s > Checking include_dir v0.7.4
  792. 292.81 s > Checking clarabel v0.11.1
  793. 292.81 s > Checking pathfinding v4.15.0
  794. 292.81 s > Checking tracing-indicatif v0.3.14
  795. 292.81 s > Checking schemars v1.2.1
  796. 292.81 s > Checking brotli v7.0.0
  797. 292.81 s > Checking serde_yaml v0.9.34+deprecated
  798. 292.81 s > Checking slotmap v1.1.1
  799. 292.81 s > Checking addr2line v0.25.1
  800. 292.81 s > Checking json5 v0.4.1
  801. 292.81 s > Compiling numerica v2.2.0 (https://github.com/alphal00p/symbolica?rev=a277a8dadbaae5a8d6605f2f381991a601e1f345#a277a8da)
  802. 292.81 s > Checking ratatui-macros v0.7.0
  803. 292.81 s > Checking vectorize v0.2.0
  804. 292.81 s > Checking ringbuffer v0.16.0
  805. 292.81 s > Checking ratatui v0.30.0
  806. 292.81 s > Checking base62 v2.2.4
  807. 292.81 s > Checking rust-embed v8.11.0
  808. 292.81 s > Checking clap_complete v4.6.3
  809. 292.81 s > Checking fd-lock v4.0.4
  810. 292.81 s > Checking strip-ansi-escapes v0.2.1
  811. 292.81 s > Compiling gammaloop-api v0.1.0 (/build/source/crates/gammaloop-api)
  812. 292.81 s > Checking itertools v0.13.0
  813. 292.81 s > Checking strum v0.26.3
  814. 292.81 s > Checking sysinfo v0.33.1
  815. 292.81 s > Checking shlex v1.3.0
  816. 292.81 s > Checking futures-task v0.3.32
  817. 292.81 s > Checking clap_complete_nushell v4.6.0
  818. 292.81 s > Checking slab v0.4.12
  819. 292.81 s > Checking futures-core v0.3.32
  820. 292.81 s > Checking sdd v3.0.10
  821. 292.81 s > Compiling gammaloop-integration-tests v0.1.0 (/build/source/tests)
  822. 292.81 s > Checking futures-util v0.3.32
  823. 292.81 s > Compiling test-log-core v0.2.20
  824. 292.81 s > Checking scc v2.4.0
  825. 292.81 s > Compiling rustc_version v0.4.1
  826. 292.81 s > Checking which v8.0.2
  827. 292.81 s > Checking bincode v1.3.3
  828. 292.81 s > Compiling gungraun-runner v0.18.2
  829. 292.81 s > Checking backtrace v0.3.76
  830. 292.81 s > Checking proc-macro2 v1.0.106
  831. 292.81 s > Checking nalgebra v0.29.0
  832. 292.81 s > Checking reedline v0.42.0
  833. 292.81 s > Compiling gungraun-macros v0.8.0
  834. 292.81 s > Checking color-eyre v0.6.5
  835. 292.81 s > Checking quote v1.0.45
  836. 292.81 s > Checking base64 v0.21.7
  837. 292.81 s > Checking maplit v1.0.2
  838. 292.81 s > Compiling iai-callgrind-runner v0.14.2
  839. 292.81 s > Checking kurbo v0.13.0
  840. 292.81 s > Checking ron v0.8.1
  841. 292.81 s > Checking wait-timeout v0.2.1
  842. 292.81 s > Checking quick-error v1.2.3
  843. 292.81 s > Checking futures-executor v0.3.32
  844. 292.81 s > Checking bit-vec v0.8.0
  845. 292.81 s > Compiling iai-callgrind v0.14.2
  846. 292.81 s > Checking rusty-fork v0.3.1
  847. 292.81 s > Checking serial_test v3.4.0
  848. 292.81 s > Compiling test-log-macros v0.2.20
  849. 292.81 s > Checking bit-set v0.8.0
  850. 292.81 s > Checking syn v2.0.117
  851. 292.81 s > Compiling iai-callgrind-macros v0.5.1
  852. 292.81 s > Checking rand_xorshift v0.4.0
  853. 292.81 s > Checking console v0.15.11
  854. 292.81 s > Checking unarray v0.1.4
  855. 292.81 s > Checking pathdiff v0.2.3
  856. 292.81 s > Checking proptest v1.11.0
  857. 292.81 s > Checking clinnet v0.1.8 (/build/source/crates/clinnet)
  858. 292.81 s > Checking similar-asserts v1.7.0
  859. 292.81 s > Checking kurvst v0.1.0 (/build/source/crates/kurvst)
  860. 292.81 s > Compiling graphica v2.1.0 (https://github.com/alphal00p/symbolica?rev=a277a8dadbaae5a8d6605f2f381991a601e1f345#a277a8da)
  861. 292.81 s > Checking test-log v0.2.20
  862. 292.81 s > Checking statrs v0.16.1
  863. 292.81 s > Checking momtrop v0.3.0
  864. 292.81 s > Compiling pyo3-macros v0.28.3
  865. 292.81 s > Compiling pyo3-stub-gen-derive v0.17.2
  866. 292.81 s > Checking gungraun v0.18.2
  867. 292.81 s > Checking pyo3-stub-gen v0.17.2
  868. 292.81 s > Checking symbolica-utils v0.1.0 (/build/source/crates/symbolica-utils)
  869. 292.81 s > Checking spenso-macros v0.3.2 (/build/source/crates/spenso-macros)
  870. 292.81 s > Compiling gammaloop-workspace-hack v0.1.0 (/build/source/crates/gammaloop-workspace-hack)
  871. 292.81 s > Checking linnet v0.17.0 (/build/source/crates/linnet)
  872. 292.81 s > Checking spenso v0.6.0 (/build/source/crates/spenso)
  873. 292.81 s > Checking linnet-py v0.1.0 (/build/source/crates/linnet-py)
  874. 292.81 s > Checking linnest v0.1.0 (/build/source/crates/linnest)
  875. 292.81 s > Checking idenso v0.3.0 (/build/source/crates/idenso)
  876. 292.81 s > Checking gammaloop-tracing-filter v0.1.0 (/build/source/crates/gammaloop-tracing-filter)
  877. 292.81 s > Checking spenso-hep-lib v0.1.7 (/build/source/crates/spenso-hep-lib)
  878. 292.81 s > Checking spynso3 v0.1.2 (/build/source/crates/spynso3)
  879. 292.81 s > error[E0609]: no field `lmb_channel_id` on type `CutInfo`
  880. 292.81 s > --> tests/tests/test_runs/utils.rs:568:36
  881. 292.81 s > |
  882. 292.81 s > 568 | event.cut_info.lmb_channel_id,
  883. 292.81 s > | ^^^^^^^^^^^^^^ unknown field
  884. 292.81 s > |
  885. 292.81 s > = note: available fields are: `particle_pdgs`, `cut_id`, `graph_id`, `graph_group_id`, `orientation_id` ... and 2 others
  886. 292.81 s >
  887. 292.81 s > error[E0609]: no field `lmb_channel_id` on type `CutInfo`
  888. 292.81 s > --> tests/tests/test_runs/utils.rs:580:36
  889. 292.81 s > |
  890. 292.81 s > 580 | event.cut_info.lmb_channel_id,
  891. 292.81 s > | ^^^^^^^^^^^^^^ unknown field
  892. 292.81 s > |
  893. 292.81 s > = note: available fields are: `particle_pdgs`, `cut_id`, `graph_id`, `graph_group_id`, `orientation_id` ... and 2 others
  894. 292.81 s >
  895. 292.81 s > For more information about this error, try `rustc --explain E0609`.
  896. 292.81 s > error: could not compile `gammaloop-integration-tests` (test "test_runs") due to 2 previous errors
  897. 292.81 s For full logs, run:
  898. 292.81 s nix log /nix/store/01wv2cvlxmkwk15rfvw73pimfsfm321c-gammaloop-workspace-check-0.1.0.drv
  899. 292.86 s Build failed.