build packages.x86_64-linux.crate-test-binaries-gammaloop-integration-tests

Reproduce this run
Retry Run
  1. 0.00 s $ /nix/store/9ypz3flqsrl5xl495mm8h645gadjsxi1-coreutils-9.11/bin/timeout --kill-after=15s 7200s /nix/store/23zk8sgzamrbmj1fday15szf7f2279s8-nix-2.34.7/bin/nix --extra-experimental-features nix-command --extra-experimental-features flakes --log-format internal-json build --no-link --print-out-paths git+https://github.com/alphal00p/gammaloop?ref=advanced_sampling&rev=f2f64fb17dd5dab588eca298dc61f1100fa4962d&shallow=1#packages.x86_64-linux.crate-test-binaries-gammaloop-integration-tests --print-build-logs
  2. 3.44 s
  3. 4.13 s Downloading cached gammaloop-crate-test-dependencies-ea99827d76e4dd39-deps from https://cache.nix-ci.com
  4. 4.81 s Downloaded cached gammaloop-crate-test-dependencies-ea99827d76e4dd39-deps (97.4 MiB) in 685ms
  5. 4.82 s Progress: 0 of 4 built, 1 of 5 downloaded from cache
  6. 4.82 s Downloading cached gammaloop-crate-test-dependencies-6e86b9f305aafb81-inputs from https://cache.nix-ci.com
  7. 19.53 s Downloaded cached gammaloop-crate-test-dependencies-6e86b9f305aafb81-inputs (2.4 GiB) in 14.7s
  8. 19.53 s Progress: 0 of 4 built, 2 of 5 downloaded from cache
  9. 19.53 s Downloading cached gammaloop-crate-test-dependencies-6e86b9f305aafb81-deps from https://cache.nix-ci.com
  10. 20.22 s Downloaded cached gammaloop-crate-test-dependencies-6e86b9f305aafb81-deps (128.2 MiB) in 681ms
  11. 20.22 s Progress: 0 of 4 built, 3 of 5 downloaded from cache
  12. 20.22 s Downloading cached gammaloop-crate-test-dependencies-b8cda0d438c96d4f-inputs from https://cache.nix-ci.com
  13. 39.77 s Downloaded cached gammaloop-crate-test-dependencies-b8cda0d438c96d4f-inputs (3.2 GiB) in 19.5s
  14. 39.77 s Progress: 0 of 4 built, 4 of 5 downloaded from cache
  15. 39.77 s Downloading cached gammaloop-crate-test-dependencies-b8cda0d438c96d4f-deps from https://cache.nix-ci.com
  16. 39.96 s Downloaded cached gammaloop-crate-test-dependencies-b8cda0d438c96d4f-deps (30.1 MiB) in 193ms
  17. 39.96 s Progress: 0 of 4 built, 5 of 5 downloaded from cache
  18. 40.09 s Building /nix/store/8qfpa3i7833lrryp0gbl6gqn5zzh7f8y-gammaloop-crate-test-binaries-gammaloop-integration-tests-b8cda0d438c96d4f-inputs.drv
  19. 52.27 s [gammaloop-crate-test-binaries-gammaloop-integration-tests-b8cda0d438c96d4f-inputs:post-build] Uploading to the NixCI cache: /nix/store/548rf7h75y5ys59fazvil5ylvwiwvqka-gammaloop-crate-test-binaries-gammaloop-integration-tests-b8cda0d438c96d4f-inputs
  20. 52.31 s [gammaloop-crate-test-binaries-gammaloop-integration-tests-b8cda0d438c96d4f-inputs:post-build] warning: 'warn-short-path-literals' is deprecated, use 'lint-short-path-literals = ignore' instead
  21. 52.35 s [gammaloop-crate-test-binaries-gammaloop-integration-tests-b8cda0d438c96d4f-inputs:post-build] copying 1 paths...
  22. 52.35 s [gammaloop-crate-test-binaries-gammaloop-integration-tests-b8cda0d438c96d4f-inputs:post-build] copying path '/nix/store/548rf7h75y5ys59fazvil5ylvwiwvqka-gammaloop-crate-test-binaries-gammaloop-integration-tests-b8cda0d438c96d4f-inputs' to 'https://cache.nix-ci.com'...
  23. 190.89 s [gammaloop-crate-test-binaries-gammaloop-integration-tests-b8cda0d438c96d4f-inputs:post-build] warning: 'warn-short-path-literals' is deprecated, use 'lint-short-path-literals = ignore' instead
  24. 191.10 s [gammaloop-crate-test-binaries-gammaloop-integration-tests-b8cda0d438c96d4f-inputs:post-build] copying 1 paths...
  25. 191.10 s [gammaloop-crate-test-binaries-gammaloop-integration-tests-b8cda0d438c96d4f-inputs:post-build] copying path '/nix/store/8qfpa3i7833lrryp0gbl6gqn5zzh7f8y-gammaloop-crate-test-binaries-gammaloop-integration-tests-b8cda0d438c96d4f-inputs.drv' to 'https://cache.nix-ci.com'...
  26. 191.24 s Uploaded gammaloop-crate-test-binaries-gammaloop-integration-tests-b8cda0d438c96d4f-inputs in 2m18s
  27. 191.24 s Progress: 1 of 4 built, 5 of 5 downloaded from cache
  28. 191.24 s Built gammaloop-crate-test-binaries-gammaloop-integration-tests-b8cda0d438c96d4f-inputs in 2m31s
  29. 191.37 s Building /nix/store/r56whqs3zj9clz5fj8bc4m0bwgy8zlg2-gammaloop-crate-test-binaries-gammaloop-integration-tests-b8cda0d438c96d4f-deps-0.1.0.drv
  30. 191.43 s [gammaloop-crate-test-binaries-gammaloop-integration-tests-b8cda0d438c96d4f-deps] Phase: unpackPhase
  31. 191.44 s [gammaloop-crate-test-binaries-gammaloop-integration-tests-b8cda0d438c96d4f-deps] unpacking source archive /nix/store/mihhxhg81q7j5z719niswnivgvyvfkc5-source
  32. 191.56 s [gammaloop-crate-test-binaries-gammaloop-integration-tests-b8cda0d438c96d4f-deps] source root is source
  33. 191.58 s [gammaloop-crate-test-binaries-gammaloop-integration-tests-b8cda0d438c96d4f-deps] Phase: patchPhase
  34. 191.65 s [gammaloop-crate-test-binaries-gammaloop-integration-tests-b8cda0d438c96d4f-deps] Executing configureCargoCommonVars
  35. 191.65 s [gammaloop-crate-test-binaries-gammaloop-integration-tests-b8cda0d438c96d4f-deps] copying cargo artifacts from /nix/store/548rf7h75y5ys59fazvil5ylvwiwvqka-gammaloop-crate-test-binaries-gammaloop-integration-tests-b8cda0d438c96d4f-inputs/target to target
  36. 191.65 s [gammaloop-crate-test-binaries-gammaloop-integration-tests-b8cda0d438c96d4f-deps] will deep copy artifacts (instead of symlinking) as requested
  37. 194.10 s [gammaloop-crate-test-binaries-gammaloop-integration-tests-b8cda0d438c96d4f-deps] Phase: updateAutotoolsGnuConfigScriptsPhase
  38. 194.13 s [gammaloop-crate-test-binaries-gammaloop-integration-tests-b8cda0d438c96d4f-deps] Phase: configurePhase
  39. 194.13 s [gammaloop-crate-test-binaries-gammaloop-integration-tests-b8cda0d438c96d4f-deps] will append /build/source/.cargo-home/config.toml with contents of /nix/store/5drf77x6km4ky7gwlrzdx9bbd6fz09g3-vendor-cargo-deps/config.toml
  40. 194.13 s [gammaloop-crate-test-binaries-gammaloop-integration-tests-b8cda0d438c96d4f-deps] default configurePhase, nothing to do
  41. 194.13 s [gammaloop-crate-test-binaries-gammaloop-integration-tests-b8cda0d438c96d4f-deps] Phase: buildPhase
  42. 194.14 s [gammaloop-crate-test-binaries-gammaloop-integration-tests-b8cda0d438c96d4f-deps] +++ command cargo --version
  43. 194.14 s [gammaloop-crate-test-binaries-gammaloop-integration-tests-b8cda0d438c96d4f-deps] cargo 1.97.0 (c980f4866 2026-06-30)
  44. 194.14 s [gammaloop-crate-test-binaries-gammaloop-integration-tests-b8cda0d438c96d4f-deps] +++ command cargo test --profile ci-optim --no-run --offline -p gammaloop-integration-tests
  45. 194.56 s [gammaloop-crate-test-binaries-gammaloop-integration-tests-b8cda0d438c96d4f-deps] Compiling gammaloop-integration-tests v0.1.0 (/build/source/tests)
  46. 195.72 s [gammaloop-crate-test-binaries-gammaloop-integration-tests-b8cda0d438c96d4f-deps] error[E0609]: no field `lmb_channel_id` on type `CutInfo`
  47. 195.72 s [gammaloop-crate-test-binaries-gammaloop-integration-tests-b8cda0d438c96d4f-deps] --> tests/tests/test_runs/utils.rs:568:36
  48. 195.72 s [gammaloop-crate-test-binaries-gammaloop-integration-tests-b8cda0d438c96d4f-deps] |
  49. 195.72 s [gammaloop-crate-test-binaries-gammaloop-integration-tests-b8cda0d438c96d4f-deps] 568 | event.cut_info.lmb_channel_id,
  50. 195.72 s [gammaloop-crate-test-binaries-gammaloop-integration-tests-b8cda0d438c96d4f-deps] | ^^^^^^^^^^^^^^ unknown field
  51. 195.72 s [gammaloop-crate-test-binaries-gammaloop-integration-tests-b8cda0d438c96d4f-deps] |
  52. 195.72 s [gammaloop-crate-test-binaries-gammaloop-integration-tests-b8cda0d438c96d4f-deps] = note: available fields are: `particle_pdgs`, `cut_id`, `graph_id`, `graph_group_id`, `orientation_id` ... and 2 others
  53. 195.72 s [gammaloop-crate-test-binaries-gammaloop-integration-tests-b8cda0d438c96d4f-deps]
  54. 195.72 s [gammaloop-crate-test-binaries-gammaloop-integration-tests-b8cda0d438c96d4f-deps] error[E0609]: no field `lmb_channel_id` on type `CutInfo`
  55. 195.72 s [gammaloop-crate-test-binaries-gammaloop-integration-tests-b8cda0d438c96d4f-deps] --> tests/tests/test_runs/utils.rs:580:36
  56. 195.72 s [gammaloop-crate-test-binaries-gammaloop-integration-tests-b8cda0d438c96d4f-deps] |
  57. 195.72 s [gammaloop-crate-test-binaries-gammaloop-integration-tests-b8cda0d438c96d4f-deps] 580 | event.cut_info.lmb_channel_id,
  58. 195.72 s [gammaloop-crate-test-binaries-gammaloop-integration-tests-b8cda0d438c96d4f-deps] | ^^^^^^^^^^^^^^ unknown field
  59. 195.72 s [gammaloop-crate-test-binaries-gammaloop-integration-tests-b8cda0d438c96d4f-deps] |
  60. 195.72 s [gammaloop-crate-test-binaries-gammaloop-integration-tests-b8cda0d438c96d4f-deps] = note: available fields are: `particle_pdgs`, `cut_id`, `graph_id`, `graph_group_id`, `orientation_id` ... and 2 others
  61. 195.72 s [gammaloop-crate-test-binaries-gammaloop-integration-tests-b8cda0d438c96d4f-deps]
  62. 196.40 s [gammaloop-crate-test-binaries-gammaloop-integration-tests-b8cda0d438c96d4f-deps] For more information about this error, try `rustc --explain E0609`.
  63. 196.42 s [gammaloop-crate-test-binaries-gammaloop-integration-tests-b8cda0d438c96d4f-deps] error: could not compile `gammaloop-integration-tests` (test "test_runs") due to 2 previous errors
  64. 196.43 s [gammaloop-crate-test-binaries-gammaloop-integration-tests-b8cda0d438c96d4f-deps] warning: build failed, waiting for other jobs to finish...
  65. 288.23 s Progress: 1 of 3 built (1 failed), 5 of 5 downloaded from cache
  66. 288.23 s Failed to build gammaloop-crate-test-binaries-gammaloop-integration-tests-b8cda0d438c96d4f-deps after 1m36s
  67. 288.23 s error: Cannot build '/nix/store/r56whqs3zj9clz5fj8bc4m0bwgy8zlg2-gammaloop-crate-test-binaries-gammaloop-integration-tests-b8cda0d438c96d4f-deps-0.1.0.drv'.
  68. 288.23 s Reason: builder failed with exit code 101.
  69. 288.23 s Output paths:
  70. 288.23 s /nix/store/p7igf7a2rhg1ma117x5c7x9xx66jxvwc-gammaloop-crate-test-binaries-gammaloop-integration-tests-b8cda0d438c96d4f-deps-0.1.0
  71. 288.23 s Last 35 log lines:
  72. 288.23 s > Running phase: unpackPhase
  73. 288.23 s > unpacking source archive /nix/store/mihhxhg81q7j5z719niswnivgvyvfkc5-source
  74. 288.23 s > source root is source
  75. 288.23 s > Running phase: patchPhase
  76. 288.23 s > Executing configureCargoCommonVars
  77. 288.23 s > copying cargo artifacts from /nix/store/548rf7h75y5ys59fazvil5ylvwiwvqka-gammaloop-crate-test-binaries-gammaloop-integration-tests-b8cda0d438c96d4f-inputs/target to target
  78. 288.23 s > will deep copy artifacts (instead of symlinking) as requested
  79. 288.23 s > Running phase: updateAutotoolsGnuConfigScriptsPhase
  80. 288.23 s > Running phase: configurePhase
  81. 288.23 s > will append /build/source/.cargo-home/config.toml with contents of /nix/store/5drf77x6km4ky7gwlrzdx9bbd6fz09g3-vendor-cargo-deps/config.toml
  82. 288.23 s > default configurePhase, nothing to do
  83. 288.23 s > Running phase: buildPhase
  84. 288.23 s > +++ command cargo --version
  85. 288.23 s > cargo 1.97.0 (c980f4866 2026-06-30)
  86. 288.23 s > +++ command cargo test --profile ci-optim --no-run --offline -p gammaloop-integration-tests
  87. 288.23 s > Compiling gammaloop-integration-tests v0.1.0 (/build/source/tests)
  88. 288.23 s > error[E0609]: no field `lmb_channel_id` on type `CutInfo`
  89. 288.23 s > --> tests/tests/test_runs/utils.rs:568:36
  90. 288.23 s > |
  91. 288.23 s > 568 | event.cut_info.lmb_channel_id,
  92. 288.23 s > | ^^^^^^^^^^^^^^ unknown field
  93. 288.23 s > |
  94. 288.23 s > = note: available fields are: `particle_pdgs`, `cut_id`, `graph_id`, `graph_group_id`, `orientation_id` ... and 2 others
  95. 288.23 s >
  96. 288.23 s > error[E0609]: no field `lmb_channel_id` on type `CutInfo`
  97. 288.23 s > --> tests/tests/test_runs/utils.rs:580:36
  98. 288.23 s > |
  99. 288.23 s > 580 | event.cut_info.lmb_channel_id,
  100. 288.23 s > | ^^^^^^^^^^^^^^ unknown field
  101. 288.23 s > |
  102. 288.23 s > = note: available fields are: `particle_pdgs`, `cut_id`, `graph_id`, `graph_group_id`, `orientation_id` ... and 2 others
  103. 288.23 s >
  104. 288.23 s > For more information about this error, try `rustc --explain E0609`.
  105. 288.23 s > error: could not compile `gammaloop-integration-tests` (test "test_runs") due to 2 previous errors
  106. 288.23 s > warning: build failed, waiting for other jobs to finish...
  107. 288.23 s For full logs, run:
  108. 288.23 s nix log /nix/store/r56whqs3zj9clz5fj8bc4m0bwgy8zlg2-gammaloop-crate-test-binaries-gammaloop-integration-tests-b8cda0d438c96d4f-deps-0.1.0.drv
  109. 288.23 s error: Cannot build '/nix/store/2pp7ycfwws05qhcg479sg862xh1972cg-nix-ci-artifact-barrier-crate-test-binaries-gammaloop-integration-tests.drv'.
  110. 288.23 s Reason: 1 dependency failed.
  111. 288.23 s Output paths:
  112. 288.23 s /nix/store/ddzipgxyaif93wciqaaj78gifakzffaa-nix-ci-artifact-barrier-crate-test-binaries-gammaloop-integration-tests
  113. 288.23 s Build failed due to failed dependency
  114. 288.30 s Build failed.