0.00 s
$ /nix/store/9ypz3flqsrl5xl495mm8h645gadjsxi1-coreutils-9.11/bin/timeout --kill-after=15s 7200s /nix/store/23zk8sgzamrbmj1fday15szf7f2279s8-nix-2.34.7/bin/nix --extra-experimental-features nix-command --extra-experimental-features flakes --log-format internal-json build --no-link --print-out-paths git+https://github.com/alphal00p/gammaloop?ref=advanced_sampling&rev=f2f64fb17dd5dab588eca298dc61f1100fa4962d&shallow=1#packages.x86_64-linux.crate-test-binaries-python-api-gammaloop-integration-tests --print-build-logs
0.37 s
error (ignored): SQLite database '/var/cache/nix-ci-worker/eval-cache-v6/454083ca2d64c2bd9f46e959c6679698e2592f99823f5dd1778cef1bf40b2ddb.sqlite ' is busy
8.26 s
8.91 s
Downloading cached gammaloop-crate-test-dependencies-d6e55b48f8214f9c-inputs from https://cache.nix-ci.com
29.65 s
Downloaded cached gammaloop-crate-test-dependencies-d6e55b48f8214f9c-inputs (3.2 GiB) in 20.7s
29.65 s
Progress: 0 of 4 built, 1 of 2 downloaded from cache
29.65 s
Downloading cached gammaloop-crate-test-dependencies-d6e55b48f8214f9c-deps from https://cache.nix-ci.com
29.83 s
Downloaded cached gammaloop-crate-test-dependencies-d6e55b48f8214f9c-deps (30 MiB) in 177ms
29.83 s
Progress: 0 of 4 built, 2 of 2 downloaded from cache
29.97 s
Building /nix/store/bfvy4v2kk93g066fwak59pi5wliiwsw2-gammaloop-crate-test-binaries-gammaloop-integration-tests-d6e55b48f8214f9c-inputs.drv
40.37 s
[gammaloop-crate-test-binaries-gammaloop-integration-tests-d6e55b48f8214f9c-inputs:post-build] Uploading to the NixCI cache: /nix/store/39vrxj0mbhbqrjhjrl796xxkwaprja72-gammaloop-crate-test-binaries-gammaloop-integration-tests-d6e55b48f8214f9c-inputs
40.56 s
[gammaloop-crate-test-binaries-gammaloop-integration-tests-d6e55b48f8214f9c-inputs:post-build] warning: 'warn-short-path-literals' is deprecated, use 'lint-short-path-literals = ignore' instead
40.66 s
[gammaloop-crate-test-binaries-gammaloop-integration-tests-d6e55b48f8214f9c-inputs:post-build] copying 1 paths...
40.66 s
[gammaloop-crate-test-binaries-gammaloop-integration-tests-d6e55b48f8214f9c-inputs:post-build] copying path '/nix/store/39vrxj0mbhbqrjhjrl796xxkwaprja72-gammaloop-crate-test-binaries-gammaloop-integration-tests-d6e55b48f8214f9c-inputs' to 'https://cache.nix-ci.com'...
179.81 s
[gammaloop-crate-test-binaries-gammaloop-integration-tests-d6e55b48f8214f9c-inputs:post-build] warning: 'warn-short-path-literals' is deprecated, use 'lint-short-path-literals = ignore' instead
180.11 s
[gammaloop-crate-test-binaries-gammaloop-integration-tests-d6e55b48f8214f9c-inputs:post-build] copying 1 paths...
180.11 s
[gammaloop-crate-test-binaries-gammaloop-integration-tests-d6e55b48f8214f9c-inputs:post-build] copying path '/nix/store/bfvy4v2kk93g066fwak59pi5wliiwsw2-gammaloop-crate-test-binaries-gammaloop-integration-tests-d6e55b48f8214f9c-inputs.drv' to 'https://cache.nix-ci.com'...
180.56 s
Uploaded gammaloop-crate-test-binaries-gammaloop-integration-tests-d6e55b48f8214f9c-inputs in 2m20s
180.56 s
Progress: 1 of 4 built, 2 of 2 downloaded from cache
180.56 s
Built gammaloop-crate-test-binaries-gammaloop-integration-tests-d6e55b48f8214f9c-inputs in 2m30s
180.68 s
Building /nix/store/0k9s3dg8zlxyd6l94ikbxf4sqdbyrpq6-gammaloop-crate-test-binaries-gammaloop-integration-tests-d6e55b48f8214f9c-deps-0.1.0.drv
180.88 s
[gammaloop-crate-test-binaries-gammaloop-integration-tests-d6e55b48f8214f9c-deps] Phase: unpackPhase
180.90 s
[gammaloop-crate-test-binaries-gammaloop-integration-tests-d6e55b48f8214f9c-deps] unpacking source archive /nix/store/mihhxhg81q7j5z719niswnivgvyvfkc5-source
182.05 s
[gammaloop-crate-test-binaries-gammaloop-integration-tests-d6e55b48f8214f9c-deps] source root is source
182.09 s
[gammaloop-crate-test-binaries-gammaloop-integration-tests-d6e55b48f8214f9c-deps] Phase: patchPhase
182.16 s
[gammaloop-crate-test-binaries-gammaloop-integration-tests-d6e55b48f8214f9c-deps] Executing configureCargoCommonVars
182.16 s
[gammaloop-crate-test-binaries-gammaloop-integration-tests-d6e55b48f8214f9c-deps] copying cargo artifacts from /nix/store/39vrxj0mbhbqrjhjrl796xxkwaprja72-gammaloop-crate-test-binaries-gammaloop-integration-tests-d6e55b48f8214f9c-inputs/target to target
182.16 s
[gammaloop-crate-test-binaries-gammaloop-integration-tests-d6e55b48f8214f9c-deps] will deep copy artifacts (instead of symlinking) as requested
187.65 s
[gammaloop-crate-test-binaries-gammaloop-integration-tests-d6e55b48f8214f9c-deps] Phase: updateAutotoolsGnuConfigScriptsPhase
187.71 s
[gammaloop-crate-test-binaries-gammaloop-integration-tests-d6e55b48f8214f9c-deps] Phase: configurePhase
187.73 s
[gammaloop-crate-test-binaries-gammaloop-integration-tests-d6e55b48f8214f9c-deps] will append /build/source/.cargo-home/config.toml with contents of /nix/store/5drf77x6km4ky7gwlrzdx9bbd6fz09g3-vendor-cargo-deps/config.toml
187.73 s
[gammaloop-crate-test-binaries-gammaloop-integration-tests-d6e55b48f8214f9c-deps] default configurePhase, nothing to do
187.73 s
[gammaloop-crate-test-binaries-gammaloop-integration-tests-d6e55b48f8214f9c-deps] Phase: buildPhase
187.76 s
[gammaloop-crate-test-binaries-gammaloop-integration-tests-d6e55b48f8214f9c-deps] +++ command cargo --version
187.77 s
[gammaloop-crate-test-binaries-gammaloop-integration-tests-d6e55b48f8214f9c-deps] cargo 1.97.0 (c980f4866 2026-06-30)
187.77 s
[gammaloop-crate-test-binaries-gammaloop-integration-tests-d6e55b48f8214f9c-deps] +++ command cargo test --profile ci-optim --no-run --offline -p gammaloop-integration-tests --features gammaloop-integration-tests/python-api-tests
189.18 s
[gammaloop-crate-test-binaries-gammaloop-integration-tests-d6e55b48f8214f9c-deps] Compiling gammaloop-integration-tests v0.1.0 (/build/source/tests)
191.55 s
[gammaloop-crate-test-binaries-gammaloop-integration-tests-d6e55b48f8214f9c-deps] error[E0609] : no field `lmb_channel_id` on type `CutInfo`
191.55 s
[gammaloop-crate-test-binaries-gammaloop-integration-tests-d6e55b48f8214f9c-deps] --> tests/tests/test_runs/utils.rs:568:36
191.55 s
[gammaloop-crate-test-binaries-gammaloop-integration-tests-d6e55b48f8214f9c-deps] |
191.55 s
[gammaloop-crate-test-binaries-gammaloop-integration-tests-d6e55b48f8214f9c-deps] 568 | event.cut_info.lmb_channel_id,
191.55 s
[gammaloop-crate-test-binaries-gammaloop-integration-tests-d6e55b48f8214f9c-deps] | ^^^^^^^^^^^^^^ unknown field
191.55 s
[gammaloop-crate-test-binaries-gammaloop-integration-tests-d6e55b48f8214f9c-deps] |
191.55 s
[gammaloop-crate-test-binaries-gammaloop-integration-tests-d6e55b48f8214f9c-deps] = note : available fields are: `particle_pdgs`, `cut_id`, `graph_id`, `graph_group_id`, `orientation_id` ... and 2 others
191.55 s
[gammaloop-crate-test-binaries-gammaloop-integration-tests-d6e55b48f8214f9c-deps]
191.55 s
[gammaloop-crate-test-binaries-gammaloop-integration-tests-d6e55b48f8214f9c-deps] error[E0609] : no field `lmb_channel_id` on type `CutInfo`
191.55 s
[gammaloop-crate-test-binaries-gammaloop-integration-tests-d6e55b48f8214f9c-deps] --> tests/tests/test_runs/utils.rs:580:36
191.55 s
[gammaloop-crate-test-binaries-gammaloop-integration-tests-d6e55b48f8214f9c-deps] |
191.55 s
[gammaloop-crate-test-binaries-gammaloop-integration-tests-d6e55b48f8214f9c-deps] 580 | event.cut_info.lmb_channel_id,
191.55 s
[gammaloop-crate-test-binaries-gammaloop-integration-tests-d6e55b48f8214f9c-deps] | ^^^^^^^^^^^^^^ unknown field
191.55 s
[gammaloop-crate-test-binaries-gammaloop-integration-tests-d6e55b48f8214f9c-deps] |
191.55 s
[gammaloop-crate-test-binaries-gammaloop-integration-tests-d6e55b48f8214f9c-deps] = note : available fields are: `particle_pdgs`, `cut_id`, `graph_id`, `graph_group_id`, `orientation_id` ... and 2 others
191.55 s
[gammaloop-crate-test-binaries-gammaloop-integration-tests-d6e55b48f8214f9c-deps]
193.29 s
[gammaloop-crate-test-binaries-gammaloop-integration-tests-d6e55b48f8214f9c-deps] For more information about this error, try `rustc --explain E0609`.
193.38 s
[gammaloop-crate-test-binaries-gammaloop-integration-tests-d6e55b48f8214f9c-deps] error : could not compile `gammaloop-integration-tests` (test "test_runs") due to 2 previous errors
193.38 s
[gammaloop-crate-test-binaries-gammaloop-integration-tests-d6e55b48f8214f9c-deps] warning : build failed, waiting for other jobs to finish...
283.61 s
Progress: 1 of 3 built (1 failed), 2 of 2 downloaded from cache
283.61 s
Failed to build gammaloop-crate-test-binaries-gammaloop-integration-tests-d6e55b48f8214f9c-deps after 1m42s
283.61 s
error: Cannot build '/nix/store/0k9s3dg8zlxyd6l94ikbxf4sqdbyrpq6-gammaloop-crate-test-binaries-gammaloop-integration-tests-d6e55b48f8214f9c-deps-0.1.0.drv '.
283.61 s
Reason: builder failed with exit code 101 .
283.61 s
Output paths:
283.61 s
/nix/store/jfhac9hw5259wrblprxqqavgbzsgz50i-gammaloop-crate-test-binaries-gammaloop-integration-tests-d6e55b48f8214f9c-deps-0.1.0
283.61 s
Last 35 log lines:
283.61 s
> Running phase: unpackPhase
283.61 s
> unpacking source archive /nix/store/mihhxhg81q7j5z719niswnivgvyvfkc5-source
283.61 s
> source root is source
283.61 s
> Running phase: patchPhase
283.61 s
> Executing configureCargoCommonVars
283.61 s
> copying cargo artifacts from /nix/store/39vrxj0mbhbqrjhjrl796xxkwaprja72-gammaloop-crate-test-binaries-gammaloop-integration-tests-d6e55b48f8214f9c-inputs/target to target
283.61 s
> will deep copy artifacts (instead of symlinking) as requested
283.61 s
> Running phase: updateAutotoolsGnuConfigScriptsPhase
283.61 s
> Running phase: configurePhase
283.61 s
> will append /build/source/.cargo-home/config.toml with contents of /nix/store/5drf77x6km4ky7gwlrzdx9bbd6fz09g3-vendor-cargo-deps/config.toml
283.61 s
> default configurePhase, nothing to do
283.61 s
> Running phase: buildPhase
283.61 s
> +++ command cargo --version
283.61 s
> cargo 1.97.0 (c980f4866 2026-06-30)
283.61 s
> +++ command cargo test --profile ci-optim --no-run --offline -p gammaloop-integration-tests --features gammaloop-integration-tests/python-api-tests
283.61 s
> Compiling gammaloop-integration-tests v0.1.0 (/build/source/tests)
283.61 s
> error[E0609] : no field `lmb_channel_id` on type `CutInfo`
283.61 s
> --> tests/tests/test_runs/utils.rs:568:36
283.61 s
> |
283.61 s
> 568 | event.cut_info.lmb_channel_id,
283.61 s
> | ^^^^^^^^^^^^^^ unknown field
283.61 s
> |
283.61 s
> = note : available fields are: `particle_pdgs`, `cut_id`, `graph_id`, `graph_group_id`, `orientation_id` ... and 2 others
283.61 s
>
283.61 s
> error[E0609] : no field `lmb_channel_id` on type `CutInfo`
283.61 s
> --> tests/tests/test_runs/utils.rs:580:36
283.61 s
> |
283.61 s
> 580 | event.cut_info.lmb_channel_id,
283.61 s
> | ^^^^^^^^^^^^^^ unknown field
283.61 s
> |
283.61 s
> = note : available fields are: `particle_pdgs`, `cut_id`, `graph_id`, `graph_group_id`, `orientation_id` ... and 2 others
283.61 s
>
283.61 s
> For more information about this error, try `rustc --explain E0609`.
283.61 s
> error : could not compile `gammaloop-integration-tests` (test "test_runs") due to 2 previous errors
283.61 s
> warning : build failed, waiting for other jobs to finish...
283.61 s
For full logs, run:
283.61 s
nix log /nix/store/0k9s3dg8zlxyd6l94ikbxf4sqdbyrpq6-gammaloop-crate-test-binaries-gammaloop-integration-tests-d6e55b48f8214f9c-deps-0.1.0.drv
283.61 s
error: Cannot build '/nix/store/8sh98ir2sg6kvd7rmph6yb4z4l2ch4h6-nix-ci-artifact-barrier-crate-test-binaries-python-api-gammaloop-integration-tests.drv '.
283.61 s
Reason: 1 dependency failed .
283.61 s
Output paths:
283.61 s
/nix/store/8fn8d26h1ygg045rq9i18qxj8j33idqm-nix-ci-artifact-barrier-crate-test-binaries-python-api-gammaloop-integration-tests
283.62 s
Build failed due to failed dependency
283.68 s
Build failed.