0.00 s
$ /nix/store/9ypz3flqsrl5xl495mm8h645gadjsxi1-coreutils-9.11/bin/timeout --kill-after=15s 7200s /nix/store/23zk8sgzamrbmj1fday15szf7f2279s8-nix-2.34.7/bin/nix --extra-experimental-features nix-command --extra-experimental-features flakes --log-format internal-json build --no-link --print-out-paths git+https://github.com/alphal00p/gammaloop?ref=advanced_sampling&rev=f2f64fb17dd5dab588eca298dc61f1100fa4962d&shallow=1#packages.x86_64-linux.crate-test-binaries-gammaloop-integration-tests --print-build-logs
4.65 s
5.33 s
Downloading cached gammaloop-crate-test-dependencies-6e86b9f305aafb81-inputs from https://cache.nix-ci.com
21.18 s
Downloaded cached gammaloop-crate-test-dependencies-6e86b9f305aafb81-inputs (2.4 GiB) in 15.8s
21.18 s
Progress: 0 of 3 built, 1 of 5 downloaded from cache
21.18 s
Downloading cached gammaloop-crate-test-dependencies-6e86b9f305aafb81-deps from https://cache.nix-ci.com
21.90 s
Downloaded cached gammaloop-crate-test-dependencies-6e86b9f305aafb81-deps (128.2 MiB) in 717ms
21.90 s
Progress: 0 of 3 built, 2 of 5 downloaded from cache
21.90 s
Downloading cached gammaloop-crate-test-dependencies-b8cda0d438c96d4f-inputs from https://cache.nix-ci.com
44.96 s
Downloaded cached gammaloop-crate-test-dependencies-b8cda0d438c96d4f-inputs (3.2 GiB) in 23.0s
44.96 s
Progress: 0 of 3 built, 3 of 5 downloaded from cache
44.96 s
Downloading cached gammaloop-crate-test-dependencies-b8cda0d438c96d4f-deps from https://cache.nix-ci.com
45.24 s
Downloaded cached gammaloop-crate-test-dependencies-b8cda0d438c96d4f-deps (30.1 MiB) in 274ms
45.24 s
Progress: 0 of 3 built, 4 of 5 downloaded from cache
45.24 s
Downloading cached gammaloop-crate-test-binaries-gammaloop-integration-tests-b8cda0d438c96d4f-inputs from https://cache.nix-ci.com
69.88 s
Downloaded cached gammaloop-crate-test-binaries-gammaloop-integration-tests-b8cda0d438c96d4f-inputs (3.2 GiB) in 24.6s
69.88 s
Progress: 0 of 3 built, 5 of 5 downloaded from cache
70.11 s
Building /nix/store/r56whqs3zj9clz5fj8bc4m0bwgy8zlg2-gammaloop-crate-test-binaries-gammaloop-integration-tests-b8cda0d438c96d4f-deps-0.1.0.drv
70.21 s
[gammaloop-crate-test-binaries-gammaloop-integration-tests-b8cda0d438c96d4f-deps] Phase: unpackPhase
70.22 s
[gammaloop-crate-test-binaries-gammaloop-integration-tests-b8cda0d438c96d4f-deps] unpacking source archive /nix/store/mihhxhg81q7j5z719niswnivgvyvfkc5-source
70.40 s
[gammaloop-crate-test-binaries-gammaloop-integration-tests-b8cda0d438c96d4f-deps] source root is source
70.42 s
[gammaloop-crate-test-binaries-gammaloop-integration-tests-b8cda0d438c96d4f-deps] Phase: patchPhase
70.55 s
[gammaloop-crate-test-binaries-gammaloop-integration-tests-b8cda0d438c96d4f-deps] Executing configureCargoCommonVars
70.56 s
[gammaloop-crate-test-binaries-gammaloop-integration-tests-b8cda0d438c96d4f-deps] copying cargo artifacts from /nix/store/548rf7h75y5ys59fazvil5ylvwiwvqka-gammaloop-crate-test-binaries-gammaloop-integration-tests-b8cda0d438c96d4f-inputs/target to target
70.56 s
[gammaloop-crate-test-binaries-gammaloop-integration-tests-b8cda0d438c96d4f-deps] will deep copy artifacts (instead of symlinking) as requested
72.97 s
[gammaloop-crate-test-binaries-gammaloop-integration-tests-b8cda0d438c96d4f-deps] Phase: updateAutotoolsGnuConfigScriptsPhase
73.04 s
[gammaloop-crate-test-binaries-gammaloop-integration-tests-b8cda0d438c96d4f-deps] Phase: configurePhase
73.06 s
[gammaloop-crate-test-binaries-gammaloop-integration-tests-b8cda0d438c96d4f-deps] will append /build/source/.cargo-home/config.toml with contents of /nix/store/5drf77x6km4ky7gwlrzdx9bbd6fz09g3-vendor-cargo-deps/config.toml
73.06 s
[gammaloop-crate-test-binaries-gammaloop-integration-tests-b8cda0d438c96d4f-deps] default configurePhase, nothing to do
73.07 s
[gammaloop-crate-test-binaries-gammaloop-integration-tests-b8cda0d438c96d4f-deps] Phase: buildPhase
73.08 s
[gammaloop-crate-test-binaries-gammaloop-integration-tests-b8cda0d438c96d4f-deps] +++ command cargo --version
73.08 s
[gammaloop-crate-test-binaries-gammaloop-integration-tests-b8cda0d438c96d4f-deps] cargo 1.97.0 (c980f4866 2026-06-30)
73.09 s
[gammaloop-crate-test-binaries-gammaloop-integration-tests-b8cda0d438c96d4f-deps] +++ command cargo test --profile ci-optim --no-run --offline -p gammaloop-integration-tests
75.10 s
[gammaloop-crate-test-binaries-gammaloop-integration-tests-b8cda0d438c96d4f-deps] Compiling gammaloop-integration-tests v0.1.0 (/build/source/tests)
77.09 s
[gammaloop-crate-test-binaries-gammaloop-integration-tests-b8cda0d438c96d4f-deps] error[E0609] : no field `lmb_channel_id` on type `CutInfo`
77.09 s
[gammaloop-crate-test-binaries-gammaloop-integration-tests-b8cda0d438c96d4f-deps] --> tests/tests/test_runs/utils.rs:568:36
77.09 s
[gammaloop-crate-test-binaries-gammaloop-integration-tests-b8cda0d438c96d4f-deps] |
77.09 s
[gammaloop-crate-test-binaries-gammaloop-integration-tests-b8cda0d438c96d4f-deps] 568 | event.cut_info.lmb_channel_id,
77.09 s
[gammaloop-crate-test-binaries-gammaloop-integration-tests-b8cda0d438c96d4f-deps] | ^^^^^^^^^^^^^^ unknown field
77.09 s
[gammaloop-crate-test-binaries-gammaloop-integration-tests-b8cda0d438c96d4f-deps] |
77.09 s
[gammaloop-crate-test-binaries-gammaloop-integration-tests-b8cda0d438c96d4f-deps] = note : available fields are: `particle_pdgs`, `cut_id`, `graph_id`, `graph_group_id`, `orientation_id` ... and 2 others
77.09 s
[gammaloop-crate-test-binaries-gammaloop-integration-tests-b8cda0d438c96d4f-deps]
77.09 s
[gammaloop-crate-test-binaries-gammaloop-integration-tests-b8cda0d438c96d4f-deps] error[E0609] : no field `lmb_channel_id` on type `CutInfo`
77.09 s
[gammaloop-crate-test-binaries-gammaloop-integration-tests-b8cda0d438c96d4f-deps] --> tests/tests/test_runs/utils.rs:580:36
77.09 s
[gammaloop-crate-test-binaries-gammaloop-integration-tests-b8cda0d438c96d4f-deps] |
77.09 s
[gammaloop-crate-test-binaries-gammaloop-integration-tests-b8cda0d438c96d4f-deps] 580 | event.cut_info.lmb_channel_id,
77.09 s
[gammaloop-crate-test-binaries-gammaloop-integration-tests-b8cda0d438c96d4f-deps] | ^^^^^^^^^^^^^^ unknown field
77.09 s
[gammaloop-crate-test-binaries-gammaloop-integration-tests-b8cda0d438c96d4f-deps] |
77.09 s
[gammaloop-crate-test-binaries-gammaloop-integration-tests-b8cda0d438c96d4f-deps] = note : available fields are: `particle_pdgs`, `cut_id`, `graph_id`, `graph_group_id`, `orientation_id` ... and 2 others
77.09 s
[gammaloop-crate-test-binaries-gammaloop-integration-tests-b8cda0d438c96d4f-deps]
78.18 s
[gammaloop-crate-test-binaries-gammaloop-integration-tests-b8cda0d438c96d4f-deps] For more information about this error, try `rustc --explain E0609`.
78.22 s
[gammaloop-crate-test-binaries-gammaloop-integration-tests-b8cda0d438c96d4f-deps] error : could not compile `gammaloop-integration-tests` (test "test_runs") due to 2 previous errors
78.22 s
[gammaloop-crate-test-binaries-gammaloop-integration-tests-b8cda0d438c96d4f-deps] warning : build failed, waiting for other jobs to finish...
131.07 s
Progress: 0 of 2 built (1 failed), 5 of 5 downloaded from cache
131.07 s
Failed to build gammaloop-crate-test-binaries-gammaloop-integration-tests-b8cda0d438c96d4f-deps after 1m00s
131.07 s
error: Cannot build '/nix/store/r56whqs3zj9clz5fj8bc4m0bwgy8zlg2-gammaloop-crate-test-binaries-gammaloop-integration-tests-b8cda0d438c96d4f-deps-0.1.0.drv '.
131.07 s
Reason: builder failed with exit code 101 .
131.07 s
Output paths:
131.07 s
/nix/store/p7igf7a2rhg1ma117x5c7x9xx66jxvwc-gammaloop-crate-test-binaries-gammaloop-integration-tests-b8cda0d438c96d4f-deps-0.1.0
131.07 s
Last 35 log lines:
131.07 s
> Running phase: unpackPhase
131.07 s
> unpacking source archive /nix/store/mihhxhg81q7j5z719niswnivgvyvfkc5-source
131.07 s
> source root is source
131.07 s
> Running phase: patchPhase
131.07 s
> Executing configureCargoCommonVars
131.07 s
> copying cargo artifacts from /nix/store/548rf7h75y5ys59fazvil5ylvwiwvqka-gammaloop-crate-test-binaries-gammaloop-integration-tests-b8cda0d438c96d4f-inputs/target to target
131.07 s
> will deep copy artifacts (instead of symlinking) as requested
131.07 s
> Running phase: updateAutotoolsGnuConfigScriptsPhase
131.07 s
> Running phase: configurePhase
131.07 s
> will append /build/source/.cargo-home/config.toml with contents of /nix/store/5drf77x6km4ky7gwlrzdx9bbd6fz09g3-vendor-cargo-deps/config.toml
131.07 s
> default configurePhase, nothing to do
131.07 s
> Running phase: buildPhase
131.07 s
> +++ command cargo --version
131.07 s
> cargo 1.97.0 (c980f4866 2026-06-30)
131.07 s
> +++ command cargo test --profile ci-optim --no-run --offline -p gammaloop-integration-tests
131.07 s
> Compiling gammaloop-integration-tests v0.1.0 (/build/source/tests)
131.07 s
> error[E0609] : no field `lmb_channel_id` on type `CutInfo`
131.07 s
> --> tests/tests/test_runs/utils.rs:568:36
131.07 s
> |
131.07 s
> 568 | event.cut_info.lmb_channel_id,
131.07 s
> | ^^^^^^^^^^^^^^ unknown field
131.07 s
> |
131.07 s
> = note : available fields are: `particle_pdgs`, `cut_id`, `graph_id`, `graph_group_id`, `orientation_id` ... and 2 others
131.07 s
>
131.07 s
> error[E0609] : no field `lmb_channel_id` on type `CutInfo`
131.07 s
> --> tests/tests/test_runs/utils.rs:580:36
131.07 s
> |
131.07 s
> 580 | event.cut_info.lmb_channel_id,
131.07 s
> | ^^^^^^^^^^^^^^ unknown field
131.07 s
> |
131.07 s
> = note : available fields are: `particle_pdgs`, `cut_id`, `graph_id`, `graph_group_id`, `orientation_id` ... and 2 others
131.07 s
>
131.07 s
> For more information about this error, try `rustc --explain E0609`.
131.07 s
> error : could not compile `gammaloop-integration-tests` (test "test_runs") due to 2 previous errors
131.07 s
> warning : build failed, waiting for other jobs to finish...
131.07 s
For full logs, run:
131.07 s
nix log /nix/store/r56whqs3zj9clz5fj8bc4m0bwgy8zlg2-gammaloop-crate-test-binaries-gammaloop-integration-tests-b8cda0d438c96d4f-deps-0.1.0.drv
131.07 s
error: Cannot build '/nix/store/2pp7ycfwws05qhcg479sg862xh1972cg-nix-ci-artifact-barrier-crate-test-binaries-gammaloop-integration-tests.drv '.
131.07 s
Reason: 1 dependency failed .
131.07 s
Output paths:
131.07 s
/nix/store/ddzipgxyaif93wciqaaj78gifakzffaa-nix-ci-artifact-barrier-crate-test-binaries-gammaloop-integration-tests
131.08 s
Build failed due to failed dependency
131.12 s
Build failed.