1. 0.00 s $ /nix/store/9ypz3flqsrl5xl495mm8h645gadjsxi1-coreutils-9.11/bin/timeout --kill-after=15s 7200s /nix/store/23zk8sgzamrbmj1fday15szf7f2279s8-nix-2.34.7/bin/nix --extra-experimental-features nix-command --extra-experimental-features flakes --log-format internal-json build --no-link --print-out-paths git+https://github.com/alphal00p/gammaloop?ref=advanced_sampling&rev=f78de7d1e755bb4dae40c46b58aa52674fb86cab&shallow=1#checks.x86_64-linux.gammaloop-check --print-build-logs
  2. 3.53 s
  3. 3.89 s Building /nix/store/bkjn3kpkbcz17y1rdpsxdw5wids19g66-gammaloop-workspace-check-0.1.0.drv
  4. 3.96 s [gammaloop-workspace-check] Phase: unpackPhase
  5. 3.97 s [gammaloop-workspace-check] unpacking source archive /nix/store/vwx01dpxvbgg3x2ag73251y99q28cn86-source
  6. 4.14 s [gammaloop-workspace-check] source root is source
  7. 4.18 s [gammaloop-workspace-check] Phase: patchPhase
  8. 4.18 s [gammaloop-workspace-check] Executing configureCargoCommonVars
  9. 4.19 s [gammaloop-workspace-check] decompressing cargo artifacts from /nix/store/50vpxlcgfxf2d57i27v3d10zjwxxbm2r-gammaloop-workspace-deps-deps-0.1.0/target.tar.zst to target
  10. 5.69 s [gammaloop-workspace-check] Phase: updateAutotoolsGnuConfigScriptsPhase
  11. 5.73 s [gammaloop-workspace-check] Phase: configurePhase
  12. 5.74 s [gammaloop-workspace-check] will append /build/source/.cargo-home/config.toml with contents of /nix/store/5drf77x6km4ky7gwlrzdx9bbd6fz09g3-vendor-cargo-deps/config.toml
  13. 5.74 s [gammaloop-workspace-check] default configurePhase, nothing to do
  14. 5.74 s [gammaloop-workspace-check] Phase: buildPhase
  15. 5.75 s [gammaloop-workspace-check] +++ command cargo --version
  16. 5.75 s [gammaloop-workspace-check] cargo 1.97.0 (c980f4866 2026-06-30)
  17. 5.78 s [gammaloop-workspace-check] +++ command cargo check --profile ci-optim --locked --workspace --features gammaloop-tracing-filter/clap,gammaloop-tracing-filter/symbolica,idenso/bincode,idenso/reference-cases,linnet/bincode,linnet/drawing,linnet/rkyv,linnet/serde,linnet/symbolica,spenso-macros/shadowing,spenso/shadowing,symbolica/tracing_max_level_info,three-dimensional-reps/display,three-dimensional-reps/eval,three-dimensional-reps/serde --all-targets
  18. 6.34 s [gammaloop-workspace-check] Checking cfg-if v1.0.4
  19. 6.34 s [gammaloop-workspace-check] Checking memchr v2.8.0
  20. 6.34 s [gammaloop-workspace-check] Checking once_cell v1.21.4
  21. 6.35 s [gammaloop-workspace-check] Checking either v1.15.0
  22. 6.36 s [gammaloop-workspace-check] Checking serde_core v1.0.228
  23. 6.36 s [gammaloop-workspace-check] Checking libc v0.2.186
  24. 6.36 s [gammaloop-workspace-check] Checking libm v0.2.16
  25. 6.37 s [gammaloop-workspace-check] Checking itoa v1.0.18
  26. 6.38 s [gammaloop-workspace-check] Checking log v0.4.29
  27. 6.38 s [gammaloop-workspace-check] Checking regex-syntax v0.8.10
  28. 6.39 s [gammaloop-workspace-check] Checking zerocopy v0.8.48
  29. 6.39 s [gammaloop-workspace-check] Checking crossbeam-utils v0.8.21
  30. 6.39 s [gammaloop-workspace-check] Checking equivalent v1.0.2
  31. 6.40 s [gammaloop-workspace-check] Checking zmij v1.0.21
  32. 6.43 s [gammaloop-workspace-check] Checking bytemuck v1.25.0
  33. 6.44 s [gammaloop-workspace-check] Checking lazy_static v1.5.0
  34. 6.44 s [gammaloop-workspace-check] Compiling target-lexicon v0.13.5
  35. 6.47 s [gammaloop-workspace-check] Checking arrayvec v0.7.6
  36. 6.48 s [gammaloop-workspace-check] Checking powerfmt v0.2.0
  37. 6.52 s [gammaloop-workspace-check] Checking num-conv v0.2.1
  38. 6.54 s [gammaloop-workspace-check] Checking itertools v0.14.0
  39. 6.54 s [gammaloop-workspace-check] Checking pin-project-lite v0.2.17
  40. 6.55 s [gammaloop-workspace-check] Checking time-core v0.1.8
  41. 6.64 s [gammaloop-workspace-check] Checking num_threads v0.1.7
  42. 6.66 s [gammaloop-workspace-check] Checking deranged v0.5.8
  43. 6.67 s [gammaloop-workspace-check] Checking tracing-core v0.1.36
  44. 6.71 s [gammaloop-workspace-check] Checking allocator-api2 v0.2.21
  45. 6.74 s [gammaloop-workspace-check] Checking foldhash v0.2.0
  46. 6.77 s [gammaloop-workspace-check] Checking safe_arch v0.7.4
  47. 6.83 s [gammaloop-workspace-check] Checking const-random v0.1.18
  48. 6.85 s [gammaloop-workspace-check] Checking winnow v1.0.2
  49. 6.89 s [gammaloop-workspace-check] Checking nu-ansi-term v0.50.3
  50. 6.93 s [gammaloop-workspace-check] Checking static_assertions v1.1.0
  51. 7.00 s [gammaloop-workspace-check] Checking unty v0.0.4
  52. 7.08 s [gammaloop-workspace-check] Checking safe_arch v1.0.0
  53. 7.09 s [gammaloop-workspace-check] Checking wide v0.7.33
  54. 7.10 s [gammaloop-workspace-check] Checking crossbeam-epoch v0.9.18
  55. 7.12 s [gammaloop-workspace-check] Checking aho-corasick v1.1.4
  56. 7.19 s [gammaloop-workspace-check] Checking hashbrown v0.16.1
  57. 7.38 s [gammaloop-workspace-check] Checking sharded-slab v0.1.7
  58. 7.40 s [gammaloop-workspace-check] Checking thread_local v1.1.9
  59. 7.41 s [gammaloop-workspace-check] Checking crossbeam-deque v0.8.6
  60. 7.41 s [gammaloop-workspace-check] Checking tracing v0.1.44
  61. 7.56 s [gammaloop-workspace-check] Checking tracing-log v0.2.0
  62. 7.57 s [gammaloop-workspace-check] Checking rayon-core v1.13.0
  63. 7.58 s [gammaloop-workspace-check] Checking num-traits v0.2.19
  64. 7.65 s [gammaloop-workspace-check] Checking az v1.3.0
  65. 7.71 s [gammaloop-workspace-check] Checking toml_writer v1.1.1+spec-1.1.0
  66. 7.77 s [gammaloop-workspace-check] Checking indenter v0.3.4
  67. 7.86 s [gammaloop-workspace-check] Checking wide v1.3.0
  68. 7.91 s [gammaloop-workspace-check] Compiling phf_shared v0.11.3
  69. 7.92 s [gammaloop-workspace-check] Checking anyhow v1.0.102
  70. 8.06 s [gammaloop-workspace-check] Checking rayon v1.12.0
  71. 8.12 s [gammaloop-workspace-check] Checking utf8parse v0.2.2
  72. 8.15 s [gammaloop-workspace-check] Checking alloc-no-stdlib v2.0.4
  73. 8.16 s [gammaloop-workspace-check] Checking getrandom v0.3.4
  74. 8.21 s [gammaloop-workspace-check] Checking time v0.3.47
  75. 8.22 s [gammaloop-workspace-check] Checking gmp-mpfr-sys v1.7.1
  76. 8.24 s [gammaloop-workspace-check] Checking dyn-clone v1.0.20
  77. 8.27 s [gammaloop-workspace-check] Checking rawpointer v0.2.1
  78. 8.29 s [gammaloop-workspace-check] Checking rand_core v0.9.5
  79. 8.33 s [gammaloop-workspace-check] Checking alloc-stdlib v0.2.2
  80. 8.35 s [gammaloop-workspace-check] Checking matrixmultiply v0.3.10
  81. 8.37 s [gammaloop-workspace-check] Checking approx v0.5.1
  82. 8.40 s [gammaloop-workspace-check] Checking regex-automata v0.4.14
  83. 8.43 s [gammaloop-workspace-check] Checking num-integer v0.1.46
  84. 8.47 s [gammaloop-workspace-check] Checking anstyle-parse v1.0.0
  85. 8.49 s [gammaloop-workspace-check] Checking is_terminal_polyfill v1.70.2
  86. 8.55 s [gammaloop-workspace-check] Checking anstyle v1.0.14
  87. 8.56 s [gammaloop-workspace-check] Checking anstyle-query v1.1.5
  88. 8.61 s [gammaloop-workspace-check] Checking colored v3.1.1
  89. 8.63 s [gammaloop-workspace-check] Checking toml_parser v1.1.2+spec-1.1.0
  90. 8.65 s [gammaloop-workspace-check] Checking colorchoice v1.0.5
  91. 8.72 s [gammaloop-workspace-check] Compiling phf_generator v0.11.3
  92. 8.73 s [gammaloop-workspace-check] Checking eyre v0.6.12
  93. 8.76 s [gammaloop-workspace-check] Checking anstream v1.0.0
  94. 8.80 s [gammaloop-workspace-check] Checking bitflags v1.3.2
  95. 8.85 s [gammaloop-workspace-check] Checking unicode-width v0.2.2
  96. 8.86 s [gammaloop-workspace-check] Checking brotli-decompressor v5.0.0
  97. 8.88 s [gammaloop-workspace-check] Checking region v3.0.2
  98. 8.96 s [gammaloop-workspace-check] Compiling phf_codegen v0.11.3
  99. 9.00 s [gammaloop-workspace-check] Checking wasmtime-jit-icache-coherence v34.0.2
  100. 9.01 s [gammaloop-workspace-check] Checking hugepage-rs v0.1.1
  101. 9.05 s [gammaloop-workspace-check] Checking spec_math v0.1.6
  102. 9.06 s [gammaloop-workspace-check] Checking inventory v0.3.24
  103. 9.08 s [gammaloop-workspace-check] Checking thiserror v2.0.18
  104. 9.09 s [gammaloop-workspace-check] Compiling getopts v0.2.24
  105. 9.10 s [gammaloop-workspace-check] Checking libloading v0.9.0
  106. 9.11 s [gammaloop-workspace-check] Checking append-only-vec v0.1.8
  107. 9.14 s [gammaloop-workspace-check] Checking bytes v1.11.1
  108. 9.16 s [gammaloop-workspace-check] Checking byteorder v1.5.0
  109. 9.17 s [gammaloop-workspace-check] Compiling pyo3-build-config v0.28.3
  110. 9.18 s [gammaloop-workspace-check] Checking self_cell v1.2.2
  111. 9.20 s [gammaloop-workspace-check] Checking serde v1.0.228
  112. 9.22 s [gammaloop-workspace-check] Checking serde_json v1.0.149
  113. 9.24 s [gammaloop-workspace-check] Checking bitflags v2.11.1
  114. 9.27 s [gammaloop-workspace-check] Checking serde_spanned v1.1.1
  115. 9.35 s [gammaloop-workspace-check] Checking toml_datetime v1.1.1+spec-1.1.0
  116. 9.36 s [gammaloop-workspace-check] Checking tinyjson v2.5.1
  117. 9.38 s [gammaloop-workspace-check] Compiling unic-char-range v0.9.0
  118. 9.44 s [gammaloop-workspace-check] Compiling unic-common v0.9.0
  119. 9.50 s [gammaloop-workspace-check] Compiling unicode_names2_generator v1.3.0
  120. 9.51 s [gammaloop-workspace-check] Checking linux-raw-sys v0.12.1
  121. 9.54 s [gammaloop-workspace-check] Compiling unic-ucd-version v0.9.0
  122. 9.61 s [gammaloop-workspace-check] Checking toml v1.1.2+spec-1.1.0
  123. 9.61 s [gammaloop-workspace-check] Compiling unic-char-property v0.9.0
  124. 9.63 s [gammaloop-workspace-check] Compiling is-macro v0.3.7
  125. 9.66 s [gammaloop-workspace-check] Compiling rustpython-parser-vendored v0.4.0
  126. 9.71 s [gammaloop-workspace-check] Checking iana-time-zone v0.1.65
  127. 9.75 s [gammaloop-workspace-check] Compiling rustpython-parser v0.4.0
  128. 9.78 s [gammaloop-workspace-check] Checking rustix v1.1.4
  129. 9.80 s [gammaloop-workspace-check] Checking smallvec v1.15.1
  130. 9.86 s [gammaloop-workspace-check] Checking num-complex v0.4.6
  131. 9.89 s [gammaloop-workspace-check] Checking tracing-serde v0.2.0
  132. 10.03 s [gammaloop-workspace-check] Checking bincode v2.0.1
  133. 10.07 s [gammaloop-workspace-check] Checking brotli v8.0.2
  134. 10.08 s [gammaloop-workspace-check] Checking smartstring v1.0.1
  135. 10.11 s [gammaloop-workspace-check] Checking chrono v0.4.44
  136. 10.29 s [gammaloop-workspace-check] Compiling phf v0.11.3
  137. 10.36 s [gammaloop-workspace-check] Checking ppv-lite86 v0.2.21
  138. 10.40 s [gammaloop-workspace-check] Checking ahash v0.8.12
  139. 10.41 s [gammaloop-workspace-check] Checking simba v0.9.1
  140. 10.43 s [gammaloop-workspace-check] Checking rustc-hash v2.1.2
  141. 10.46 s [gammaloop-workspace-check] Checking ndarray v0.17.2
  142. 10.50 s [gammaloop-workspace-check] Compiling unic-ucd-ident v0.9.0
  143. 10.56 s [gammaloop-workspace-check] Compiling unic-emoji-char v0.9.0
  144. 10.61 s [gammaloop-workspace-check] Compiling lalrpop-util v0.20.2
  145. 10.67 s [gammaloop-workspace-check] Compiling rustc-hash v1.1.0
  146. 10.69 s [gammaloop-workspace-check] Checking rand_chacha v0.9.0
  147. 10.71 s [gammaloop-workspace-check] Checking rug v1.30.0
  148. 10.77 s [gammaloop-workspace-check] Compiling symbolica v2.2.0 (https://github.com/alphal00p/symbolica?rev=a277a8dadbaae5a8d6605f2f381991a601e1f345#a277a8da)
  149. 10.83 s [gammaloop-workspace-check] Checking unicode-segmentation v1.13.2
  150. 10.88 s [gammaloop-workspace-check] Checking typenum v1.20.0
  151. 10.96 s [gammaloop-workspace-check] Checking rand v0.9.4
  152. 10.97 s [gammaloop-workspace-check] Checking getrandom v0.2.17
  153. 11.14 s [gammaloop-workspace-check] Checking scopeguard v1.2.0
  154. 11.22 s [gammaloop-workspace-check] Checking lock_api v0.4.14
  155. 11.27 s [gammaloop-workspace-check] Checking parking_lot_core v0.9.12
  156. 11.35 s [gammaloop-workspace-check] Checking matchers v0.2.0
  157. 11.36 s [gammaloop-workspace-check] Checking regex v1.12.3
  158. 11.47 s [gammaloop-workspace-check] Checking unicode-ident v1.0.24
  159. 11.49 s [gammaloop-workspace-check] Checking tracing-subscriber v0.3.23
  160. 11.51 s [gammaloop-workspace-check] Checking hashbrown v0.17.0
  161. 11.51 s [gammaloop-workspace-check] Checking symjit v2.21.0
  162. 11.53 s [gammaloop-workspace-check] Checking parking_lot v0.12.5
  163. 11.57 s [gammaloop-workspace-check] Checking errno v0.3.14
  164. 11.58 s [gammaloop-workspace-check] Checking unicase v2.9.0
  165. 11.69 s [gammaloop-workspace-check] Checking strsim v0.11.1
  166. 11.74 s [gammaloop-workspace-check] Checking clap_lex v1.1.0
  167. 11.76 s [gammaloop-workspace-check] Checking signal-hook-registry v1.4.8
  168. 11.78 s [gammaloop-workspace-check] Checking vte v0.14.1
  169. 11.83 s [gammaloop-workspace-check] Checking generic-array v0.14.7
  170. 11.87 s [gammaloop-workspace-check] Checking same-file v1.0.6
  171. 11.92 s [gammaloop-workspace-check] Checking half v2.7.1
  172. 11.97 s [gammaloop-workspace-check] Checking walkdir v2.5.0
  173. 12.05 s [gammaloop-workspace-check] Checking terminal_size v0.4.4
  174. 12.09 s [gammaloop-workspace-check] Checking indexmap v2.14.0
  175. 12.11 s [gammaloop-workspace-check] Checking mio v1.2.0
  176. 12.12 s [gammaloop-workspace-check] Checking signal-hook v0.3.18
  177. 12.18 s [gammaloop-workspace-check] Checking ciborium-io v0.2.2
  178. 12.22 s [gammaloop-workspace-check] Checking clap_builder v4.6.0
  179. 12.26 s [gammaloop-workspace-check] Checking minimal-lexical v0.2.1
  180. 12.33 s [gammaloop-workspace-check] Checking block-buffer v0.10.4
  181. 12.35 s [gammaloop-workspace-check] Checking crypto-common v0.1.7
  182. 12.42 s [gammaloop-workspace-check] Checking ciborium-ll v0.2.2
  183. 12.49 s [gammaloop-workspace-check] Checking digest v0.10.7
  184. 12.50 s [gammaloop-workspace-check] Checking nom v7.1.3
  185. 12.55 s [gammaloop-workspace-check] Checking signal-hook-mio v0.2.5
  186. 12.61 s [gammaloop-workspace-check] Checking derive_more v2.1.1
  187. 12.68 s [gammaloop-workspace-check] Checking num-bigint v0.4.6
  188. 12.69 s [gammaloop-workspace-check] Checking console v0.16.3
  189. 12.72 s [gammaloop-workspace-check] Checking bstr v1.12.1
  190. 12.76 s [gammaloop-workspace-check] Checking linux-raw-sys v0.4.15
  191. 13.04 s [gammaloop-workspace-check] Checking cpufeatures v0.2.17
  192. 13.08 s [gammaloop-workspace-check] Checking winnow v0.7.15
  193. 13.10 s [gammaloop-workspace-check] Checking rustix v0.38.44
  194. 13.10 s [gammaloop-workspace-check] Checking sha2 v0.10.9
  195. 13.33 s [gammaloop-workspace-check] Checking globset v0.4.18
  196. 13.54 s [gammaloop-workspace-check] Checking ciborium v0.2.2
  197. 13.65 s [gammaloop-workspace-check] Checking getrandom v0.4.2
  198. 13.79 s [gammaloop-workspace-check] Checking rand_core v0.6.4
  199. 13.88 s [gammaloop-workspace-check] Checking plotters-backend v0.3.7
  200. 13.89 s [gammaloop-workspace-check] Checking fastrand v2.4.1
  201. 13.97 s [gammaloop-workspace-check] Compiling unicode_names2 v1.3.0
  202. 13.99 s [gammaloop-workspace-check] Checking fnv v1.0.7
  203. 13.99 s [gammaloop-workspace-check] Checking crossterm v0.28.1
  204. 14.05 s [gammaloop-workspace-check] Checking rust-embed-utils v8.11.0
  205. 14.07 s [gammaloop-workspace-check] Checking plotters-svg v0.3.7
  206. 14.10 s [gammaloop-workspace-check] Checking tempfile v3.27.0
  207. 14.12 s [gammaloop-workspace-check] Checking toml_datetime v0.6.11
  208. 14.16 s [gammaloop-workspace-check] Checking ansitok v0.3.0
  209. 14.18 s [gammaloop-workspace-check] Checking serde_spanned v0.6.9
  210. 14.22 s [gammaloop-workspace-check] Checking itertools v0.10.5
  211. 14.24 s [gammaloop-workspace-check] Checking clap v4.6.1
  212. 14.31 s [gammaloop-workspace-check] Checking cast v0.3.0
  213. 14.32 s [gammaloop-workspace-check] Checking toml_write v0.1.2
  214. 14.35 s [gammaloop-workspace-check] Checking tap v1.0.1
  215. 14.37 s [gammaloop-workspace-check] Checking plotters v0.3.7
  216. 14.46 s [gammaloop-workspace-check] Checking wyz v0.5.1
  217. 14.46 s [gammaloop-workspace-check] Checking rand_chacha v0.3.1
  218. 14.50 s [gammaloop-workspace-check] Checking radium v0.7.0
  219. 14.51 s [gammaloop-workspace-check] Checking typeid v1.0.3
  220. 14.61 s [gammaloop-workspace-check] Checking similar v2.7.0
  221. 14.69 s [gammaloop-workspace-check] Checking ansi-str v0.9.0
  222. 14.70 s [gammaloop-workspace-check] Checking tinytemplate v1.2.1
  223. 14.73 s [gammaloop-workspace-check] Checking is-terminal v0.4.17
  224. 14.74 s [gammaloop-workspace-check] Checking oorandom v11.1.5
  225. 14.82 s [gammaloop-workspace-check] Checking funty v2.0.0
  226. 14.84 s [gammaloop-workspace-check] Checking bytecount v0.6.9
  227. 14.89 s [gammaloop-workspace-check] Checking anes v0.1.6
  228. 14.93 s [gammaloop-workspace-check] Checking xprec v0.2.2
  229. 14.98 s [gammaloop-workspace-check] Checking rand v0.8.6
  230. 15.05 s [gammaloop-workspace-check] Checking papergrid v0.17.0
  231. 15.11 s [gammaloop-workspace-check] Checking testing_table v0.3.0
  232. 15.17 s [gammaloop-workspace-check] Checking ron v0.12.1
  233. 15.18 s [gammaloop-workspace-check] Checking toml_edit v0.25.11+spec-1.1.0
  234. 15.23 s [gammaloop-workspace-check] Checking uncased v0.9.10
  235. 15.26 s [gammaloop-workspace-check] Checking env_filter v1.0.1
  236. 15.27 s [gammaloop-workspace-check] Checking jiff v0.2.24
  237. 15.32 s [gammaloop-workspace-check] Checking toml_edit v0.22.27
  238. 15.38 s [gammaloop-workspace-check] Checking bitvec v1.0.1
  239. 15.41 s [gammaloop-workspace-check] Checking ptr_meta v0.1.4
  240. 15.49 s [gammaloop-workspace-check] Checking simdutf8 v0.1.5
  241. 15.51 s [gammaloop-workspace-check] Checking ucd-trie v0.1.7
  242. 15.53 s [gammaloop-workspace-check] Checking criterion-plot v0.5.0
  243. 15.66 s [gammaloop-workspace-check] Checking pest v2.8.6
  244. 15.67 s [gammaloop-workspace-check] Checking bytecheck v0.6.12
  245. 15.69 s [gammaloop-workspace-check] Checking ahash v0.7.8
  246. 15.81 s [gammaloop-workspace-check] Checking approx v0.4.0
  247. 15.91 s [gammaloop-workspace-check] Checking hashbrown v0.12.3
  248. 16.02 s [gammaloop-workspace-check] Checking criterion v0.5.1
  249. 16.03 s [gammaloop-workspace-check] Checking seahash v4.1.0
  250. 16.22 s [gammaloop-workspace-check] Checking rend v0.4.2
  251. 16.24 s [gammaloop-workspace-check] Checking cgmath v0.18.0
  252. 16.43 s [gammaloop-workspace-check] Checking num-rational v0.4.2
  253. 16.65 s [gammaloop-workspace-check] Checking insta v1.47.2
  254. 16.71 s [gammaloop-workspace-check] Checking num-iter v0.1.45
  255. 16.79 s [gammaloop-workspace-check] Checking ref-ops v0.2.5
  256. 16.82 s [gammaloop-workspace-check] Checking num v0.4.3
  257. 16.90 s [gammaloop-workspace-check] Checking tabled v0.20.0
  258. 16.92 s [gammaloop-workspace-check] Checking rand_xoshiro v0.6.0
  259. 16.94 s [gammaloop-workspace-check] Checking features v0.10.0
  260. 17.02 s [gammaloop-workspace-check] Checking gat-lending-iterator v0.1.8
  261. 17.14 s [gammaloop-workspace-check] Checking constcat v0.5.1
  262. 17.20 s [gammaloop-workspace-check] Checking dot-parser v0.5.1
  263. 17.22 s [gammaloop-workspace-check] Checking colored v2.2.0
  264. 17.29 s [gammaloop-workspace-check] Checking cpufeatures v0.3.0
  265. 17.37 s [gammaloop-workspace-check] Checking constant_time_eq v0.4.2
  266. 17.38 s [gammaloop-workspace-check] Checking arrayref v0.3.9
  267. 17.45 s [gammaloop-workspace-check] Checking base64 v0.22.1
  268. 17.49 s [gammaloop-workspace-check] Checking blake3 v1.8.5
  269. 17.52 s [gammaloop-workspace-check] Checking siphasher v1.0.2
  270. 17.73 s [gammaloop-workspace-check] Checking joinery v2.1.0
  271. 17.82 s [gammaloop-workspace-check] Checking phf_shared v0.13.1
  272. 17.88 s [gammaloop-workspace-check] Checking toml v0.8.23
  273. 17.90 s [gammaloop-workspace-check] Checking titlecase v2.2.1
  274. 17.93 s [gammaloop-workspace-check] Checking subprocess v0.2.15
  275. 17.99 s [gammaloop-workspace-check] Checking rust_lisp v0.18.0
  276. 18.08 s [gammaloop-workspace-check] Compiling vakint v0.1.2 (/build/source/crates/vakint)
  277. 18.10 s [gammaloop-workspace-check] Checking phf v0.13.1
  278. 18.15 s [gammaloop-workspace-check] Checking version-compare v0.2.1
  279. 18.22 s [gammaloop-workspace-check] Compiling pyo3-macros-backend v0.28.3
  280. 18.31 s [gammaloop-workspace-check] Compiling pyo3-ffi v0.28.3
  281. 18.37 s [gammaloop-workspace-check] Compiling pyo3 v0.28.3
  282. 18.38 s [gammaloop-workspace-check] Compiling numpy v0.28.0
  283. 18.42 s [gammaloop-workspace-check] Checking figment v0.10.19
  284. 18.44 s [gammaloop-workspace-check] Checking xpct v0.5.1
  285. 18.50 s [gammaloop-workspace-check] Checking ryu v1.0.23
  286. 18.51 s [gammaloop-workspace-check] Checking string-template-plus v0.4.3
  287. 18.55 s [gammaloop-workspace-check] Checking castaway v0.2.4
  288. 18.67 s [gammaloop-workspace-check] Checking toml_datetime v0.7.5+spec-1.1.0
  289. 18.69 s [gammaloop-workspace-check] Checking strum v0.27.2
  290. 18.73 s [gammaloop-workspace-check] Checking compact_str v0.9.0
  291. 18.80 s [gammaloop-workspace-check] Checking unicode-truncate v2.0.1
  292. 18.87 s [gammaloop-workspace-check] Checking kasuari v0.4.12
  293. 18.90 s [gammaloop-workspace-check] Checking toml v0.9.12+spec-1.1.0
  294. 18.93 s [gammaloop-workspace-check] Checking lru v0.16.4
  295. 18.95 s [gammaloop-workspace-check] Checking vte v0.15.0
  296. 18.99 s [gammaloop-workspace-check] Checking portable-atomic v1.13.1
  297. 19.05 s [gammaloop-workspace-check] Compiling rustpython-parser-core v0.4.0
  298. 19.11 s [gammaloop-workspace-check] Checking unit-prefix v0.5.2
  299. 19.27 s [gammaloop-workspace-check] Checking rand_distr v0.4.3
  300. 19.29 s [gammaloop-workspace-check] Compiling rustpython-ast v0.4.0
  301. 19.32 s [gammaloop-workspace-check] Checking vt100 v0.16.2
  302. 19.36 s [gammaloop-workspace-check] Checking simba v0.6.0
  303. 19.38 s [gammaloop-workspace-check] Checking ratatui-core v0.1.0
  304. 19.42 s [gammaloop-workspace-check] Checking line-clipping v0.3.7
  305. 19.42 s [gammaloop-workspace-check] Checking gimli v0.32.3
  306. 19.52 s [gammaloop-workspace-check] Checking env_logger v0.11.10
  307. 19.54 s [gammaloop-workspace-check] Compiling three-dimensional-reps v0.1.0 (/build/source/crates/three-dimensional-reps)
  308. 19.59 s [gammaloop-workspace-check] Checking adler2 v2.0.1
  309. 19.63 s [gammaloop-workspace-check] Checking thiserror v1.0.69
  310. 19.68 s [gammaloop-workspace-check] Checking derive_builder v0.11.2
  311. 19.70 s [gammaloop-workspace-check] Checking owo-colors v4.3.0
  312. 19.75 s [gammaloop-workspace-check] Checking miniz_oxide v0.8.9
  313. 19.79 s [gammaloop-workspace-check] Checking object v0.37.3
  314. 19.83 s [gammaloop-workspace-check] Checking crossterm v0.29.0
  315. 19.86 s [gammaloop-workspace-check] Checking tracing-error v0.2.1
  316. 20.02 s [gammaloop-workspace-check] Checking indicatif v0.18.4
  317. 20.04 s [gammaloop-workspace-check] Checking typed-index-collections v3.5.0
  318. 20.07 s [gammaloop-workspace-check] Checking serde-big-array v0.5.1
  319. 20.11 s [gammaloop-workspace-check] Checking amd v0.2.2
  320. 20.23 s [gammaloop-workspace-check] Checking itertools v0.11.0
  321. 20.31 s [gammaloop-workspace-check] Compiling gammaloop-tracing-filter-macros v0.1.0 (/build/source/crates/gammaloop-tracing-filter-macros)
  322. 20.33 s [gammaloop-workspace-check] Checking rustc-demangle v0.1.27
  323. 20.42 s [gammaloop-workspace-check] Checking option-ext v0.2.0
  324. 20.52 s [gammaloop-workspace-check] Checking dirs-sys v0.5.0
  325. 20.53 s [gammaloop-workspace-check] Checking ref-cast v1.0.25
  326. 20.54 s [gammaloop-workspace-check] Checking rkyv v0.7.46
  327. 20.63 s [gammaloop-workspace-check] Checking nix v0.31.2
  328. 20.67 s [gammaloop-workspace-check] Checking brotli-decompressor v4.0.3
  329. 20.68 s [gammaloop-workspace-check] Checking integer-sqrt v0.1.5
  330. 20.80 s [gammaloop-workspace-check] Checking crossbeam-channel v0.5.15
  331. 20.80 s [gammaloop-workspace-check] Checking itertools v0.12.1
  332. 20.87 s [gammaloop-workspace-check] Checking ratatui-widgets v0.3.0
  333. 20.87 s [gammaloop-workspace-check] Checking unsafe-libyaml v0.2.11
  334. 20.89 s [gammaloop-workspace-check] Checking ratatui-crossterm v0.1.0
  335. 21.11 s [gammaloop-workspace-check] Checking symlink v0.1.0
  336. 21.14 s [gammaloop-workspace-check] Checking color-spantrace v0.3.0
  337. 21.24 s [gammaloop-workspace-check] Compiling gammalooprs v0.3.4 (/build/source/crates/gammalooprs)
  338. 21.39 s [gammaloop-workspace-check] Checking tracing-appender v0.2.5
  339. 21.42 s [gammaloop-workspace-check] Checking include_dir v0.7.4
  340. 21.58 s [gammaloop-workspace-check] Checking ctrlc v3.5.2
  341. 21.60 s [gammaloop-workspace-check] Checking tracing-indicatif v0.3.14
  342. 21.75 s [gammaloop-workspace-check] Checking pathfinding v4.15.0
  343. 21.78 s [gammaloop-workspace-check] Checking dirs v6.0.0
  344. 21.79 s [gammaloop-workspace-check] Checking clarabel v0.11.1
  345. 21.85 s [gammaloop-workspace-check] Checking brotli v7.0.0
  346. 21.90 s [gammaloop-workspace-check] Checking schemars v1.2.1
  347. 22.14 s [gammaloop-workspace-check] Checking slotmap v1.1.1
  348. 22.16 s [gammaloop-workspace-check] Checking serde_yaml v0.9.34+deprecated
  349. 22.51 s [gammaloop-workspace-check] Checking json5 v0.4.1
  350. 22.52 s [gammaloop-workspace-check] Checking ratatui-macros v0.7.0
  351. 22.58 s [gammaloop-workspace-check] Checking addr2line v0.25.1
  352. 22.62 s [gammaloop-workspace-check] Checking ratatui v0.30.0
  353. 22.81 s [gammaloop-workspace-check] Checking vectorize v0.2.0
  354. 22.85 s [gammaloop-workspace-check] Checking ringbuffer v0.16.0
  355. 22.91 s [gammaloop-workspace-check] Checking base62 v2.2.4
  356. 22.93 s [gammaloop-workspace-check] Checking clap_complete v4.6.3
  357. 22.93 s [gammaloop-workspace-check] Checking rust-embed v8.11.0
  358. 23.00 s [gammaloop-workspace-check] Checking fd-lock v4.0.4
  359. 23.03 s [gammaloop-workspace-check] Checking strip-ansi-escapes v0.2.1
  360. 23.05 s [gammaloop-workspace-check] Compiling gammaloop-api v0.1.0 (/build/source/crates/gammaloop-api)
  361. 23.12 s [gammaloop-workspace-check] Checking itertools v0.13.0
  362. 23.14 s [gammaloop-workspace-check] Checking strum v0.26.3
  363. 23.15 s [gammaloop-workspace-check] Checking sysinfo v0.33.1
  364. 23.19 s [gammaloop-workspace-check] Checking shlex v1.3.0
  365. 23.27 s [gammaloop-workspace-check] Checking slab v0.4.12
  366. 23.29 s [gammaloop-workspace-check] Checking futures-task v0.3.32
  367. 23.40 s [gammaloop-workspace-check] Checking futures-core v0.3.32
  368. 23.42 s [gammaloop-workspace-check] Checking clap_complete_nushell v4.6.0
  369. 23.44 s [gammaloop-workspace-check] Checking sdd v3.0.10
  370. 23.48 s [gammaloop-workspace-check] Compiling gammaloop-integration-tests v0.1.0 (/build/source/tests)
  371. 23.54 s [gammaloop-workspace-check] Compiling test-log-core v0.2.20
  372. 23.57 s [gammaloop-workspace-check] Checking futures-util v0.3.32
  373. 23.60 s [gammaloop-workspace-check] Compiling rustc_version v0.4.1
  374. 23.62 s [gammaloop-workspace-check] Checking which v8.0.2
  375. 23.68 s [gammaloop-workspace-check] Checking scc v2.4.0
  376. 23.87 s [gammaloop-workspace-check] Checking bincode v1.3.3
  377. 24.03 s [gammaloop-workspace-check] Compiling gungraun-runner v0.18.2
  378. 24.16 s [gammaloop-workspace-check] Compiling numerica v2.2.0 (https://github.com/alphal00p/symbolica?rev=a277a8dadbaae5a8d6605f2f381991a601e1f345#a277a8da)
  379. 24.20 s [gammaloop-workspace-check] Checking backtrace v0.3.76
  380. 24.71 s [gammaloop-workspace-check] Checking nalgebra v0.29.0
  381. 24.78 s [gammaloop-workspace-check] Checking color-eyre v0.6.5
  382. 24.80 s [gammaloop-workspace-check] Checking reedline v0.42.0
  383. 24.82 s [gammaloop-workspace-check] Compiling gungraun-macros v0.8.0
  384. 25.04 s [gammaloop-workspace-check] Checking proc-macro2 v1.0.106
  385. 25.22 s [gammaloop-workspace-check] Checking base64 v0.21.7
  386. 25.54 s [gammaloop-workspace-check] Checking maplit v1.0.2
  387. 25.60 s [gammaloop-workspace-check] Checking ron v0.8.1
  388. 25.62 s [gammaloop-workspace-check] Compiling iai-callgrind-runner v0.14.2
  389. 25.65 s [gammaloop-workspace-check] Checking quote v1.0.45
  390. 25.80 s [gammaloop-workspace-check] Checking kurbo v0.13.0
  391. 25.83 s [gammaloop-workspace-check] Checking wait-timeout v0.2.1
  392. 25.95 s [gammaloop-workspace-check] Checking futures-executor v0.3.32
  393. 25.97 s [gammaloop-workspace-check] Compiling iai-callgrind v0.14.2
  394. 25.97 s [gammaloop-workspace-check] Checking quick-error v1.2.3
  395. 26.04 s [gammaloop-workspace-check] Checking bit-vec v0.8.0
  396. 26.08 s [gammaloop-workspace-check] Checking serial_test v3.4.0
  397. 26.23 s [gammaloop-workspace-check] Checking rusty-fork v0.3.1
  398. 26.29 s [gammaloop-workspace-check] Checking bit-set v0.8.0
  399. 26.34 s [gammaloop-workspace-check] Compiling test-log-macros v0.2.20
  400. 26.36 s [gammaloop-workspace-check] Checking syn v2.0.117
  401. 26.40 s [gammaloop-workspace-check] Compiling iai-callgrind-macros v0.5.1
  402. 26.42 s [gammaloop-workspace-check] Checking rand_xorshift v0.4.0
  403. 26.43 s [gammaloop-workspace-check] Checking console v0.15.11
  404. 26.59 s [gammaloop-workspace-check] Checking pathdiff v0.2.3
  405. 26.70 s [gammaloop-workspace-check] Checking unarray v0.1.4
  406. 26.83 s [gammaloop-workspace-check] Checking similar-asserts v1.7.0
  407. 26.85 s [gammaloop-workspace-check] Checking proptest v1.11.0
  408. 27.07 s [gammaloop-workspace-check] Checking clinnet v0.1.8 (/build/source/crates/clinnet)
  409. 27.07 s [gammaloop-workspace-check] Checking kurvst v0.1.0 (/build/source/crates/kurvst)
  410. 28.76 s [gammaloop-workspace-check] Compiling graphica v2.1.0 (https://github.com/alphal00p/symbolica?rev=a277a8dadbaae5a8d6605f2f381991a601e1f345#a277a8da)
  411. 29.49 s [gammaloop-workspace-check] Checking test-log v0.2.20
  412. 30.99 s [gammaloop-workspace-check] Checking statrs v0.16.1
  413. 31.52 s [gammaloop-workspace-check] Checking momtrop v0.3.0
  414. 32.65 s [gammaloop-workspace-check] Checking gungraun v0.18.2
  415. 34.53 s [gammaloop-workspace-check] Compiling pyo3-stub-gen-derive v0.17.2
  416. 34.87 s [gammaloop-workspace-check] Compiling pyo3-macros v0.28.3
  417. 40.23 s [gammaloop-workspace-check] Checking pyo3-stub-gen v0.17.2
  418. 48.58 s [gammaloop-workspace-check] Checking symbolica-utils v0.1.0 (/build/source/crates/symbolica-utils)
  419. 48.58 s [gammaloop-workspace-check] Checking spenso-macros v0.3.2 (/build/source/crates/spenso-macros)
  420. 345.96 s [gammaloop-workspace-check] Compiling gammaloop-workspace-hack v0.1.0 (/build/source/crates/gammaloop-workspace-hack)
  421. 346.41 s [gammaloop-workspace-check] Checking linnet v0.17.0 (/build/source/crates/linnet)
  422. 352.53 s [gammaloop-workspace-check] Checking spenso v0.6.0 (/build/source/crates/spenso)
  423. 353.16 s [gammaloop-workspace-check] Checking linnet-py v0.1.0 (/build/source/crates/linnet-py)
  424. 353.16 s [gammaloop-workspace-check] Checking linnest v0.1.0 (/build/source/crates/linnest)
  425. 365.41 s [gammaloop-workspace-check] Checking idenso v0.3.0 (/build/source/crates/idenso)
  426. 365.41 s [gammaloop-workspace-check] Checking gammaloop-tracing-filter v0.1.0 (/build/source/crates/gammaloop-tracing-filter)
  427. 369.25 s [gammaloop-workspace-check] Checking spenso-hep-lib v0.1.7 (/build/source/crates/spenso-hep-lib)
  428. 369.60 s [gammaloop-workspace-check] Checking spynso3 v0.1.2 (/build/source/crates/spynso3)
  429. 417.84 s [gammaloop-workspace-check] warning: unused import: `GaussianReferenceFunction`
  430. 417.84 s [gammaloop-workspace-check] --> crates/gammaloop-api/src/state.rs:38:27
  431. 417.84 s [gammaloop-workspace-check] |
  432. 417.84 s [gammaloop-workspace-check] 38 | integrands::process::{GaussianReferenceFunction, ProcessIntegrand},
  433. 417.84 s [gammaloop-workspace-check] | ^^^^^^^^^^^^^^^^^^^^^^^^^
  434. 417.84 s [gammaloop-workspace-check] |
  435. 417.84 s [gammaloop-workspace-check] = note: `#[warn(unused_imports)]` (part of `#[warn(unused)]`) on by default
  436. 417.84 s [gammaloop-workspace-check]
  437. 429.72 s [gammaloop-workspace-check] warning: `gammaloop-api` (lib) generated 1 warning (run `cargo fix --lib -p gammaloop-api` to apply 1 suggestion)
  438. 430.77 s [gammaloop-workspace-check] error[E0560]: struct `CutInfo` has no field named `lmb_channel_id`
  439. 430.77 s [gammaloop-workspace-check] --> tests/tests/test_differential.rs:86:13
  440. 430.77 s [gammaloop-workspace-check] |
  441. 430.77 s [gammaloop-workspace-check] 86 | lmb_channel_id: None,
  442. 430.77 s [gammaloop-workspace-check] | ^^^^^^^^^^^^^^ `CutInfo` does not have this field
  443. 430.77 s [gammaloop-workspace-check] |
  444. 430.77 s [gammaloop-workspace-check] = note: available fields are: `sampling_channel_id`, `sampling_channel_edge_ids`
  445. 430.77 s [gammaloop-workspace-check]
  446. 430.77 s [gammaloop-workspace-check] error[E0560]: struct `CutInfo` has no field named `lmb_channel_edge_ids`
  447. 430.77 s [gammaloop-workspace-check] --> tests/tests/test_differential.rs:87:13
  448. 430.77 s [gammaloop-workspace-check] |
  449. 430.77 s [gammaloop-workspace-check] 87 | lmb_channel_edge_ids: None,
  450. 430.77 s [gammaloop-workspace-check] | ^^^^^^^^^^^^^^^^^^^^ `CutInfo` does not have this field
  451. 430.77 s [gammaloop-workspace-check] |
  452. 430.77 s [gammaloop-workspace-check] = note: available fields are: `sampling_channel_id`, `sampling_channel_edge_ids`
  453. 430.77 s [gammaloop-workspace-check]
  454. 430.97 s [gammaloop-workspace-check] For more information about this error, try `rustc --explain E0560`.
  455. 431.00 s [gammaloop-workspace-check] error: could not compile `gammaloop-integration-tests` (test "test_differential") due to 2 previous errors
  456. 431.00 s [gammaloop-workspace-check] warning: build failed, waiting for other jobs to finish...
  457. 431.15 s [gammaloop-workspace-check] error[E0609]: no field `lmb_channel_edge_ids` on type `CutInfo`
  458. 431.15 s [gammaloop-workspace-check] --> tests/tests/test_evaluation_api.rs:311:10
  459. 431.15 s [gammaloop-workspace-check] |
  460. 431.15 s [gammaloop-workspace-check] 311 | .lmb_channel_edge_ids
  461. 431.15 s [gammaloop-workspace-check] | ^^^^^^^^^^^^^^^^^^^^ unknown field
  462. 431.15 s [gammaloop-workspace-check] |
  463. 431.15 s [gammaloop-workspace-check] = note: available fields are: `particle_pdgs`, `cut_id`, `graph_id`, `graph_group_id`, `orientation_id` ... and 2 others
  464. 431.15 s [gammaloop-workspace-check]
  465. 431.20 s [gammaloop-workspace-check] error[E0609]: no field `lmb_channel_edge_ids` on type `CutInfo`
  466. 431.20 s [gammaloop-workspace-check] --> tests/tests/test_evaluation_api.rs:591:26
  467. 431.20 s [gammaloop-workspace-check] |
  468. 431.20 s [gammaloop-workspace-check] 591 | .lmb_channel_edge_ids
  469. 431.20 s [gammaloop-workspace-check] | ^^^^^^^^^^^^^^^^^^^^ unknown field
  470. 431.20 s [gammaloop-workspace-check] |
  471. 431.20 s [gammaloop-workspace-check] = note: available fields are: `particle_pdgs`, `cut_id`, `graph_id`, `graph_group_id`, `orientation_id` ... and 2 others
  472. 431.20 s [gammaloop-workspace-check]
  473. 431.31 s [gammaloop-workspace-check] error[E0609]: no field `lmb_channel_edge_ids` on type `CutInfo`
  474. 431.31 s [gammaloop-workspace-check] --> tests/tests/test_evaluation_api.rs:1177:18
  475. 431.31 s [gammaloop-workspace-check] |
  476. 431.31 s [gammaloop-workspace-check] 1177 | .lmb_channel_edge_ids
  477. 431.31 s [gammaloop-workspace-check] | ^^^^^^^^^^^^^^^^^^^^ unknown field
  478. 431.31 s [gammaloop-workspace-check] |
  479. 431.31 s [gammaloop-workspace-check] = note: available fields are: `particle_pdgs`, `cut_id`, `graph_id`, `graph_group_id`, `orientation_id` ... and 2 others
  480. 431.31 s [gammaloop-workspace-check]
  481. 431.84 s [gammaloop-workspace-check] error[E0609]: no field `lmb_channel_edge_ids` on type `CutInfo`
  482. 431.84 s [gammaloop-workspace-check] --> tests/tests/test_evaluation_api.rs:1222:22
  483. 431.84 s [gammaloop-workspace-check] |
  484. 431.84 s [gammaloop-workspace-check] 1222 | .lmb_channel_edge_ids
  485. 431.84 s [gammaloop-workspace-check] | ^^^^^^^^^^^^^^^^^^^^ unknown field
  486. 431.84 s [gammaloop-workspace-check] |
  487. 431.84 s [gammaloop-workspace-check] = note: available fields are: `particle_pdgs`, `cut_id`, `graph_id`, `graph_group_id`, `orientation_id` ... and 2 others
  488. 431.84 s [gammaloop-workspace-check]
  489. 431.85 s [gammaloop-workspace-check] error[E0609]: no field `lmb_channel_edge_ids` on type `CutInfo`
  490. 431.85 s [gammaloop-workspace-check] --> tests/tests/test_evaluation_api.rs:1281:14
  491. 431.85 s [gammaloop-workspace-check] |
  492. 431.85 s [gammaloop-workspace-check] 1281 | .lmb_channel_edge_ids
  493. 431.85 s [gammaloop-workspace-check] | ^^^^^^^^^^^^^^^^^^^^ unknown field
  494. 431.85 s [gammaloop-workspace-check] |
  495. 431.85 s [gammaloop-workspace-check] = note: available fields are: `particle_pdgs`, `cut_id`, `graph_id`, `graph_group_id`, `orientation_id` ... and 2 others
  496. 431.85 s [gammaloop-workspace-check]
  497. 432.00 s [gammaloop-workspace-check] error[E0609]: no field `lmb_channel_edge_ids` on type `CutInfo`
  498. 432.00 s [gammaloop-workspace-check] --> tests/tests/test_evaluation_api.rs:1428:18
  499. 432.00 s [gammaloop-workspace-check] |
  500. 432.00 s [gammaloop-workspace-check] 1428 | .lmb_channel_edge_ids
  501. 432.00 s [gammaloop-workspace-check] | ^^^^^^^^^^^^^^^^^^^^ unknown field
  502. 432.00 s [gammaloop-workspace-check] |
  503. 432.00 s [gammaloop-workspace-check] = note: available fields are: `particle_pdgs`, `cut_id`, `graph_id`, `graph_group_id`, `orientation_id` ... and 2 others
  504. 432.00 s [gammaloop-workspace-check]
  505. 432.23 s [gammaloop-workspace-check] For more information about this error, try `rustc --explain E0609`.
  506. 432.25 s [gammaloop-workspace-check] error: could not compile `gammaloop-integration-tests` (test "test_evaluation_api") due to 6 previous errors
  507. 433.21 s [gammaloop-workspace-check] error[E0609]: no field `lmb_channel_id` on type `CutInfo`
  508. 433.21 s [gammaloop-workspace-check] --> tests/tests/test_runs/utils.rs:568:36
  509. 433.21 s [gammaloop-workspace-check] |
  510. 433.21 s [gammaloop-workspace-check] 568 | event.cut_info.lmb_channel_id,
  511. 433.21 s [gammaloop-workspace-check] | ^^^^^^^^^^^^^^ unknown field
  512. 433.21 s [gammaloop-workspace-check] |
  513. 433.21 s [gammaloop-workspace-check] = note: available fields are: `particle_pdgs`, `cut_id`, `graph_id`, `graph_group_id`, `orientation_id` ... and 2 others
  514. 433.21 s [gammaloop-workspace-check]
  515. 433.22 s [gammaloop-workspace-check] error[E0609]: no field `lmb_channel_id` on type `CutInfo`
  516. 433.22 s [gammaloop-workspace-check] --> tests/tests/test_runs/utils.rs:580:36
  517. 433.22 s [gammaloop-workspace-check] |
  518. 433.22 s [gammaloop-workspace-check] 580 | event.cut_info.lmb_channel_id,
  519. 433.22 s [gammaloop-workspace-check] | ^^^^^^^^^^^^^^ unknown field
  520. 433.22 s [gammaloop-workspace-check] |
  521. 433.22 s [gammaloop-workspace-check] = note: available fields are: `particle_pdgs`, `cut_id`, `graph_id`, `graph_group_id`, `orientation_id` ... and 2 others
  522. 433.22 s [gammaloop-workspace-check]
  523. 434.32 s [gammaloop-workspace-check] error: could not compile `gammaloop-integration-tests` (test "test_runs") due to 2 previous errors
  524. 435.13 s Progress: 0 of 1 built (1 failed)
  525. 435.13 s Failed to build gammaloop-workspace-check after 7m11s
  526. 435.15 s Cannot build '/nix/store/bkjn3kpkbcz17y1rdpsxdw5wids19g66-gammaloop-workspace-check-0.1.0.drv'.
  527. 435.15 s Reason: builder failed with exit code 101.
  528. 435.15 s Output paths:
  529. 435.15 s /nix/store/n8aq5rpx0fcapb64057q7plpgmsk1k0b-gammaloop-workspace-check-0.1.0
  530. 435.15 s Last 520 log lines:
  531. 435.15 s > Running phase: unpackPhase
  532. 435.15 s > unpacking source archive /nix/store/vwx01dpxvbgg3x2ag73251y99q28cn86-source
  533. 435.15 s > source root is source
  534. 435.15 s > Running phase: patchPhase
  535. 435.15 s > Executing configureCargoCommonVars
  536. 435.15 s > decompressing cargo artifacts from /nix/store/50vpxlcgfxf2d57i27v3d10zjwxxbm2r-gammaloop-workspace-deps-deps-0.1.0/target.tar.zst to target
  537. 435.15 s > Running phase: updateAutotoolsGnuConfigScriptsPhase
  538. 435.15 s > Running phase: configurePhase
  539. 435.15 s > will append /build/source/.cargo-home/config.toml with contents of /nix/store/5drf77x6km4ky7gwlrzdx9bbd6fz09g3-vendor-cargo-deps/config.toml
  540. 435.15 s > default configurePhase, nothing to do
  541. 435.15 s > Running phase: buildPhase
  542. 435.15 s > +++ command cargo --version
  543. 435.15 s > cargo 1.97.0 (c980f4866 2026-06-30)
  544. 435.15 s > +++ command cargo check --profile ci-optim --locked --workspace --features gammaloop-tracing-filter/clap,gammaloop-tracing-filter/symbolica,idenso/bincode,idenso/reference-cases,linnet/bincode,linnet/drawing,linnet/rkyv,linnet/serde,linnet/symbolica,spenso-macros/shadowing,spenso/shadowing,symbolica/tracing_max_level_info,three-dimensional-reps/display,three-dimensional-reps/eval,three-dimensional-reps/serde --all-targets
  545. 435.15 s > Checking cfg-if v1.0.4
  546. 435.15 s > Checking memchr v2.8.0
  547. 435.15 s > Checking once_cell v1.21.4
  548. 435.15 s > Checking either v1.15.0
  549. 435.15 s > Checking serde_core v1.0.228
  550. 435.15 s > Checking libc v0.2.186
  551. 435.15 s > Checking libm v0.2.16
  552. 435.15 s > Checking itoa v1.0.18
  553. 435.15 s > Checking log v0.4.29
  554. 435.15 s > Checking regex-syntax v0.8.10
  555. 435.15 s > Checking zerocopy v0.8.48
  556. 435.15 s > Checking crossbeam-utils v0.8.21
  557. 435.15 s > Checking equivalent v1.0.2
  558. 435.15 s > Checking zmij v1.0.21
  559. 435.15 s > Checking bytemuck v1.25.0
  560. 435.15 s > Checking lazy_static v1.5.0
  561. 435.15 s > Compiling target-lexicon v0.13.5
  562. 435.15 s > Checking arrayvec v0.7.6
  563. 435.15 s > Checking powerfmt v0.2.0
  564. 435.15 s > Checking num-conv v0.2.1
  565. 435.15 s > Checking itertools v0.14.0
  566. 435.15 s > Checking pin-project-lite v0.2.17
  567. 435.15 s > Checking time-core v0.1.8
  568. 435.15 s > Checking num_threads v0.1.7
  569. 435.15 s > Checking deranged v0.5.8
  570. 435.15 s > Checking tracing-core v0.1.36
  571. 435.15 s > Checking allocator-api2 v0.2.21
  572. 435.15 s > Checking foldhash v0.2.0
  573. 435.15 s > Checking safe_arch v0.7.4
  574. 435.15 s > Checking const-random v0.1.18
  575. 435.15 s > Checking winnow v1.0.2
  576. 435.15 s > Checking nu-ansi-term v0.50.3
  577. 435.15 s > Checking static_assertions v1.1.0
  578. 435.15 s > Checking unty v0.0.4
  579. 435.15 s > Checking safe_arch v1.0.0
  580. 435.15 s > Checking wide v0.7.33
  581. 435.15 s > Checking crossbeam-epoch v0.9.18
  582. 435.15 s > Checking aho-corasick v1.1.4
  583. 435.15 s > Checking hashbrown v0.16.1
  584. 435.15 s > Checking sharded-slab v0.1.7
  585. 435.15 s > Checking thread_local v1.1.9
  586. 435.15 s > Checking crossbeam-deque v0.8.6
  587. 435.15 s > Checking tracing v0.1.44
  588. 435.15 s > Checking tracing-log v0.2.0
  589. 435.15 s > Checking rayon-core v1.13.0
  590. 435.15 s > Checking num-traits v0.2.19
  591. 435.15 s > Checking az v1.3.0
  592. 435.15 s > Checking toml_writer v1.1.1+spec-1.1.0
  593. 435.15 s > Checking indenter v0.3.4
  594. 435.15 s > Checking wide v1.3.0
  595. 435.15 s > Compiling phf_shared v0.11.3
  596. 435.15 s > Checking anyhow v1.0.102
  597. 435.15 s > Checking rayon v1.12.0
  598. 435.15 s > Checking utf8parse v0.2.2
  599. 435.15 s > Checking alloc-no-stdlib v2.0.4
  600. 435.15 s > Checking getrandom v0.3.4
  601. 435.15 s > Checking time v0.3.47
  602. 435.15 s > Checking gmp-mpfr-sys v1.7.1
  603. 435.15 s > Checking dyn-clone v1.0.20
  604. 435.15 s > Checking rawpointer v0.2.1
  605. 435.15 s > Checking rand_core v0.9.5
  606. 435.15 s > Checking alloc-stdlib v0.2.2
  607. 435.15 s > Checking matrixmultiply v0.3.10
  608. 435.15 s > Checking approx v0.5.1
  609. 435.15 s > Checking regex-automata v0.4.14
  610. 435.15 s > Checking num-integer v0.1.46
  611. 435.15 s > Checking anstyle-parse v1.0.0
  612. 435.15 s > Checking is_terminal_polyfill v1.70.2
  613. 435.15 s > Checking anstyle v1.0.14
  614. 435.15 s > Checking anstyle-query v1.1.5
  615. 435.15 s > Checking colored v3.1.1
  616. 435.15 s > Checking toml_parser v1.1.2+spec-1.1.0
  617. 435.15 s > Checking colorchoice v1.0.5
  618. 435.15 s > Compiling phf_generator v0.11.3
  619. 435.15 s > Checking eyre v0.6.12
  620. 435.15 s > Checking anstream v1.0.0
  621. 435.15 s > Checking bitflags v1.3.2
  622. 435.15 s > Checking unicode-width v0.2.2
  623. 435.15 s > Checking brotli-decompressor v5.0.0
  624. 435.15 s > Checking region v3.0.2
  625. 435.15 s > Compiling phf_codegen v0.11.3
  626. 435.15 s > Checking wasmtime-jit-icache-coherence v34.0.2
  627. 435.15 s > Checking hugepage-rs v0.1.1
  628. 435.15 s > Checking spec_math v0.1.6
  629. 435.15 s > Checking inventory v0.3.24
  630. 435.15 s > Checking thiserror v2.0.18
  631. 435.15 s > Compiling getopts v0.2.24
  632. 435.15 s > Checking libloading v0.9.0
  633. 435.15 s > Checking append-only-vec v0.1.8
  634. 435.15 s > Checking bytes v1.11.1
  635. 435.15 s > Checking byteorder v1.5.0
  636. 435.15 s > Compiling pyo3-build-config v0.28.3
  637. 435.15 s > Checking self_cell v1.2.2
  638. 435.15 s > Checking serde v1.0.228
  639. 435.15 s > Checking serde_json v1.0.149
  640. 435.15 s > Checking bitflags v2.11.1
  641. 435.15 s > Checking serde_spanned v1.1.1
  642. 435.15 s > Checking toml_datetime v1.1.1+spec-1.1.0
  643. 435.15 s > Checking tinyjson v2.5.1
  644. 435.15 s > Compiling unic-char-range v0.9.0
  645. 435.15 s > Compiling unic-common v0.9.0
  646. 435.15 s > Compiling unicode_names2_generator v1.3.0
  647. 435.15 s > Checking linux-raw-sys v0.12.1
  648. 435.15 s > Compiling unic-ucd-version v0.9.0
  649. 435.15 s > Checking toml v1.1.2+spec-1.1.0
  650. 435.15 s > Compiling unic-char-property v0.9.0
  651. 435.15 s > Compiling is-macro v0.3.7
  652. 435.15 s > Compiling rustpython-parser-vendored v0.4.0
  653. 435.15 s > Checking iana-time-zone v0.1.65
  654. 435.15 s > Compiling rustpython-parser v0.4.0
  655. 435.15 s > Checking rustix v1.1.4
  656. 435.15 s > Checking smallvec v1.15.1
  657. 435.15 s > Checking num-complex v0.4.6
  658. 435.15 s > Checking tracing-serde v0.2.0
  659. 435.15 s > Checking bincode v2.0.1
  660. 435.15 s > Checking brotli v8.0.2
  661. 435.15 s > Checking smartstring v1.0.1
  662. 435.15 s > Checking chrono v0.4.44
  663. 435.15 s > Compiling phf v0.11.3
  664. 435.15 s > Checking ppv-lite86 v0.2.21
  665. 435.15 s > Checking ahash v0.8.12
  666. 435.15 s > Checking simba v0.9.1
  667. 435.15 s > Checking rustc-hash v2.1.2
  668. 435.15 s > Checking ndarray v0.17.2
  669. 435.15 s > Compiling unic-ucd-ident v0.9.0
  670. 435.15 s > Compiling unic-emoji-char v0.9.0
  671. 435.15 s > Compiling lalrpop-util v0.20.2
  672. 435.15 s > Compiling rustc-hash v1.1.0
  673. 435.15 s > Checking rand_chacha v0.9.0
  674. 435.15 s > Checking rug v1.30.0
  675. 435.15 s > Compiling symbolica v2.2.0 (https://github.com/alphal00p/symbolica?rev=a277a8dadbaae5a8d6605f2f381991a601e1f345#a277a8da)
  676. 435.15 s > Checking unicode-segmentation v1.13.2
  677. 435.15 s > Checking typenum v1.20.0
  678. 435.15 s > Checking rand v0.9.4
  679. 435.15 s > Checking getrandom v0.2.17
  680. 435.15 s > Checking scopeguard v1.2.0
  681. 435.15 s > Checking lock_api v0.4.14
  682. 435.15 s > Checking parking_lot_core v0.9.12
  683. 435.15 s > Checking matchers v0.2.0
  684. 435.15 s > Checking regex v1.12.3
  685. 435.15 s > Checking unicode-ident v1.0.24
  686. 435.15 s > Checking tracing-subscriber v0.3.23
  687. 435.15 s > Checking hashbrown v0.17.0
  688. 435.15 s > Checking symjit v2.21.0
  689. 435.15 s > Checking parking_lot v0.12.5
  690. 435.15 s > Checking errno v0.3.14
  691. 435.15 s > Checking unicase v2.9.0
  692. 435.15 s > Checking strsim v0.11.1
  693. 435.15 s > Checking clap_lex v1.1.0
  694. 435.15 s > Checking signal-hook-registry v1.4.8
  695. 435.15 s > Checking vte v0.14.1
  696. 435.15 s > Checking generic-array v0.14.7
  697. 435.15 s > Checking same-file v1.0.6
  698. 435.15 s > Checking half v2.7.1
  699. 435.15 s > Checking walkdir v2.5.0
  700. 435.15 s > Checking terminal_size v0.4.4
  701. 435.15 s > Checking indexmap v2.14.0
  702. 435.15 s > Checking mio v1.2.0
  703. 435.15 s > Checking signal-hook v0.3.18
  704. 435.15 s > Checking ciborium-io v0.2.2
  705. 435.15 s > Checking clap_builder v4.6.0
  706. 435.15 s > Checking minimal-lexical v0.2.1
  707. 435.15 s > Checking block-buffer v0.10.4
  708. 435.15 s > Checking crypto-common v0.1.7
  709. 435.15 s > Checking ciborium-ll v0.2.2
  710. 435.15 s > Checking digest v0.10.7
  711. 435.15 s > Checking nom v7.1.3
  712. 435.15 s > Checking signal-hook-mio v0.2.5
  713. 435.15 s > Checking derive_more v2.1.1
  714. 435.15 s > Checking num-bigint v0.4.6
  715. 435.15 s > Checking console v0.16.3
  716. 435.15 s > Checking bstr v1.12.1
  717. 435.15 s > Checking linux-raw-sys v0.4.15
  718. 435.15 s > Checking cpufeatures v0.2.17
  719. 435.15 s > Checking winnow v0.7.15
  720. 435.15 s > Checking rustix v0.38.44
  721. 435.15 s > Checking sha2 v0.10.9
  722. 435.15 s > Checking globset v0.4.18
  723. 435.15 s > Checking ciborium v0.2.2
  724. 435.15 s > Checking getrandom v0.4.2
  725. 435.15 s > Checking rand_core v0.6.4
  726. 435.15 s > Checking plotters-backend v0.3.7
  727. 435.15 s > Checking fastrand v2.4.1
  728. 435.15 s > Compiling unicode_names2 v1.3.0
  729. 435.15 s > Checking fnv v1.0.7
  730. 435.15 s > Checking crossterm v0.28.1
  731. 435.15 s > Checking rust-embed-utils v8.11.0
  732. 435.15 s > Checking plotters-svg v0.3.7
  733. 435.15 s > Checking tempfile v3.27.0
  734. 435.15 s > Checking toml_datetime v0.6.11
  735. 435.15 s > Checking ansitok v0.3.0
  736. 435.15 s > Checking serde_spanned v0.6.9
  737. 435.15 s > Checking itertools v0.10.5
  738. 435.15 s > Checking clap v4.6.1
  739. 435.15 s > Checking cast v0.3.0
  740. 435.15 s > Checking toml_write v0.1.2
  741. 435.15 s > Checking tap v1.0.1
  742. 435.15 s > Checking plotters v0.3.7
  743. 435.15 s > Checking wyz v0.5.1
  744. 435.15 s > Checking rand_chacha v0.3.1
  745. 435.15 s > Checking radium v0.7.0
  746. 435.15 s > Checking typeid v1.0.3
  747. 435.15 s > Checking similar v2.7.0
  748. 435.15 s > Checking ansi-str v0.9.0
  749. 435.15 s > Checking tinytemplate v1.2.1
  750. 435.15 s > Checking is-terminal v0.4.17
  751. 435.15 s > Checking oorandom v11.1.5
  752. 435.15 s > Checking funty v2.0.0
  753. 435.15 s > Checking bytecount v0.6.9
  754. 435.15 s > Checking anes v0.1.6
  755. 435.15 s > Checking xprec v0.2.2
  756. 435.15 s > Checking rand v0.8.6
  757. 435.15 s > Checking papergrid v0.17.0
  758. 435.15 s > Checking testing_table v0.3.0
  759. 435.15 s > Checking ron v0.12.1
  760. 435.15 s > Checking toml_edit v0.25.11+spec-1.1.0
  761. 435.15 s > Checking uncased v0.9.10
  762. 435.15 s > Checking env_filter v1.0.1
  763. 435.15 s > Checking jiff v0.2.24
  764. 435.15 s > Checking toml_edit v0.22.27
  765. 435.15 s > Checking bitvec v1.0.1
  766. 435.15 s > Checking ptr_meta v0.1.4
  767. 435.15 s > Checking simdutf8 v0.1.5
  768. 435.15 s > Checking ucd-trie v0.1.7
  769. 435.15 s > Checking criterion-plot v0.5.0
  770. 435.15 s > Checking pest v2.8.6
  771. 435.15 s > Checking bytecheck v0.6.12
  772. 435.15 s > Checking ahash v0.7.8
  773. 435.15 s > Checking approx v0.4.0
  774. 435.15 s > Checking hashbrown v0.12.3
  775. 435.15 s > Checking criterion v0.5.1
  776. 435.15 s > Checking seahash v4.1.0
  777. 435.15 s > Checking rend v0.4.2
  778. 435.15 s > Checking cgmath v0.18.0
  779. 435.15 s > Checking num-rational v0.4.2
  780. 435.15 s > Checking insta v1.47.2
  781. 435.15 s > Checking num-iter v0.1.45
  782. 435.15 s > Checking ref-ops v0.2.5
  783. 435.15 s > Checking num v0.4.3
  784. 435.15 s > Checking tabled v0.20.0
  785. 435.15 s > Checking rand_xoshiro v0.6.0
  786. 435.15 s > Checking features v0.10.0
  787. 435.15 s > Checking gat-lending-iterator v0.1.8
  788. 435.15 s > Checking constcat v0.5.1
  789. 435.15 s > Checking dot-parser v0.5.1
  790. 435.15 s > Checking colored v2.2.0
  791. 435.15 s > Checking cpufeatures v0.3.0
  792. 435.15 s > Checking constant_time_eq v0.4.2
  793. 435.15 s > Checking arrayref v0.3.9
  794. 435.15 s > Checking base64 v0.22.1
  795. 435.15 s > Checking blake3 v1.8.5
  796. 435.15 s > Checking siphasher v1.0.2
  797. 435.15 s > Checking joinery v2.1.0
  798. 435.15 s > Checking phf_shared v0.13.1
  799. 435.15 s > Checking toml v0.8.23
  800. 435.15 s > Checking titlecase v2.2.1
  801. 435.15 s > Checking subprocess v0.2.15
  802. 435.15 s > Checking rust_lisp v0.18.0
  803. 435.15 s > Compiling vakint v0.1.2 (/build/source/crates/vakint)
  804. 435.15 s > Checking phf v0.13.1
  805. 435.15 s > Checking version-compare v0.2.1
  806. 435.15 s > Compiling pyo3-macros-backend v0.28.3
  807. 435.15 s > Compiling pyo3-ffi v0.28.3
  808. 435.15 s > Compiling pyo3 v0.28.3
  809. 435.15 s > Compiling numpy v0.28.0
  810. 435.15 s > Checking figment v0.10.19
  811. 435.15 s > Checking xpct v0.5.1
  812. 435.15 s > Checking ryu v1.0.23
  813. 435.15 s > Checking string-template-plus v0.4.3
  814. 435.15 s > Checking castaway v0.2.4
  815. 435.15 s > Checking toml_datetime v0.7.5+spec-1.1.0
  816. 435.15 s > Checking strum v0.27.2
  817. 435.15 s > Checking compact_str v0.9.0
  818. 435.15 s > Checking unicode-truncate v2.0.1
  819. 435.15 s > Checking kasuari v0.4.12
  820. 435.15 s > Checking toml v0.9.12+spec-1.1.0
  821. 435.15 s > Checking lru v0.16.4
  822. 435.15 s > Checking vte v0.15.0
  823. 435.15 s > Checking portable-atomic v1.13.1
  824. 435.15 s > Compiling rustpython-parser-core v0.4.0
  825. 435.15 s > Checking unit-prefix v0.5.2
  826. 435.15 s > Checking rand_distr v0.4.3
  827. 435.15 s > Compiling rustpython-ast v0.4.0
  828. 435.15 s > Checking vt100 v0.16.2
  829. 435.15 s > Checking simba v0.6.0
  830. 435.15 s > Checking ratatui-core v0.1.0
  831. 435.15 s > Checking line-clipping v0.3.7
  832. 435.15 s > Checking gimli v0.32.3
  833. 435.15 s > Checking env_logger v0.11.10
  834. 435.15 s > Compiling three-dimensional-reps v0.1.0 (/build/source/crates/three-dimensional-reps)
  835. 435.15 s > Checking adler2 v2.0.1
  836. 435.15 s > Checking thiserror v1.0.69
  837. 435.15 s > Checking derive_builder v0.11.2
  838. 435.15 s > Checking owo-colors v4.3.0
  839. 435.15 s > Checking miniz_oxide v0.8.9
  840. 435.15 s > Checking object v0.37.3
  841. 435.15 s > Checking crossterm v0.29.0
  842. 435.15 s > Checking tracing-error v0.2.1
  843. 435.15 s > Checking indicatif v0.18.4
  844. 435.15 s > Checking typed-index-collections v3.5.0
  845. 435.15 s > Checking serde-big-array v0.5.1
  846. 435.15 s > Checking amd v0.2.2
  847. 435.15 s > Checking itertools v0.11.0
  848. 435.15 s > Compiling gammaloop-tracing-filter-macros v0.1.0 (/build/source/crates/gammaloop-tracing-filter-macros)
  849. 435.15 s > Checking rustc-demangle v0.1.27
  850. 435.15 s > Checking option-ext v0.2.0
  851. 435.15 s > Checking dirs-sys v0.5.0
  852. 435.15 s > Checking ref-cast v1.0.25
  853. 435.15 s > Checking rkyv v0.7.46
  854. 435.15 s > Checking nix v0.31.2
  855. 435.15 s > Checking brotli-decompressor v4.0.3
  856. 435.15 s > Checking integer-sqrt v0.1.5
  857. 435.15 s > Checking crossbeam-channel v0.5.15
  858. 435.15 s > Checking itertools v0.12.1
  859. 435.15 s > Checking ratatui-widgets v0.3.0
  860. 435.15 s > Checking unsafe-libyaml v0.2.11
  861. 435.15 s > Checking ratatui-crossterm v0.1.0
  862. 435.15 s > Checking symlink v0.1.0
  863. 435.15 s > Checking color-spantrace v0.3.0
  864. 435.15 s > Compiling gammalooprs v0.3.4 (/build/source/crates/gammalooprs)
  865. 435.15 s > Checking tracing-appender v0.2.5
  866. 435.15 s > Checking include_dir v0.7.4
  867. 435.15 s > Checking ctrlc v3.5.2
  868. 435.15 s > Checking tracing-indicatif v0.3.14
  869. 435.15 s > Checking pathfinding v4.15.0
  870. 435.15 s > Checking dirs v6.0.0
  871. 435.15 s > Checking clarabel v0.11.1
  872. 435.15 s > Checking brotli v7.0.0
  873. 435.15 s > Checking schemars v1.2.1
  874. 435.15 s > Checking slotmap v1.1.1
  875. 435.15 s > Checking serde_yaml v0.9.34+deprecated
  876. 435.15 s > Checking json5 v0.4.1
  877. 435.15 s > Checking ratatui-macros v0.7.0
  878. 435.15 s > Checking addr2line v0.25.1
  879. 435.15 s > Checking ratatui v0.30.0
  880. 435.15 s > Checking vectorize v0.2.0
  881. 435.15 s > Checking ringbuffer v0.16.0
  882. 435.15 s > Checking base62 v2.2.4
  883. 435.15 s > Checking clap_complete v4.6.3
  884. 435.15 s > Checking rust-embed v8.11.0
  885. 435.15 s > Checking fd-lock v4.0.4
  886. 435.15 s > Checking strip-ansi-escapes v0.2.1
  887. 435.15 s > Compiling gammaloop-api v0.1.0 (/build/source/crates/gammaloop-api)
  888. 435.15 s > Checking itertools v0.13.0
  889. 435.15 s > Checking strum v0.26.3
  890. 435.15 s > Checking sysinfo v0.33.1
  891. 435.15 s > Checking shlex v1.3.0
  892. 435.15 s > Checking slab v0.4.12
  893. 435.15 s > Checking futures-task v0.3.32
  894. 435.15 s > Checking futures-core v0.3.32
  895. 435.15 s > Checking clap_complete_nushell v4.6.0
  896. 435.15 s > Checking sdd v3.0.10
  897. 435.15 s > Compiling gammaloop-integration-tests v0.1.0 (/build/source/tests)
  898. 435.15 s > Compiling test-log-core v0.2.20
  899. 435.15 s > Checking futures-util v0.3.32
  900. 435.15 s > Compiling rustc_version v0.4.1
  901. 435.15 s > Checking which v8.0.2
  902. 435.15 s > Checking scc v2.4.0
  903. 435.15 s > Checking bincode v1.3.3
  904. 435.15 s > Compiling gungraun-runner v0.18.2
  905. 435.15 s > Compiling numerica v2.2.0 (https://github.com/alphal00p/symbolica?rev=a277a8dadbaae5a8d6605f2f381991a601e1f345#a277a8da)
  906. 435.15 s > Checking backtrace v0.3.76
  907. 435.15 s > Checking nalgebra v0.29.0
  908. 435.15 s > Checking color-eyre v0.6.5
  909. 435.15 s > Checking reedline v0.42.0
  910. 435.15 s > Compiling gungraun-macros v0.8.0
  911. 435.15 s > Checking proc-macro2 v1.0.106
  912. 435.15 s > Checking base64 v0.21.7
  913. 435.15 s > Checking maplit v1.0.2
  914. 435.15 s > Checking ron v0.8.1
  915. 435.15 s > Compiling iai-callgrind-runner v0.14.2
  916. 435.15 s > Checking quote v1.0.45
  917. 435.15 s > Checking kurbo v0.13.0
  918. 435.15 s > Checking wait-timeout v0.2.1
  919. 435.15 s > Checking futures-executor v0.3.32
  920. 435.15 s > Compiling iai-callgrind v0.14.2
  921. 435.15 s > Checking quick-error v1.2.3
  922. 435.15 s > Checking bit-vec v0.8.0
  923. 435.15 s > Checking serial_test v3.4.0
  924. 435.15 s > Checking rusty-fork v0.3.1
  925. 435.15 s > Checking bit-set v0.8.0
  926. 435.15 s > Compiling test-log-macros v0.2.20
  927. 435.15 s > Checking syn v2.0.117
  928. 435.15 s > Compiling iai-callgrind-macros v0.5.1
  929. 435.15 s > Checking rand_xorshift v0.4.0
  930. 435.15 s > Checking console v0.15.11
  931. 435.15 s > Checking pathdiff v0.2.3
  932. 435.15 s > Checking unarray v0.1.4
  933. 435.15 s > Checking similar-asserts v1.7.0
  934. 435.15 s > Checking proptest v1.11.0
  935. 435.15 s > Checking clinnet v0.1.8 (/build/source/crates/clinnet)
  936. 435.15 s > Checking kurvst v0.1.0 (/build/source/crates/kurvst)
  937. 435.15 s > Compiling graphica v2.1.0 (https://github.com/alphal00p/symbolica?rev=a277a8dadbaae5a8d6605f2f381991a601e1f345#a277a8da)
  938. 435.15 s > Checking test-log v0.2.20
  939. 435.15 s > Checking statrs v0.16.1
  940. 435.15 s > Checking momtrop v0.3.0
  941. 435.15 s > Checking gungraun v0.18.2
  942. 435.15 s > Compiling pyo3-stub-gen-derive v0.17.2
  943. 435.15 s > Compiling pyo3-macros v0.28.3
  944. 435.15 s > Checking pyo3-stub-gen v0.17.2
  945. 435.15 s > Checking symbolica-utils v0.1.0 (/build/source/crates/symbolica-utils)
  946. 435.15 s > Checking spenso-macros v0.3.2 (/build/source/crates/spenso-macros)
  947. 435.15 s > Compiling gammaloop-workspace-hack v0.1.0 (/build/source/crates/gammaloop-workspace-hack)
  948. 435.15 s > Checking linnet v0.17.0 (/build/source/crates/linnet)
  949. 435.15 s > Checking spenso v0.6.0 (/build/source/crates/spenso)
  950. 435.15 s > Checking linnet-py v0.1.0 (/build/source/crates/linnet-py)
  951. 435.15 s > Checking linnest v0.1.0 (/build/source/crates/linnest)
  952. 435.15 s > Checking idenso v0.3.0 (/build/source/crates/idenso)
  953. 435.15 s > Checking gammaloop-tracing-filter v0.1.0 (/build/source/crates/gammaloop-tracing-filter)
  954. 435.15 s > Checking spenso-hep-lib v0.1.7 (/build/source/crates/spenso-hep-lib)
  955. 435.15 s > Checking spynso3 v0.1.2 (/build/source/crates/spynso3)
  956. 435.15 s > warning: unused import: `GaussianReferenceFunction`
  957. 435.15 s > --> crates/gammaloop-api/src/state.rs:38:27
  958. 435.15 s > |
  959. 435.15 s > 38 | integrands::process::{GaussianReferenceFunction, ProcessIntegrand},
  960. 435.15 s > | ^^^^^^^^^^^^^^^^^^^^^^^^^
  961. 435.15 s > |
  962. 435.15 s > = note: `#[warn(unused_imports)]` (part of `#[warn(unused)]`) on by default
  963. 435.15 s >
  964. 435.15 s > warning: `gammaloop-api` (lib) generated 1 warning (run `cargo fix --lib -p gammaloop-api` to apply 1 suggestion)
  965. 435.15 s > error[E0560]: struct `CutInfo` has no field named `lmb_channel_id`
  966. 435.15 s > --> tests/tests/test_differential.rs:86:13
  967. 435.15 s > |
  968. 435.15 s > 86 | lmb_channel_id: None,
  969. 435.15 s > | ^^^^^^^^^^^^^^ `CutInfo` does not have this field
  970. 435.15 s > |
  971. 435.15 s > = note: available fields are: `sampling_channel_id`, `sampling_channel_edge_ids`
  972. 435.15 s >
  973. 435.15 s > error[E0560]: struct `CutInfo` has no field named `lmb_channel_edge_ids`
  974. 435.15 s > --> tests/tests/test_differential.rs:87:13
  975. 435.15 s > |
  976. 435.15 s > 87 | lmb_channel_edge_ids: None,
  977. 435.15 s > | ^^^^^^^^^^^^^^^^^^^^ `CutInfo` does not have this field
  978. 435.15 s > |
  979. 435.15 s > = note: available fields are: `sampling_channel_id`, `sampling_channel_edge_ids`
  980. 435.15 s >
  981. 435.15 s > For more information about this error, try `rustc --explain E0560`.
  982. 435.15 s > error: could not compile `gammaloop-integration-tests` (test "test_differential") due to 2 previous errors
  983. 435.15 s > warning: build failed, waiting for other jobs to finish...
  984. 435.15 s > error[E0609]: no field `lmb_channel_edge_ids` on type `CutInfo`
  985. 435.15 s > --> tests/tests/test_evaluation_api.rs:311:10
  986. 435.15 s > |
  987. 435.15 s > 311 | .lmb_channel_edge_ids
  988. 435.15 s > | ^^^^^^^^^^^^^^^^^^^^ unknown field
  989. 435.15 s > |
  990. 435.15 s > = note: available fields are: `particle_pdgs`, `cut_id`, `graph_id`, `graph_group_id`, `orientation_id` ... and 2 others
  991. 435.15 s >
  992. 435.15 s > error[E0609]: no field `lmb_channel_edge_ids` on type `CutInfo`
  993. 435.15 s > --> tests/tests/test_evaluation_api.rs:591:26
  994. 435.15 s > |
  995. 435.15 s > 591 | .lmb_channel_edge_ids
  996. 435.15 s > | ^^^^^^^^^^^^^^^^^^^^ unknown field
  997. 435.15 s > |
  998. 435.15 s > = note: available fields are: `particle_pdgs`, `cut_id`, `graph_id`, `graph_group_id`, `orientation_id` ... and 2 others
  999. 435.15 s >
  1000. 435.15 s > error[E0609]: no field `lmb_channel_edge_ids` on type `CutInfo`
  1001. 435.15 s > --> tests/tests/test_evaluation_api.rs:1177:18
  1002. 435.15 s > |
  1003. 435.15 s > 1177 | .lmb_channel_edge_ids
  1004. 435.15 s > | ^^^^^^^^^^^^^^^^^^^^ unknown field
  1005. 435.15 s > |
  1006. 435.15 s > = note: available fields are: `particle_pdgs`, `cut_id`, `graph_id`, `graph_group_id`, `orientation_id` ... and 2 others
  1007. 435.15 s >
  1008. 435.15 s > error[E0609]: no field `lmb_channel_edge_ids` on type `CutInfo`
  1009. 435.15 s > --> tests/tests/test_evaluation_api.rs:1222:22
  1010. 435.15 s > |
  1011. 435.15 s > 1222 | .lmb_channel_edge_ids
  1012. 435.15 s > | ^^^^^^^^^^^^^^^^^^^^ unknown field
  1013. 435.15 s > |
  1014. 435.15 s > = note: available fields are: `particle_pdgs`, `cut_id`, `graph_id`, `graph_group_id`, `orientation_id` ... and 2 others
  1015. 435.15 s >
  1016. 435.15 s > error[E0609]: no field `lmb_channel_edge_ids` on type `CutInfo`
  1017. 435.15 s > --> tests/tests/test_evaluation_api.rs:1281:14
  1018. 435.15 s > |
  1019. 435.15 s > 1281 | .lmb_channel_edge_ids
  1020. 435.15 s > | ^^^^^^^^^^^^^^^^^^^^ unknown field
  1021. 435.15 s > |
  1022. 435.15 s > = note: available fields are: `particle_pdgs`, `cut_id`, `graph_id`, `graph_group_id`, `orientation_id` ... and 2 others
  1023. 435.15 s >
  1024. 435.15 s > error[E0609]: no field `lmb_channel_edge_ids` on type `CutInfo`
  1025. 435.15 s > --> tests/tests/test_evaluation_api.rs:1428:18
  1026. 435.15 s > |
  1027. 435.15 s > 1428 | .lmb_channel_edge_ids
  1028. 435.15 s > | ^^^^^^^^^^^^^^^^^^^^ unknown field
  1029. 435.15 s > |
  1030. 435.15 s > = note: available fields are: `particle_pdgs`, `cut_id`, `graph_id`, `graph_group_id`, `orientation_id` ... and 2 others
  1031. 435.15 s >
  1032. 435.15 s > For more information about this error, try `rustc --explain E0609`.
  1033. 435.15 s > error: could not compile `gammaloop-integration-tests` (test "test_evaluation_api") due to 6 previous errors
  1034. 435.15 s > error[E0609]: no field `lmb_channel_id` on type `CutInfo`
  1035. 435.15 s > --> tests/tests/test_runs/utils.rs:568:36
  1036. 435.15 s > |
  1037. 435.15 s > 568 | event.cut_info.lmb_channel_id,
  1038. 435.15 s > | ^^^^^^^^^^^^^^ unknown field
  1039. 435.15 s > |
  1040. 435.15 s > = note: available fields are: `particle_pdgs`, `cut_id`, `graph_id`, `graph_group_id`, `orientation_id` ... and 2 others
  1041. 435.15 s >
  1042. 435.15 s > error[E0609]: no field `lmb_channel_id` on type `CutInfo`
  1043. 435.15 s > --> tests/tests/test_runs/utils.rs:580:36
  1044. 435.15 s > |
  1045. 435.15 s > 580 | event.cut_info.lmb_channel_id,
  1046. 435.15 s > | ^^^^^^^^^^^^^^ unknown field
  1047. 435.15 s > |
  1048. 435.15 s > = note: available fields are: `particle_pdgs`, `cut_id`, `graph_id`, `graph_group_id`, `orientation_id` ... and 2 others
  1049. 435.15 s >
  1050. 435.15 s > error: could not compile `gammaloop-integration-tests` (test "test_runs") due to 2 previous errors
  1051. 435.15 s For full logs, run:
  1052. 435.15 s nix log /nix/store/bkjn3kpkbcz17y1rdpsxdw5wids19g66-gammaloop-workspace-check-0.1.0.drv
  1053. 435.30 s Build failed.