test packages.x86_64-linux.nix-ci-check-gammaloop-nextest-integration

Reproduce this run
Original Run
  1. 0.01 s $ /nix/store/61685rbaxmpigwi3z23i33sv3jyfl70q-coreutils-9.11/bin/timeout --kill-after=15s 7200s /nix/store/wknkybkzrc16r11vk5vrykh4wmw7a353-nix-2.34.8/bin/nix --extra-experimental-features nix-command --extra-experimental-features flakes flake clone git+https://github.com/alphal00p/gammaloop --dest /tmp/nix-ci-worker/stable-pwd/repo/
  2. 0.08 s Cloning into '/tmp/nix-ci-worker/stable-pwd/repo'...
  3. 1.35 s remote: Enumerating objects: 108237, done.
  4. 1.46 s remote: Counting objects: 0% (1/11633) remote: Counting objects: 1% (117/11633) remote: Counting objects: 2% (233/11633) remote: Counting objects: 3% (349/11633) remote: Counting objects: 4% (466/11633) remote: Counting objects: 5% (582/11633) remote: Counting objects: 6% (698/11633) remote: Counting objects: 7% (815/11633) remote: Counting objects: 8% (931/11633) remote: Counting objects: 9% (1047/11633) remote: Counting objects: 10% (1164/11633) remote: Counting objects: 11% (1280/11633) remote: Counting objects: 12% (1396/11633) remote: Counting objects: 13% (1513/11633) remote: Counting objects: 14% (1629/11633) remote: Counting objects: 15% (1745/11633) remote: Counting objects: 16% (1862/11633) remote: Counting objects: 17% (1978/11633) remote: Counting objects: 18% (2094/11633) remote: Counting objects: 19% (2211/11633) remote: Counting objects: 20% (2327/11633) remote: Counting objects: 21% (2443/11633) remote: Counting objects: 22% (2560/11633) remote: Counting objects: 23% (2676/11633) remote: Counting objects: 24% (2792/11633) remote: Counting objects: 25% (2909/11633) remote: Counting objects: 26% (3025/11633) remote: Counting objects: 27% (3141/11633) remote: Counting objects: 28% (3258/11633) remote: Counting objects: 29% (3374/11633) remote: Counting objects: 30% (3490/11633) remote: Counting objects: 31% (3607/11633) remote: Counting objects: 32% (3723/11633) remote: Counting objects: 33% (3839/11633) remote: Counting objects: 34% (3956/11633) remote: Counting objects: 35% (4072/11633) remote: Counting objects: 36% (4188/11633) remote: Counting objects: 37% (4305/11633) remote: Counting objects: 38% (4421/11633) remote: Counting objects: 39% (4537/11633) remote: Counting objects: 40% (4654/11633) remote: Counting objects: 41% (4770/11633) remote: Counting objects: 42% (4886/11633) remote: Counting objects: 43% (5003/11633) remote: Counting objects: 44% (5119/11633) remote: Counting objects: 45% (5235/11633) remote: Counting objects: 46% (5352/11633) remote: Counting objects: 47% (5468/11633) remote: Counting objects: 48% (5584/11633) remote: Counting objects: 49% (5701/11633) remote: Counting objects: 50% (5817/11633) remote: Counting objects: 51% (5933/11633) remote: Counting objects: 52% (6050/11633) remote: Counting objects: 53% (6166/11633) remote: Counting objects: 54% (6282/11633) remote: Counting objects: 55% (6399/11633) remote: Counting objects: 56% (6515/11633) remote: Counting objects: 57% (6631/11633) remote: Counting objects: 58% (6748/11633) remote: Counting objects: 59% (6864/11633) remote: Counting objects: 60% (6980/11633) remote: Counting objects: 61% (7097/11633) remote: Counting objects: 62% (7213/11633) remote: Counting objects: 63% (7329/11633) remote: Counting objects: 64% (7446/11633) remote: Counting objects: 65% (7562/11633) remote: Counting objects: 66% (7678/11633) remote: Counting objects: 67% (7795/11633) remote: Counting objects: 68% (7911/11633) remote: Counting objects: 69% (8027/11633) remote: Counting objects: 70% (8144/11633) remote: Counting objects: 71% (8260/11633) remote: Counting objects: 72% (8376/11633) remote: Counting objects: 73% (8493/11633) remote: Counting objects: 74% (8609/11633) remote: Counting objects: 75% (8725/11633) remote: Counting objects: 76% (8842/11633) remote: Counting objects: 77% (8958/11633) remote: Counting objects: 78% (9074/11633) remote: Counting objects: 79% (9191/11633) remote: Counting objects: 80% (9307/11633) remote: Counting objects: 81% (9423/11633) remote: Counting objects: 82% (9540/11633) remote: Counting objects: 83% (9656/11633) remote: Counting objects: 84% (9772/11633) remote: Counting objects: 85% (9889/11633) remote: Counting objects: 86% (10005/11633) remote: Counting objects: 87% (10121/11633) remote: Counting objects: 88% (10238/11633) remote: Counting objects: 89% (10354/11633) remote: Counting objects: 90% (10470/11633) remote: Counting objects: 91% (10587/11633) remote: Counting objects: 92% (10703/11633) remote: Counting objects: 93% (10819/11633) remote: Counting objects: 94% (10936/11633) remote: Counting objects: 95% (11052/11633) remote: Counting objects: 96% (11168/11633) remote: Counting objects: 97% (11285/11633) remote: Counting objects: 98% (11401/11633) remote: Counting objects: 99% (11517/11633) remote: Counting objects: 100% (11633/11633) remote: Counting objects: 100% (11633/11633), done.
  5. 4.27 s remote: Compressing objects: 0% (1/2152) remote: Compressing objects: 1% (22/2152) remote: Compressing objects: 2% (44/2152) remote: Compressing objects: 3% (65/2152) remote: Compressing objects: 4% (87/2152) remote: Compressing objects: 5% (108/2152) remote: Compressing objects: 5% (124/2152) remote: Compressing objects: 6% (130/2152) remote: Compressing objects: 7% (151/2152) remote: Compressing objects: 8% (173/2152) remote: Compressing objects: 9% (194/2152) remote: Compressing objects: 10% (216/2152) remote: Compressing objects: 11% (237/2152) remote: Compressing objects: 12% (259/2152) remote: Compressing objects: 13% (280/2152) remote: Compressing objects: 13% (284/2152) remote: Compressing objects: 14% (302/2152) remote: Compressing objects: 15% (323/2152) remote: Compressing objects: 16% (345/2152) remote: Compressing objects: 17% (366/2152) remote: Compressing objects: 18% (388/2152) remote: Compressing objects: 19% (409/2152) remote: Compressing objects: 20% (431/2152) remote: Compressing objects: 21% (452/2152) remote: Compressing objects: 22% (474/2152) remote: Compressing objects: 23% (495/2152) remote: Compressing objects: 24% (517/2152) remote: Compressing objects: 25% (538/2152) remote: Compressing objects: 26% (560/2152) remote: Compressing objects: 27% (582/2152) remote: Compressing objects: 28% (603/2152) remote: Compressing objects: 29% (625/2152) remote: Compressing objects: 30% (646/2152) remote: Compressing objects: 31% (668/2152) remote: Compressing objects: 32% (689/2152) remote: Compressing objects: 33% (711/2152) remote: Compressing objects: 34% (732/2152) remote: Compressing objects: 35% (754/2152) remote: Compressing objects: 36% (775/2152) remote: Compressing objects: 37% (797/2152) remote: Compressing objects: 38% (818/2152) remote: Compressing objects: 39% (840/2152) remote: Compressing objects: 40% (861/2152) remote: Compressing objects: 41% (883/2152) remote: Compressing objects: 42% (904/2152) remote: Compressing objects: 43% (926/2152) remote: Compressing objects: 44% (947/2152) remote: Compressing objects: 45% (969/2152) remote: Compressing objects: 46% (990/2152) remote: Compressing objects: 47% (1012/2152) remote: Compressing objects: 48% (1033/2152) remote: Compressing objects: 49% (1055/2152) remote: Compressing objects: 50% (1076/2152) remote: Compressing objects: 51% (1098/2152) remote: Compressing objects: 52% (1120/2152) remote: Compressing objects: 53% (1141/2152) remote: Compressing objects: 54% (1163/2152) remote: Compressing objects: 55% (1184/2152) remote: Compressing objects: 56% (1206/2152) remote: Compressing objects: 57% (1227/2152) remote: Compressing objects: 58% (1249/2152) remote: Compressing objects: 59% (1270/2152) remote: Compressing objects: 60% (1292/2152) remote: Compressing objects: 61% (1313/2152) remote: Compressing objects: 62% (1335/2152) remote: Compressing objects: 63% (1356/2152) remote: Compressing objects: 64% (1378/2152) remote: Compressing objects: 65% (1399/2152) remote: Compressing objects: 66% (1421/2152) remote: Compressing objects: 67% (1442/2152) remote: Compressing objects: 68% (1464/2152) remote: Compressing objects: 69% (1485/2152) remote: Compressing objects: 70% (1507/2152) remote: Compressing objects: 71% (1528/2152) remote: Compressing objects: 72% (1550/2152) remote: Compressing objects: 73% (1571/2152) remote: Compressing objects: 74% (1593/2152) remote: Compressing objects: 75% (1614/2152) remote: Compressing objects: 76% (1636/2152) remote: Compressing objects: 77% (1658/2152) remote: Compressing objects: 78% (1679/2152) remote: Compressing objects: 79% (1701/2152) remote: Compressing objects: 80% (1722/2152) remote: Compressing objects: 81% (1744/2152) remote: Compressing objects: 82% (1765/2152) remote: Compressing objects: 83% (1787/2152) remote: Compressing objects: 84% (1808/2152) remote: Compressing objects: 85% (1830/2152) remote: Compressing objects: 86% (1851/2152) remote: Compressing objects: 87% (1873/2152) remote: Compressing objects: 88% (1894/2152) remote: Compressing objects: 89% (1916/2152) remote: Compressing objects: 90% (1937/2152) remote: Compressing objects: 91% (1959/2152) remote: Compressing objects: 92% (1980/2152) remote: Compressing objects: 93% (2002/2152) remote: Compressing objects: 94% (2023/2152) remote: Compressing objects: 95% (2045/2152) remote: Compressing objects: 96% (2066/2152) remote: Compressing objects: 97% (2088/2152) remote: Compressing objects: 98% (2109/2152) remote: Compressing objects: 99% (2131/2152) remote: Compressing objects: 100% (2152/2152) remote: Compressing objects: 100% (2152/2152), done.
  6. 16.51 s Receiving objects: 0% (1/108237) Receiving objects: 1% (1083/108237) Receiving objects: 2% (2165/108237) Receiving objects: 3% (3248/108237), 14.71 MiB | 29.40 MiB/s Receiving objects: 4% (4330/108237), 14.71 MiB | 29.40 MiB/s Receiving objects: 5% (5412/108237), 14.71 MiB | 29.40 MiB/s Receiving objects: 6% (6495/108237), 14.71 MiB | 29.40 MiB/s Receiving objects: 6% (7571/108237), 29.43 MiB | 28.67 MiB/s Receiving objects: 7% (7577/108237), 29.43 MiB | 28.67 MiB/s Receiving objects: 8% (8659/108237), 29.43 MiB | 28.67 MiB/s Receiving objects: 9% (9742/108237), 29.43 MiB | 28.67 MiB/s Receiving objects: 10% (10824/108237), 29.43 MiB | 28.67 MiB/s Receiving objects: 11% (11907/108237), 29.43 MiB | 28.67 MiB/s Receiving objects: 12% (12989/108237), 29.43 MiB | 28.67 MiB/s Receiving objects: 13% (14071/108237), 29.43 MiB | 28.67 MiB/s Receiving objects: 14% (15154/108237), 29.43 MiB | 28.67 MiB/s Receiving objects: 15% (16236/108237), 29.43 MiB | 28.67 MiB/s Receiving objects: 16% (17318/108237), 29.43 MiB | 28.67 MiB/s Receiving objects: 17% (18401/108237), 29.43 MiB | 28.67 MiB/s Receiving objects: 18% (19483/108237), 29.43 MiB | 28.67 MiB/s Receiving objects: 19% (20566/108237), 29.43 MiB | 28.67 MiB/s Receiving objects: 20% (21648/108237), 29.43 MiB | 28.67 MiB/s Receiving objects: 21% (22730/108237), 29.43 MiB | 28.67 MiB/s Receiving objects: 22% (23813/108237), 29.43 MiB | 28.67 MiB/s Receiving objects: 23% (24895/108237), 29.43 MiB | 28.67 MiB/s Receiving objects: 24% (25977/108237), 29.43 MiB | 28.67 MiB/s Receiving objects: 25% (27060/108237), 29.43 MiB | 28.67 MiB/s Receiving objects: 26% (28142/108237), 46.95 MiB | 30.69 MiB/s Receiving objects: 27% (29224/108237), 46.95 MiB | 30.69 MiB/s Receiving objects: 28% (30307/108237), 46.95 MiB | 30.69 MiB/s Receiving objects: 29% (31389/108237), 46.95 MiB | 30.69 MiB/s Receiving objects: 30% (32472/108237), 46.95 MiB | 30.69 MiB/s Receiving objects: 31% (33554/108237), 46.95 MiB | 30.69 MiB/s Receiving objects: 32% (34636/108237), 46.95 MiB | 30.69 MiB/s Receiving objects: 33% (35719/108237), 46.95 MiB | 30.69 MiB/s Receiving objects: 34% (36801/108237), 46.95 MiB | 30.69 MiB/s Receiving objects: 35% (37883/108237), 46.95 MiB | 30.69 MiB/s Receiving objects: 36% (38966/108237), 46.95 MiB | 30.69 MiB/s Receiving objects: 37% (40048/108237), 46.95 MiB | 30.69 MiB/s Receiving objects: 38% (41131/108237), 46.95 MiB | 30.69 MiB/s Receiving objects: 39% (42213/108237), 46.95 MiB | 30.69 MiB/s Receiving objects: 39% (42603/108237), 46.95 MiB | 30.69 MiB/s Receiving objects: 40% (43295/108237), 63.18 MiB | 30.79 MiB/s Receiving objects: 41% (44378/108237), 63.18 MiB | 30.79 MiB/s Receiving objects: 42% (45460/108237), 63.18 MiB | 30.79 MiB/s Receiving objects: 43% (46542/108237), 63.18 MiB | 30.79 MiB/s Receiving objects: 44% (47625/108237), 63.18 MiB | 30.79 MiB/s Receiving objects: 45% (48707/108237), 63.18 MiB | 30.79 MiB/s Receiving objects: 46% (49790/108237), 63.18 MiB | 30.79 MiB/s Receiving objects: 47% (50872/108237), 63.18 MiB | 30.79 MiB/s Receiving objects: 48% (51954/108237), 79.59 MiB | 31.15 MiB/s Receiving objects: 49% (53037/108237), 79.59 MiB | 31.15 MiB/s Receiving objects: 50% (54119/108237), 79.59 MiB | 31.15 MiB/s Receiving objects: 51% (55201/108237), 79.59 MiB | 31.15 MiB/s Receiving objects: 52% (56284/108237), 79.59 MiB | 31.15 MiB/s Receiving objects: 52% (56433/108237), 79.59 MiB | 31.15 MiB/s Receiving objects: 53% (57366/108237), 97.11 MiB | 31.55 MiB/s Receiving objects: 54% (58448/108237), 97.11 MiB | 31.55 MiB/s Receiving objects: 55% (59531/108237), 97.11 MiB | 31.55 MiB/s Receiving objects: 56% (60613/108237), 97.11 MiB | 31.55 MiB/s Receiving objects: 57% (61696/108237), 97.11 MiB | 31.55 MiB/s Receiving objects: 58% (62778/108237), 97.11 MiB | 31.55 MiB/s Receiving objects: 59% (63860/108237), 97.11 MiB | 31.55 MiB/s Receiving objects: 60% (64943/108237), 114.61 MiB | 31.99 MiB/s Receiving objects: 61% (66025/108237), 114.61 MiB | 31.99 MiB/s Receiving objects: 62% (67107/108237), 114.61 MiB | 31.99 MiB/s Receiving objects: 62% (67728/108237), 114.61 MiB | 31.99 MiB/s Receiving objects: 63% (68190/108237), 130.72 MiB | 32.02 MiB/s Receiving objects: 63% (68488/108237), 146.58 MiB | 31.99 MiB/s Receiving objects: 64% (69272/108237), 163.18 MiB | 32.40 MiB/s Receiving objects: 64% (70321/108237), 197.12 MiB | 32.95 MiB/s Receiving objects: 65% (70355/108237), 197.12 MiB | 32.95 MiB/s Receiving objects: 65% (70447/108237), 214.31 MiB | 33.30 MiB/s Receiving objects: 65% (70654/108237), 265.14 MiB | 33.38 MiB/s Receiving objects: 66% (71437/108237), 265.14 MiB | 33.38 MiB/s Receiving objects: 67% (72519/108237), 265.14 MiB | 33.38 MiB/s Receiving objects: 68% (73602/108237), 265.14 MiB | 33.38 MiB/s Receiving objects: 69% (74684/108237), 265.14 MiB | 33.38 MiB/s Receiving objects: 70% (75766/108237), 265.14 MiB | 33.38 MiB/s Receiving objects: 71% (76849/108237), 265.14 MiB | 33.38 MiB/s Receiving objects: 72% (77931/108237), 282.41 MiB | 33.63 MiB/s Receiving objects: 73% (79014/108237), 282.41 MiB | 33.63 MiB/s Receiving objects: 74% (80096/108237), 282.41 MiB | 33.63 MiB/s Receiving objects: 75% (81178/108237), 282.41 MiB | 33.63 MiB/s Receiving objects: 76% (82261/108237), 282.41 MiB | 33.63 MiB/s Receiving objects: 77% (83343/108237), 282.41 MiB | 33.63 MiB/s Receiving objects: 78% (84425/108237), 282.41 MiB | 33.63 MiB/s Receiving objects: 79% (85508/108237), 282.41 MiB | 33.63 MiB/s Receiving objects: 80% (86590/108237), 282.41 MiB | 33.63 MiB/s Receiving objects: 80% (86611/108237), 282.41 MiB | 33.63 MiB/s Receiving objects: 81% (87672/108237), 282.41 MiB | 33.63 MiB/s Receiving objects: 82% (88755/108237), 299.62 MiB | 33.92 MiB/s Receiving objects: 83% (89837/108237), 316.14 MiB | 33.89 MiB/s Receiving objects: 84% (90920/108237), 316.14 MiB | 33.89 MiB/s Receiving objects: 84% (91675/108237), 316.14 MiB | 33.89 MiB/s Receiving objects: 85% (92002/108237), 333.54 MiB | 33.96 MiB/s Receiving objects: 86% (93084/108237), 333.54 MiB | 33.96 MiB/s Receiving objects: 87% (94167/108237), 333.54 MiB | 33.96 MiB/s Receiving objects: 88% (95249/108237), 333.54 MiB | 33.96 MiB/s Receiving objects: 88% (95687/108237), 367.07 MiB | 33.87 MiB/s Receiving objects: 89% (96331/108237), 384.32 MiB | 33.97 MiB/s Receiving objects: 90% (97414/108237), 384.32 MiB | 33.97 MiB/s Receiving objects: 91% (98496/108237), 384.32 MiB | 33.97 MiB/s Receiving objects: 92% (99579/108237), 384.32 MiB | 33.97 MiB/s Receiving objects: 93% (100661/108237), 384.32 MiB | 33.97 MiB/s Receiving objects: 94% (101743/108237), 384.32 MiB | 33.97 MiB/s Receiving objects: 94% (101811/108237), 384.32 MiB | 33.97 MiB/s Receiving objects: 95% (102826/108237), 384.32 MiB | 33.97 MiB/s Receiving objects: 96% (103908/108237), 384.32 MiB | 33.97 MiB/s Receiving objects: 97% (104990/108237), 384.32 MiB | 33.97 MiB/s Receiving objects: 98% (106073/108237), 401.05 MiB | 33.88 MiB/s Receiving objects: 99% (107155/108237), 401.05 MiB | 33.88 MiB/s remote: Total 108237 (delta 10287), reused 9528 (delta 9476), pack-reused 96604 (from 1)
  7. 16.51 s Receiving objects: 100% (108237/108237), 401.05 MiB | 33.88 MiB/s Receiving objects: 100% (108237/108237), 404.46 MiB | 33.11 MiB/s, done.
  8. 17.70 s Resolving deltas: 0% (0/72030) Resolving deltas: 1% (721/72030) Resolving deltas: 2% (1441/72030) Resolving deltas: 3% (2161/72030) Resolving deltas: 4% (2882/72030) Resolving deltas: 5% (3602/72030) Resolving deltas: 6% (4322/72030) Resolving deltas: 7% (5043/72030) Resolving deltas: 8% (5763/72030) Resolving deltas: 9% (6483/72030) Resolving deltas: 10% (7205/72030) Resolving deltas: 11% (7924/72030) Resolving deltas: 12% (8644/72030) Resolving deltas: 13% (9364/72030) Resolving deltas: 14% (10085/72030) Resolving deltas: 15% (10805/72030) Resolving deltas: 16% (11525/72030) Resolving deltas: 17% (12246/72030) Resolving deltas: 18% (12966/72030) Resolving deltas: 19% (13686/72030) Resolving deltas: 20% (14406/72030) Resolving deltas: 21% (15127/72030) Resolving deltas: 22% (15847/72030) Resolving deltas: 23% (16567/72030) Resolving deltas: 24% (17288/72030) Resolving deltas: 25% (18008/72030) Resolving deltas: 26% (18728/72030) Resolving deltas: 27% (19450/72030) Resolving deltas: 28% (20169/72030) Resolving deltas: 29% (20889/72030) Resolving deltas: 30% (21610/72030) Resolving deltas: 31% (22330/72030) Resolving deltas: 32% (23051/72030) Resolving deltas: 33% (23770/72030) Resolving deltas: 34% (24491/72030) Resolving deltas: 35% (25212/72030) Resolving deltas: 36% (25931/72030) Resolving deltas: 37% (26652/72030) Resolving deltas: 38% (27372/72030) Resolving deltas: 39% (28092/72030) Resolving deltas: 40% (28812/72030) Resolving deltas: 41% (29533/72030) Resolving deltas: 42% (30254/72030) Resolving deltas: 43% (30973/72030) Resolving deltas: 44% (31694/72030) Resolving deltas: 45% (32414/72030) Resolving deltas: 46% (33134/72030) Resolving deltas: 47% (33856/72030) Resolving deltas: 48% (34575/72030) Resolving deltas: 49% (35295/72030) Resolving deltas: 50% (36015/72030) Resolving deltas: 51% (36736/72030) Resolving deltas: 52% (37456/72030) Resolving deltas: 53% (38176/72030) Resolving deltas: 54% (38898/72030) Resolving deltas: 55% (39617/72030) Resolving deltas: 56% (40338/72030) Resolving deltas: 57% (41058/72030) Resolving deltas: 58% (41778/72030) Resolving deltas: 59% (42501/72030) Resolving deltas: 60% (43220/72030) Resolving deltas: 61% (43940/72030) Resolving deltas: 62% (44659/72030) Resolving deltas: 63% (45379/72030) Resolving deltas: 64% (46100/72030) Resolving deltas: 65% (46820/72030) Resolving deltas: 66% (47543/72030) Resolving deltas: 67% (48261/72030) Resolving deltas: 68% (48982/72030) Resolving deltas: 69% (49701/72030) Resolving deltas: 70% (50421/72030) Resolving deltas: 71% (51142/72030) Resolving deltas: 72% (51862/72030) Resolving deltas: 73% (52583/72030) Resolving deltas: 74% (53303/72030) Resolving deltas: 75% (54023/72030) Resolving deltas: 76% (54744/72030) Resolving deltas: 77% (55464/72030) Resolving deltas: 78% (56184/72030) Resolving deltas: 79% (56904/72030) Resolving deltas: 80% (57624/72030) Resolving deltas: 81% (58345/72030) Resolving deltas: 81% (58974/72030) Resolving deltas: 82% (59065/72030) Resolving deltas: 83% (59785/72030) Resolving deltas: 84% (60506/72030) Resolving deltas: 85% (61226/72030) Resolving deltas: 86% (61946/72030) Resolving deltas: 87% (62667/72030) Resolving deltas: 88% (63387/72030) Resolving deltas: 89% (64107/72030) Resolving deltas: 90% (64827/72030) Resolving deltas: 91% (65548/72030) Resolving deltas: 92% (66268/72030) Resolving deltas: 93% (66988/72030) Resolving deltas: 94% (67710/72030) Resolving deltas: 95% (68429/72030) Resolving deltas: 96% (69149/72030) Resolving deltas: 97% (69871/72030) Resolving deltas: 98% (70590/72030) Resolving deltas: 99% (71310/72030) Resolving deltas: 100% (72030/72030) Resolving deltas: 100% (72030/72030), done.
  9. 18.23 s Fetching commit e5f4155eb4ff28199578e0ea25acdf24da8f4aed for codex/backup-finite_T_and_mu-before-rebase-20260923 ...
  10. 18.23 s $ /nix/store/5vpcfsdx1lcnlb2y4k7xyc74shp5qwbh-git-2.54.0/bin/git fetch origin e5f4155eb4ff28199578e0ea25acdf24da8f4aed
  11. 18.72 s From https://github.com/alphal00p/gammaloop
  12. 18.72 s * branch e5f4155eb4ff28199578e0ea25acdf24da8f4aed -> FETCH_HEAD
  13. 18.73 s $ /nix/store/61685rbaxmpigwi3z23i33sv3jyfl70q-coreutils-9.11/bin/timeout --kill-after=15s 7200s /nix/store/5vpcfsdx1lcnlb2y4k7xyc74shp5qwbh-git-2.54.0/bin/git -c advice.detachedHead=false checkout e5f4155eb4ff28199578e0ea25acdf24da8f4aed
  14. 19.00 s HEAD is now at e5f4155eb unify scalar CFF sector generation across medium modes
  15. 19.00 s $ /nix/store/61685rbaxmpigwi3z23i33sv3jyfl70q-coreutils-9.11/bin/timeout --kill-after=15s 7200s /nix/store/wknkybkzrc16r11vk5vrykh4wmw7a353-nix-2.34.8/bin/nix --extra-experimental-features nix-command --extra-experimental-features flakes --log-format internal-json run .#packages.x86_64-linux.nix-ci-check-gammaloop-nextest-integration --print-build-logs
  16. 19.39 s
  17. 20.28 s Downloading cached source from https://cache.nix-ci.com
  18. 30.69 s Downloaded cached source (199.4 MiB) in 10.4s
  19. 30.69 s Progress: 1 of 1 downloaded from cache
  20. 37.93 s fetching Git repository 'https://github.com/alphal00p/symbolica'
  21. 38.66 s remote: Enumerating objects: 11155, done.
  22. 38.78 s remote: Counting objects: 0% (1/2928) remote: Counting objects: 1% (30/2928) remote: Counting objects: 2% (59/2928) remote: Counting objects: 3% (88/2928) remote: Counting objects: 4% (118/2928) remote: Counting objects: 5% (147/2928) remote: Counting objects: 6% (176/2928) remote: Counting objects: 7% (205/2928) remote: Counting objects: 8% (235/2928) remote: Counting objects: 9% (264/2928) remote: Counting objects: 10% (293/2928) remote: Counting objects: 11% (323/2928) remote: Counting objects: 12% (352/2928) remote: Counting objects: 13% (381/2928) remote: Counting objects: 14% (410/2928) remote: Counting objects: 15% (440/2928) remote: Counting objects: 16% (469/2928) remote: Counting objects: 17% (498/2928) remote: Counting objects: 18% (528/2928) remote: Counting objects: 19% (557/2928) remote: Counting objects: 20% (586/2928) remote: Counting objects: 21% (615/2928) remote: Counting objects: 22% (645/2928) remote: Counting objects: 23% (674/2928) remote: Counting objects: 24% (703/2928) remote: Counting objects: 25% (732/2928) remote: Counting objects: 26% (762/2928) remote: Counting objects: 27% (791/2928) remote: Counting objects: 28% (820/2928) remote: Counting objects: 29% (850/2928) remote: Counting objects: 30% (879/2928) remote: Counting objects: 31% (908/2928) remote: Counting objects: 32% (937/2928) remote: Counting objects: 33% (967/2928) remote: Counting objects: 34% (996/2928) remote: Counting objects: 35% (1025/2928) remote: Counting objects: 36% (1055/2928) remote: Counting objects: 37% (1084/2928) remote: Counting objects: 38% (1113/2928) remote: Counting objects: 39% (1142/2928) remote: Counting objects: 40% (1172/2928) remote: Counting objects: 41% (1201/2928) remote: Counting objects: 42% (1230/2928) remote: Counting objects: 43% (1260/2928) remote: Counting objects: 44% (1289/2928) remote: Counting objects: 45% (1318/2928) remote: Counting objects: 46% (1347/2928) remote: Counting objects: 47% (1377/2928) remote: Counting objects: 48% (1406/2928) remote: Counting objects: 49% (1435/2928) remote: Counting objects: 50% (1464/2928) remote: Counting objects: 51% (1494/2928) remote: Counting objects: 52% (1523/2928) remote: Counting objects: 53% (1552/2928) remote: Counting objects: 54% (1582/2928) remote: Counting objects: 55% (1611/2928) remote: Counting objects: 56% (1640/2928) remote: Counting objects: 57% (1669/2928) remote: Counting objects: 58% (1699/2928) remote: Counting objects: 59% (1728/2928) remote: Counting objects: 60% (1757/2928) remote: Counting objects: 61% (1787/2928) remote: Counting objects: 62% (1816/2928) remote: Counting objects: 63% (1845/2928) remote: Counting objects: 64% (1874/2928) remote: Counting objects: 65% (1904/2928) remote: Counting objects: 66% (1933/2928) remote: Counting objects: 67% (1962/2928) remote: Counting objects: 68% (1992/2928) remote: Counting objects: 69% (2021/2928) remote: Counting objects: 70% (2050/2928) remote: Counting objects: 71% (2079/2928) remote: Counting objects: 72% (2109/2928) remote: Counting objects: 73% (2138/2928) remote: Counting objects: 74% (2167/2928) remote: Counting objects: 75% (2196/2928) remote: Counting objects: 76% (2226/2928) remote: Counting objects: 77% (2255/2928) remote: Counting objects: 78% (2284/2928) remote: Counting objects: 79% (2314/2928) remote: Counting objects: 80% (2343/2928) remote: Counting objects: 81% (2372/2928) remote: Counting objects: 82% (2401/2928) remote: Counting objects: 83% (2431/2928) remote: Counting objects: 84% (2460/2928) remote: Counting objects: 85% (2489/2928) remote: Counting objects: 86% (2519/2928) remote: Counting objects: 87% (2548/2928) remote: Counting objects: 88% (2577/2928) remote: Counting objects: 89% (2606/2928) remote: Counting objects: 90% (2636/2928) remote: Counting objects: 91% (2665/2928) remote: Counting objects: 92% (2694/2928) remote: Counting objects: 93% (2724/2928) remote: Counting objects: 94% (2753/2928) remote: Counting objects: 95% (2782/2928) remote: Counting objects: 96% (2811/2928) remote: Counting objects: 97% (2841/2928) remote: Counting objects: 98% (2870/2928) remote: Counting objects: 99% (2899/2928) remote: Counting objects: 100% (2928/2928) remote: Counting objects: 100% (2928/2928), done.
  23. 39.31 s remote: Compressing objects: 0% (1/206) remote: Compressing objects: 1% (3/206) remote: Compressing objects: 2% (5/206) remote: Compressing objects: 3% (7/206) remote: Compressing objects: 4% (9/206) remote: Compressing objects: 5% (11/206) remote: Compressing objects: 6% (13/206) remote: Compressing objects: 7% (15/206) remote: Compressing objects: 8% (17/206) remote: Compressing objects: 9% (19/206) remote: Compressing objects: 10% (21/206) remote: Compressing objects: 11% (23/206) remote: Compressing objects: 12% (25/206) remote: Compressing objects: 13% (27/206) remote: Compressing objects: 14% (29/206) remote: Compressing objects: 15% (31/206) remote: Compressing objects: 16% (33/206) remote: Compressing objects: 17% (36/206) remote: Compressing objects: 18% (38/206) remote: Compressing objects: 19% (40/206) remote: Compressing objects: 20% (42/206) remote: Compressing objects: 21% (44/206) remote: Compressing objects: 22% (46/206) remote: Compressing objects: 23% (48/206) remote: Compressing objects: 24% (50/206) remote: Compressing objects: 25% (52/206) remote: Compressing objects: 26% (54/206) remote: Compressing objects: 27% (56/206) remote: Compressing objects: 28% (58/206) remote: Compressing objects: 29% (60/206) remote: Compressing objects: 30% (62/206) remote: Compressing objects: 31% (64/206) remote: Compressing objects: 32% (66/206) remote: Compressing objects: 33% (68/206) remote: Compressing objects: 34% (71/206) remote: Compressing objects: 35% (73/206) remote: Compressing objects: 36% (75/206) remote: Compressing objects: 37% (77/206) remote: Compressing objects: 38% (79/206) remote: Compressing objects: 39% (81/206) remote: Compressing objects: 40% (83/206) remote: Compressing objects: 41% (85/206) remote: Compressing objects: 42% (87/206) remote: Compressing objects: 43% (89/206) remote: Compressing objects: 44% (91/206) remote: Compressing objects: 45% (93/206) remote: Compressing objects: 46% (95/206) remote: Compressing objects: 47% (97/206) remote: Compressing objects: 48% (99/206) remote: Compressing objects: 49% (101/206) remote: Compressing objects: 50% (103/206) remote: Compressing objects: 51% (106/206) remote: Compressing objects: 52% (108/206) remote: Compressing objects: 53% (110/206) remote: Compressing objects: 54% (112/206) remote: Compressing objects: 55% (114/206) remote: Compressing objects: 56% (116/206) remote: Compressing objects: 57% (118/206) remote: Compressing objects: 58% (120/206) remote: Compressing objects: 59% (122/206) remote: Compressing objects: 60% (124/206) remote: Compressing objects: 61% (126/206) remote: Compressing objects: 62% (128/206) remote: Compressing objects: 63% (130/206) remote: Compressing objects: 64% (132/206) remote: Compressing objects: 65% (134/206) remote: Compressing objects: 66% (136/206) remote: Compressing objects: 67% (139/206) remote: Compressing objects: 68% (141/206) remote: Compressing objects: 69% (143/206) remote: Compressing objects: 70% (145/206) remote: Compressing objects: 71% (147/206) remote: Compressing objects: 72% (149/206) remote: Compressing objects: 73% (151/206) remote: Compressing objects: 74% (153/206) remote: Compressing objects: 75% (155/206) remote: Compressing objects: 76% (157/206) remote: Compressing objects: 77% (159/206) remote: Compressing objects: 78% (161/206) remote: Compressing objects: 79% (163/206) remote: Compressing objects: 80% (165/206) remote: Compressing objects: 81% (167/206) remote: Compressing objects: 82% (169/206) remote: Compressing objects: 83% (171/206) remote: Compressing objects: 84% (174/206) remote: Compressing objects: 85% (176/206) remote: Compressing objects: 86% (178/206) remote: Compressing objects: 87% (180/206) remote: Compressing objects: 88% (182/206) remote: Compressing objects: 89% (184/206) remote: Compressing objects: 90% (186/206) remote: Compressing objects: 91% (188/206) remote: Compressing objects: 92% (190/206) remote: Compressing objects: 93% (192/206) remote: Compressing objects: 94% (194/206) remote: Compressing objects: 95% (196/206) remote: Compressing objects: 96% (198/206) remote: Compressing objects: 97% (200/206) remote: Compressing objects: 98% (202/206) remote: Compressing objects: 99% (204/206) remote: Compressing objects: 100% (206/206) remote: Compressing objects: 100% (206/206), done.
  24. 39.53 s Receiving objects: 0% (1/11155) Receiving objects: 1% (112/11155) Receiving objects: 2% (224/11155) Receiving objects: 3% (335/11155) Receiving objects: 4% (447/11155) Receiving objects: 5% (558/11155) Receiving objects: 6% (670/11155) Receiving objects: 7% (781/11155) Receiving objects: 8% (893/11155) Receiving objects: 9% (1004/11155) Receiving objects: 10% (1116/11155) Receiving objects: 11% (1228/11155) Receiving objects: 12% (1339/11155) Receiving objects: 13% (1451/11155) Receiving objects: 14% (1562/11155) Receiving objects: 15% (1674/11155) Receiving objects: 16% (1785/11155) Receiving objects: 17% (1897/11155) Receiving objects: 18% (2008/11155) Receiving objects: 19% (2120/11155) Receiving objects: 20% (2231/11155) Receiving objects: 21% (2343/11155) Receiving objects: 22% (2455/11155) Receiving objects: 23% (2566/11155) Receiving objects: 24% (2678/11155) Receiving objects: 25% (2789/11155) Receiving objects: 26% (2901/11155) Receiving objects: 27% (3012/11155) Receiving objects: 28% (3124/11155) Receiving objects: 29% (3235/11155) Receiving objects: 30% (3347/11155) Receiving objects: 31% (3459/11155) Receiving objects: 32% (3570/11155) Receiving objects: 33% (3682/11155) Receiving objects: 34% (3793/11155) Receiving objects: 35% (3905/11155) Receiving objects: 36% (4016/11155) Receiving objects: 37% (4128/11155) Receiving objects: 38% (4239/11155) Receiving objects: 39% (4351/11155) Receiving objects: 40% (4462/11155) Receiving objects: 41% (4574/11155) Receiving objects: 42% (4686/11155) Receiving objects: 43% (4797/11155) Receiving objects: 44% (4909/11155) Receiving objects: 45% (5020/11155) Receiving objects: 46% (5132/11155) Receiving objects: 47% (5243/11155) Receiving objects: 48% (5355/11155) Receiving objects: 49% (5466/11155) Receiving objects: 50% (5578/11155) Receiving objects: 51% (5690/11155) Receiving objects: 52% (5801/11155) Receiving objects: 53% (5913/11155) Receiving objects: 54% (6024/11155) Receiving objects: 55% (6136/11155) Receiving objects: 56% (6247/11155) Receiving objects: 57% (6359/11155) Receiving objects: 58% (6470/11155) Receiving objects: 59% (6582/11155) Receiving objects: 60% (6693/11155) Receiving objects: 61% (6805/11155) Receiving objects: 62% (6917/11155) Receiving objects: 63% (7028/11155) Receiving objects: 64% (7140/11155) Receiving objects: 65% (7251/11155) Receiving objects: 66% (7363/11155) Receiving objects: 67% (7474/11155) Receiving objects: 68% (7586/11155) Receiving objects: 69% (7697/11155) Receiving objects: 70% (7809/11155) Receiving objects: 71% (7921/11155) Receiving objects: 72% (8032/11155) Receiving objects: 73% (8144/11155) Receiving objects: 74% (8255/11155) Receiving objects: 75% (8367/11155) Receiving objects: 76% (8478/11155) Receiving objects: 77% (8590/11155) Receiving objects: 78% (8701/11155) Receiving objects: 79% (8813/11155) Receiving objects: 80% (8924/11155) Receiving objects: 81% (9036/11155) Receiving objects: 82% (9148/11155) Receiving objects: 83% (9259/11155) Receiving objects: 84% (9371/11155) Receiving objects: 85% (9482/11155) Receiving objects: 86% (9594/11155) Receiving objects: 87% (9705/11155) Receiving objects: 88% (9817/11155) Receiving objects: 89% (9928/11155) Receiving objects: 90% (10040/11155) Receiving objects: 91% (10152/11155) Receiving objects: 92% (10263/11155) Receiving objects: 93% (10375/11155) Receiving objects: 94% (10486/11155) Receiving objects: 95% (10598/11155) Receiving objects: 96% (10709/11155) Receiving objects: 97% (10821/11155) Receiving objects: 98% (10932/11155) remote: Total 11155 (delta 2810), reused 2722 (delta 2722), pack-reused 8227 (from 2)
  25. 39.53 s Receiving objects: 99% (11044/11155) Receiving objects: 100% (11155/11155) Receiving objects: 100% (11155/11155), 5.82 MiB | 26.84 MiB/s, done.
  26. 39.68 s Resolving deltas: 0% (0/8818) Resolving deltas: 1% (89/8818) Resolving deltas: 2% (177/8818) Resolving deltas: 3% (265/8818) Resolving deltas: 4% (353/8818) Resolving deltas: 5% (441/8818) Resolving deltas: 6% (530/8818) Resolving deltas: 7% (619/8818) Resolving deltas: 8% (706/8818) Resolving deltas: 9% (794/8818) Resolving deltas: 10% (882/8818) Resolving deltas: 11% (970/8818) Resolving deltas: 12% (1059/8818) Resolving deltas: 13% (1147/8818) Resolving deltas: 14% (1235/8818) Resolving deltas: 15% (1323/8818) Resolving deltas: 16% (1412/8818) Resolving deltas: 17% (1500/8818) Resolving deltas: 18% (1588/8818) Resolving deltas: 19% (1676/8818) Resolving deltas: 20% (1764/8818) Resolving deltas: 21% (1853/8818) Resolving deltas: 22% (1940/8818) Resolving deltas: 23% (2029/8818) Resolving deltas: 24% (2117/8818) Resolving deltas: 25% (2205/8818) Resolving deltas: 26% (2293/8818) Resolving deltas: 27% (2381/8818) Resolving deltas: 28% (2470/8818) Resolving deltas: 29% (2559/8818) Resolving deltas: 30% (2647/8818) Resolving deltas: 31% (2734/8818) Resolving deltas: 32% (2822/8818) Resolving deltas: 33% (2910/8818) Resolving deltas: 34% (2999/8818) Resolving deltas: 35% (3087/8818) Resolving deltas: 36% (3175/8818) Resolving deltas: 37% (3263/8818) Resolving deltas: 38% (3351/8818) Resolving deltas: 39% (3440/8818) Resolving deltas: 40% (3528/8818) Resolving deltas: 41% (3616/8818) Resolving deltas: 42% (3704/8818) Resolving deltas: 43% (3792/8818) Resolving deltas: 44% (3880/8818) Resolving deltas: 45% (3969/8818) Resolving deltas: 46% (4057/8818) Resolving deltas: 47% (4145/8818) Resolving deltas: 48% (4234/8818) Resolving deltas: 49% (4321/8818) Resolving deltas: 50% (4409/8818) Resolving deltas: 51% (4499/8818) Resolving deltas: 52% (4586/8818) Resolving deltas: 53% (4674/8818) Resolving deltas: 54% (4763/8818) Resolving deltas: 55% (4850/8818) Resolving deltas: 56% (4941/8818) Resolving deltas: 57% (5028/8818) Resolving deltas: 58% (5117/8818) Resolving deltas: 59% (5203/8818) Resolving deltas: 60% (5292/8818) Resolving deltas: 61% (5379/8818) Resolving deltas: 62% (5468/8818) Resolving deltas: 63% (5556/8818) Resolving deltas: 64% (5644/8818) Resolving deltas: 65% (5732/8818) Resolving deltas: 66% (5820/8818) Resolving deltas: 67% (5909/8818) Resolving deltas: 68% (5997/8818) Resolving deltas: 69% (6085/8818) Resolving deltas: 70% (6173/8818) Resolving deltas: 71% (6261/8818) Resolving deltas: 72% (6349/8818) Resolving deltas: 73% (6438/8818) Resolving deltas: 74% (6526/8818) Resolving deltas: 75% (6614/8818) Resolving deltas: 76% (6702/8818) Resolving deltas: 77% (6790/8818) Resolving deltas: 78% (6879/8818) Resolving deltas: 79% (6967/8818) Resolving deltas: 80% (7055/8818) Resolving deltas: 81% (7143/8818) Resolving deltas: 82% (7231/8818) Resolving deltas: 83% (7319/8818) Resolving deltas: 84% (7408/8818) Resolving deltas: 85% (7496/8818) Resolving deltas: 86% (7584/8818) Resolving deltas: 87% (7672/8818) Resolving deltas: 88% (7760/8818) Resolving deltas: 89% (7849/8818) Resolving deltas: 90% (7937/8818) Resolving deltas: 91% (8026/8818) Resolving deltas: 92% (8113/8818) Resolving deltas: 93% (8201/8818) Resolving deltas: 94% (8289/8818) Resolving deltas: 95% (8382/8818) Resolving deltas: 96% (8466/8818) Resolving deltas: 97% (8554/8818) Resolving deltas: 98% (8642/8818) Resolving deltas: 99% (8730/8818) Resolving deltas: 100% (8818/8818) Resolving deltas: 100% (8818/8818), done.
  27. 39.72 s From https://github.com/alphal00p/symbolica
  28. 39.72 s * [new branch] codex/gl638-evaluator-constant-merge -> codex/gl638-evaluator-constant-merge
  29. 39.72 s * [new branch] codex/kirapy-state-registry -> codex/kirapy-state-registry
  30. 39.72 s * [new branch] codex/kirapy-state-registry-dev-2026-08-25 -> codex/kirapy-state-registry-dev-2026-08-25
  31. 39.72 s * [new branch] codex/phase-fix-nested-tensor-counters -> codex/phase-fix-nested-tensor-counters
  32. 39.72 s * [new branch] codex/state-import-d6bb961 -> codex/state-import-d6bb961
  33. 39.72 s * [new branch] evaluate -> evaluate
  34. 39.72 s * [new branch] main -> main
  35. 39.72 s * [new branch] nested_symmetrize -> nested_symmetrize
  36. 39.72 s * [new branch] no_namespace -> no_namespace
  37. 39.72 s * [new branch] packed_exp -> packed_exp
  38. 39.72 s * [new branch] random -> random
  39. 39.72 s * [new branch] rat_parser -> rat_parser
  40. 39.72 s * [new branch] symbolica_fork_for_v0_3_3 -> symbolica_fork_for_v0_3_3
  41. 39.72 s * [new branch] transformer -> transformer
  42. 39.72 s * [new ref] refs/pull/1/head -> refs/pull/1/head
  43. 39.72 s * [new ref] refs/pull/2/head -> refs/pull/2/head
  44. 39.72 s * [new tag] v0.1.0 -> v0.1.0
  45. 41.78 s
  46. 41.78 s Downloading cached gammaloop-nextest-binaries-integration-gammaloop-integration-tests from https://cache.nix-ci.com
  47. 41.79 s Downloading cached xgcc-15.2.0-libgcc from https://cache.nix-ci.com
  48. 41.79 s Downloading cached busybox from https://cache.nix-ci.com
  49. 41.79 s Downloading cached gcc-15.2.0-libgcc from https://cache.nix-ci.com
  50. 41.79 s Downloading cached libunistring from https://cache.nix-ci.com
  51. 41.79 s Downloading cached publicsuffix-list-0-unstable-2026-05 from https://cache.nix-ci.com
  52. 41.83 s Downloaded cached xgcc-15.2.0-libgcc (193 KiB) in 44ms
  53. 41.83 s Progress: 0 of 1 built, 1 of 68 downloaded from cache (5 downloading)
  54. 41.84 s Downloaded cached gcc-15.2.0-libgcc (193 KiB) in 44ms
  55. 41.84 s Progress: 0 of 1 built, 2 of 68 downloaded from cache (4 downloading)
  56. 41.85 s Downloaded cached libunistring (2 MiB) in 62ms
  57. 41.85 s Progress: 0 of 1 built, 3 of 68 downloaded from cache (3 downloading)
  58. 41.85 s Downloading cached libidn2 from https://cache.nix-ci.com
  59. 41.94 s Downloaded cached publicsuffix-list-0-unstable-2026-05 (329 KiB) in 142ms
  60. 41.94 s Progress: 0 of 1 built, 4 of 68 downloaded from cache (3 downloading)
  61. 41.95 s Downloaded cached busybox (230 KiB) in 157ms
  62. 41.95 s Progress: 0 of 1 built, 5 of 68 downloaded from cache (2 downloading)
  63. 41.95 s Downloaded cached libidn2 (359 KiB) in 95ms
  64. 41.95 s Progress: 0 of 1 built, 6 of 68 downloaded from cache (1 downloading)
  65. 41.95 s Downloading cached glibc-2.42 from https://cache.nix-ci.com
  66. 42.35 s Downloaded cached glibc-2.42 (33.5 MiB) in 398ms
  67. 42.35 s Progress: 0 of 1 built, 7 of 68 downloaded from cache (1 downloading)
  68. 42.35 s Downloading cached attr from https://cache.nix-ci.com
  69. 42.35 s Downloading cached aws-c-common from https://cache.nix-ci.com
  70. 42.35 s Downloading cached bash from https://cache.nix-ci.com
  71. 42.35 s Downloading cached brotli-1.2.0-lib from https://cache.nix-ci.com
  72. 42.35 s Downloading cached bzip2 from https://cache.nix-ci.com
  73. 42.35 s Downloading cached editline-1.17.1-unstable-2025-05 from https://cache.nix-ci.com
  74. 42.35 s Downloading cached gcc-15.2.0-lib from https://cache.nix-ci.com
  75. 42.35 s Downloading cached hwloc-2.14.0-lib from https://cache.nix-ci.com
  76. 42.35 s Downloading cached keyutils-1.6.3-lib from https://cache.nix-ci.com
  77. 42.35 s Downloading cached libcpuid from https://cache.nix-ci.com
  78. 42.35 s Downloading cached libpsl from https://cache.nix-ci.com
  79. 42.35 s Downloading cached libsodium-1.0.22-unstable-2026-04 from https://cache.nix-ci.com
  80. 42.35 s Downloading cached libxml2 from https://cache.nix-ci.com
  81. 42.35 s Downloading cached llhttp from https://cache.nix-ci.com
  82. 42.35 s Downloading cached libseccomp-2.6.0-lib from https://cache.nix-ci.com
  83. 42.40 s Downloaded cached keyutils-1.6.3-lib (41 KiB) in 54ms
  84. 42.40 s Progress: 0 of 1 built, 8 of 68 downloaded from cache (15 downloading)
  85. 42.40 s Downloading cached lowdown-3.0.1-lib from https://cache.nix-ci.com
  86. 42.41 s Downloaded cached attr (90 KiB) in 64ms
  87. 42.41 s Progress: 0 of 1 built, 9 of 68 downloaded from cache (15 downloading)
  88. 42.41 s Downloading cached nghttp2-1.69.0-lib from https://cache.nix-ci.com
  89. 42.41 s Downloaded cached bzip2 (86 KiB) in 65ms
  90. 42.41 s Progress: 0 of 1 built, 10 of 68 downloaded from cache (15 downloading)
  91. 42.42 s Downloading cached acl from https://cache.nix-ci.com
  92. 42.44 s Downloaded cached libpsl (114 KiB) in 88ms
  93. 42.44 s Progress: 0 of 1 built, 11 of 68 downloaded from cache (15 downloading)
  94. 42.44 s Downloading cached nghttp3 from https://cache.nix-ci.com
  95. 42.44 s Downloaded cached bash (1.8 MiB) in 90ms
  96. 42.44 s Progress: 0 of 1 built, 12 of 68 downloaded from cache (15 downloading)
  97. 42.44 s Downloading cached openssl from https://cache.nix-ci.com
  98. 42.44 s Downloaded cached brotli-1.2.0-lib (961 KiB) in 95ms
  99. 42.45 s Progress: 0 of 1 built, 13 of 68 downloaded from cache (15 downloading)
  100. 42.45 s Downloading cached pcre2 from https://cache.nix-ci.com
  101. 42.46 s Downloaded cached libxml2 (1.4 MiB) in 108ms
  102. 42.46 s Progress: 0 of 1 built, 14 of 68 downloaded from cache (15 downloading)
  103. 42.46 s Downloading cached xz from https://cache.nix-ci.com
  104. 42.50 s Downloaded cached nghttp2-1.69.0-lib (225 KiB) in 85ms
  105. 42.50 s Progress: 0 of 1 built, 15 of 68 downloaded from cache (15 downloading)
  106. 42.50 s Downloading cached zlib from https://cache.nix-ci.com
  107. 42.50 s Downloaded cached acl (125 KiB) in 87ms
  108. 42.50 s Progress: 0 of 1 built, 16 of 68 downloaded from cache (15 downloading)
  109. 42.51 s Downloaded cached nghttp3 (228 KiB) in 71ms
  110. 42.51 s Progress: 0 of 1 built, 17 of 68 downloaded from cache (14 downloading)
  111. 42.52 s Downloaded cached gcc-15.2.0-lib (9.8 MiB) in 174ms
  112. 42.52 s Progress: 0 of 1 built, 18 of 68 downloaded from cache (13 downloading)
  113. 42.52 s Downloading cached boehm-gc from https://cache.nix-ci.com
  114. 42.52 s Downloading cached icu4c from https://cache.nix-ci.com
  115. 42.52 s Downloading cached zstd from https://cache.nix-ci.com
  116. 42.53 s Downloaded cached pcre2 (2 MiB) in 87ms
  117. 42.53 s Progress: 0 of 1 built, 19 of 68 downloaded from cache (15 downloading)
  118. 42.54 s Downloaded cached llhttp (89 KiB) in 188ms
  119. 42.54 s Progress: 0 of 1 built, 20 of 68 downloaded from cache (14 downloading)
  120. 42.55 s Downloaded cached libcpuid (326 KiB) in 197ms
  121. 42.55 s Progress: 0 of 1 built, 21 of 68 downloaded from cache (13 downloading)
  122. 42.55 s Downloaded cached editline-1.17.1-unstable-2025-05 (58 KiB) in 198ms
  123. 42.55 s Progress: 0 of 1 built, 22 of 68 downloaded from cache (12 downloading)
  124. 42.56 s Downloaded cached libseccomp-2.6.0-lib (193 KiB) in 208ms
  125. 42.56 s Progress: 0 of 1 built, 23 of 68 downloaded from cache (11 downloading)
  126. 42.56 s Downloaded cached libsodium-1.0.22-unstable-2026-04 (666 KiB) in 212ms
  127. 42.56 s Progress: 0 of 1 built, 24 of 68 downloaded from cache (10 downloading)
  128. 42.57 s Downloaded cached aws-c-common (1.1 MiB) in 216ms
  129. 42.57 s Progress: 0 of 1 built, 25 of 68 downloaded from cache (9 downloading)
  130. 42.57 s Downloading cached aws-c-compression from https://cache.nix-ci.com
  131. 42.57 s Downloading cached aws-c-sdkutils from https://cache.nix-ci.com
  132. 42.57 s Downloading cached aws-checksums from https://cache.nix-ci.com
  133. 42.57 s Downloaded cached hwloc-2.14.0-lib (459 KiB) in 224ms
  134. 42.57 s Progress: 0 of 1 built, 26 of 68 downloaded from cache (11 downloading)
  135. 42.57 s Downloading cached onetbb from https://cache.nix-ci.com
  136. 42.58 s Downloaded cached xz (837 KiB) in 120ms
  137. 42.58 s Progress: 0 of 1 built, 27 of 68 downloaded from cache (11 downloading)
  138. 42.58 s Downloaded cached zlib (129 KiB) in 85ms
  139. 42.58 s Progress: 0 of 1 built, 28 of 68 downloaded from cache (10 downloading)
  140. 42.58 s Downloading cached sqlite from https://cache.nix-ci.com
  141. 42.61 s Downloaded cached zstd (1.1 MiB) in 82ms
  142. 42.61 s Progress: 0 of 1 built, 29 of 68 downloaded from cache (10 downloading)
  143. 42.63 s Downloaded cached openssl (8.9 MiB) in 193ms
  144. 42.63 s Progress: 0 of 1 built, 30 of 68 downloaded from cache (9 downloading)
  145. 42.63 s Downloading cached aws-c-cal from https://cache.nix-ci.com
  146. 42.63 s Downloading cached krb5-1.22.2-lib from https://cache.nix-ci.com
  147. 42.63 s Downloading cached libarchive-3.8.8-lib from https://cache.nix-ci.com
  148. 42.63 s Downloading cached libssh2 from https://cache.nix-ci.com
  149. 42.63 s Downloading cached ngtcp2 from https://cache.nix-ci.com
  150. 42.63 s Downloading cached s2n-tls from https://cache.nix-ci.com
  151. 42.64 s Downloaded cached lowdown-3.0.1-lib (341 KiB) in 239ms
  152. 42.64 s Progress: 0 of 1 built, 31 of 68 downloaded from cache (14 downloading)
  153. 42.72 s Downloaded cached libssh2 (330 KiB) in 80ms
  154. 42.72 s Progress: 0 of 1 built, 32 of 68 downloaded from cache (13 downloading)
  155. 42.72 s Downloading cached libgit2-1.9.4-lib from https://cache.nix-ci.com
  156. 42.72 s Downloaded cached ngtcp2 (515 KiB) in 82ms
  157. 42.72 s Progress: 0 of 1 built, 33 of 68 downloaded from cache (13 downloading)
  158. 42.73 s Downloaded cached krb5-1.22.2-lib (2.7 MiB) in 93ms
  159. 42.73 s Progress: 0 of 1 built, 34 of 68 downloaded from cache (12 downloading)
  160. 42.73 s Downloading cached curl from https://cache.nix-ci.com
  161. 42.73 s Downloaded cached libarchive-3.8.8-lib (953 KiB) in 98ms
  162. 42.73 s Progress: 0 of 1 built, 35 of 68 downloaded from cache (12 downloading)
  163. 42.73 s Downloaded cached boehm-gc (312 KiB) in 209ms
  164. 42.73 s Progress: 0 of 1 built, 36 of 68 downloaded from cache (11 downloading)
  165. 42.76 s Downloaded cached aws-checksums (86 KiB) in 193ms
  166. 42.76 s Progress: 0 of 1 built, 37 of 68 downloaded from cache (10 downloading)
  167. 42.76 s Downloaded cached aws-c-sdkutils (155 KiB) in 197ms
  168. 42.76 s Progress: 0 of 1 built, 38 of 68 downloaded from cache (9 downloading)
  169. 42.77 s Downloaded cached onetbb (626 KiB) in 191ms
  170. 42.77 s Progress: 0 of 1 built, 39 of 68 downloaded from cache (8 downloading)
  171. 42.77 s Downloading cached libblake3 from https://cache.nix-ci.com
  172. 42.77 s Downloaded cached aws-c-compression (31 KiB) in 204ms
  173. 42.77 s Progress: 0 of 1 built, 40 of 68 downloaded from cache (8 downloading)
  174. 42.81 s Downloaded cached curl (1.2 MiB) in 78ms
  175. 42.81 s Progress: 0 of 1 built, 41 of 68 downloaded from cache (7 downloading)
  176. 42.81 s Downloaded cached aws-c-cal (158 KiB) in 177ms
  177. 42.81 s Progress: 0 of 1 built, 42 of 68 downloaded from cache (6 downloading)
  178. 42.81 s Downloaded cached sqlite (5.7 MiB) in 229ms
  179. 42.81 s Progress: 0 of 1 built, 43 of 68 downloaded from cache (5 downloading)
  180. 42.82 s Downloaded cached s2n-tls (1.3 MiB) in 185ms
  181. 42.82 s Progress: 0 of 1 built, 44 of 68 downloaded from cache (4 downloading)
  182. 42.82 s Downloading cached aws-c-io from https://cache.nix-ci.com
  183. 42.92 s Downloaded cached libgit2-1.9.4-lib (1.6 MiB) in 205ms
  184. 42.92 s Progress: 0 of 1 built, 45 of 68 downloaded from cache (4 downloading)
  185. 42.94 s Downloaded cached libblake3 (117 KiB) in 174ms
  186. 42.94 s Progress: 0 of 1 built, 46 of 68 downloaded from cache (3 downloading)
  187. 43.02 s Downloaded cached aws-c-io (648 KiB) in 199ms
  188. 43.02 s Progress: 0 of 1 built, 47 of 68 downloaded from cache (2 downloading)
  189. 43.02 s Downloading cached aws-c-event-stream from https://cache.nix-ci.com
  190. 43.02 s Downloading cached aws-c-http from https://cache.nix-ci.com
  191. 43.19 s Downloaded cached aws-c-event-stream (176 KiB) in 171ms
  192. 43.19 s Progress: 0 of 1 built, 48 of 68 downloaded from cache (3 downloading)
  193. 43.20 s Downloaded cached aws-c-http (641 KiB) in 177ms
  194. 43.20 s Progress: 0 of 1 built, 49 of 68 downloaded from cache (2 downloading)
  195. 43.20 s Downloading cached aws-c-auth from https://cache.nix-ci.com
  196. 43.20 s Downloading cached aws-c-mqtt from https://cache.nix-ci.com
  197. 43.38 s Downloaded cached aws-c-mqtt (557 KiB) in 183ms
  198. 43.38 s Progress: 0 of 1 built, 50 of 68 downloaded from cache (3 downloading)
  199. 43.39 s Downloaded cached aws-c-auth (387 KiB) in 190ms
  200. 43.39 s Progress: 0 of 1 built, 51 of 68 downloaded from cache (2 downloading)
  201. 43.39 s Downloading cached aws-c-s3 from https://cache.nix-ci.com
  202. 43.57 s Downloaded cached aws-c-s3 (384 KiB) in 186ms
  203. 43.57 s Progress: 0 of 1 built, 52 of 68 downloaded from cache (2 downloading)
  204. 43.57 s Downloading cached aws-crt-cpp from https://cache.nix-ci.com
  205. 44.26 s Downloaded cached aws-crt-cpp (979 KiB) in 683ms
  206. 44.26 s Progress: 0 of 1 built, 53 of 68 downloaded from cache (2 downloading)
  207. 44.37 s Downloaded cached icu4c (38.2 MiB) in 1.8s
  208. 44.37 s Progress: 0 of 1 built, 54 of 68 downloaded from cache (1 downloading)
  209. 44.37 s Downloading cached boost from https://cache.nix-ci.com
  210. 44.91 s Downloaded cached boost (14.5 MiB) in 547ms
  211. 44.91 s Progress: 0 of 1 built, 55 of 68 downloaded from cache (1 downloading)
  212. 44.91 s Downloading cached nix-util from https://cache.nix-ci.com
  213. 45.20 s Downloaded cached nix-util (2.4 MiB) in 291ms
  214. 45.20 s Progress: 0 of 1 built, 56 of 68 downloaded from cache (1 downloading)
  215. 45.21 s Downloading cached nix-nswrapper from https://cache.nix-ci.com
  216. 45.21 s Downloading cached nix-store from https://cache.nix-ci.com
  217. 45.38 s Downloaded cached nix-nswrapper (131 KiB) in 177ms
  218. 45.38 s Progress: 0 of 1 built, 57 of 68 downloaded from cache (2 downloading)
  219. 45.52 s Downloaded cached nix-store (5.8 MiB) in 319ms
  220. 45.52 s Progress: 0 of 1 built, 58 of 68 downloaded from cache (1 downloading)
  221. 45.53 s Downloading cached nix-fetchers from https://cache.nix-ci.com
  222. 45.53 s Downloading cached nix-main from https://cache.nix-ci.com
  223. 45.70 s Downloaded cached nix-main (393 KiB) in 174ms
  224. 45.70 s Progress: 0 of 1 built, 59 of 68 downloaded from cache (2 downloading)
  225. 45.71 s Downloaded cached nix-fetchers (1.5 MiB) in 180ms
  226. 45.71 s Progress: 0 of 1 built, 60 of 68 downloaded from cache (1 downloading)
  227. 45.71 s Downloading cached nix-expr from https://cache.nix-ci.com
  228. 46.02 s Downloaded cached nix-expr (3.3 MiB) in 310ms
  229. 46.02 s Progress: 0 of 1 built, 61 of 68 downloaded from cache (1 downloading)
  230. 46.02 s Downloading cached nix-flake from https://cache.nix-ci.com
  231. 46.21 s Downloaded cached nix-flake (956 KiB) in 196ms
  232. 46.21 s Progress: 0 of 1 built, 62 of 68 downloaded from cache (1 downloading)
  233. 46.21 s Downloading cached nix-cmd from https://cache.nix-ci.com
  234. 46.38 s Downloaded cached nix-cmd (1 MiB) in 165ms
  235. 46.38 s Progress: 0 of 1 built, 63 of 68 downloaded from cache (1 downloading)
  236. 46.38 s Downloading cached nix from https://cache.nix-ci.com
  237. 46.67 s Downloaded cached nix (3.9 MiB) in 293ms
  238. 46.67 s Progress: 0 of 1 built, 64 of 68 downloaded from cache (1 downloading)
  239. 46.67 s Downloading cached nix from https://cache.nix-ci.com
  240. 46.85 s Downloaded cached nix (8848 B) in 178ms
  241. 46.85 s Progress: 0 of 1 built, 65 of 68 downloaded from cache (1 downloading)
  242. 48.53 s Downloaded cached gammaloop-nextest-binaries-integration-gammaloop-integration-tests (424.6 MiB) in 6.7s
  243. 48.53 s Progress: 0 of 1 built, 66 of 68 downloaded from cache
  244. 48.53 s Downloading cached gammaloop-nextest-binaries-integration from https://cache.nix-ci.com
  245. 48.69 s Downloaded cached gammaloop-nextest-binaries-integration (528 B) in 162ms
  246. 48.69 s Progress: 0 of 1 built, 67 of 68 downloaded from cache
  247. 48.69 s Downloading cached nix-ci-check-gammaloop-nextest-integration from https://cache.nix-ci.com
  248. 48.73 s Downloaded cached nix-ci-check-gammaloop-nextest-integration (1032 B) in 38ms
  249. 48.73 s Progress: 0 of 1 built, 68 of 68 downloaded from cache
  250. 53.76 s evaluating derivation 'g copying '/nix/store/srmp evaluating derivation 'g copying '/nix/store/srmp evaluating derivation 'g copying '/nix/store/srmp evaluating derivation 'g copying '/nix/store/srmp evaluating derivation 'g copying '/nix/store/srmp evaluating derivation 'g copying '/nix/store/srmp evaluating derivation 'g copying '/nix/store/srmp evaluating derivation 'g querying gammaloop-nexte [0.0 KiB DL] querying ca [12.0 KiB DL] querying e [29.1 KiB DL] querying g [43.0 KiB DL] querying b [47.5 KiB DL] querying g [0/13 built, 0/75 copied [0/22 built, 16/1/63 cop [0/21 built, 15/8/63 cop [0/21 built, 16/14/63 co [0/21 built, 16/15/63 co [0/21 built, 16/18/63 co [0/21 built, 16/20/63 co [0/21 built, 16/21/63 co [0/20 built, 16/28/63 co [0/18 built, 16/31/63 co [0/18 built, 16/34/63 co [0/17 built, 13/38/63 co [0/17 built, 13/41/63 co [0/17 built, 13/43/63 co [0/17 built, 12/44/63 co [0/17 built, 11/46/63 co [0/16 built, 10/47/63 co [1/0/16 built, 10/47/63 [2/0/16 built, 9/48/63 ccrane-dummy-cargo-target.rs (post)> Uploading to the NixCI cache: /nix/store/hd50hqi25fymr09a2w4xdiy5jmb2cfl5-crane-dummy-cargo-target.rs
  251. 53.79 s crane-dummy-cargo-target.rs (post)> warning: 'warn-short-path-literals' is deprecated, use 'lint-short-path-literals = ignore' instead
  252. 53.92 s crane-dummy-cargo-target.rs (post)> copying 0 paths...
  253. 53.97 s crane-dummy-cargo-target.rs (post)> warning: 'warn-short-path-literals' is deprecated, use 'lint-short-path-literals = ignore' instead
  254. 54.58 s crane-dummy-cargo-target.rs (post)> copying 0 paths...
  255. 54.62 s [1/1/16 built, 6/51/63 ccrane-dummy-proc-macro-cargo-target.rs (post)> Uploading to the NixCI cache: /nix/store/z0b4s6pznqwlbyw5v4bbq7k1kp721g19-crane-dummy-proc-macro-cargo-target.rs
  256. 54.66 s crane-dummy-proc-macro-cargo-target.rs (post)> warning: 'warn-short-path-literals' is deprecated, use 'lint-short-path-literals = ignore' instead
  257. 54.79 s crane-dummy-proc-macro-cargo-target.rs (post)> copying 0 paths...
  258. 54.84 s crane-dummy-proc-macro-cargo-target.rs (post)> warning: 'warn-short-path-literals' is deprecated, use 'lint-short-path-literals = ignore' instead
  259. 54.98 s crane-dummy-proc-macro-cargo-target.rs (post)> copying 0 paths...
  260. 58.49 s [2/14 built, 6/52/63 cop [2/14 built, 6/53/63 cop [2/14 built, 6/54/63 cop [2/13 built, 5/55/63 cop [2/12 built, 4/56/63 cop [2/12 built, 4/57/63 cop [2/11 built, 3/58/63 cop [1/2/10 built, 3/59/63 c [2/2/10 built, 3/59/63 c [2/2/9 built, 2/60/63 corust-stable-with-std (post)> Uploading to the NixCI cache: /nix/store/imnwv6nazijihjlgf2h3l1qm63m7l9wk-rust-stable-with-std-2026-07-09
  261. 58.53 s rust-stable-with-std (post)> warning: 'warn-short-path-literals' is deprecated, use 'lint-short-path-literals = ignore' instead
  262. 58.65 s rust-stable-with-std (post)> copying 0 paths...
  263. 58.70 s rust-stable-with-std (post)> warning: 'warn-short-path-literals' is deprecated, use 'lint-short-path-literals = ignore' instead
  264. 58.91 s rust-stable-with-std (post)> copying 0 paths...
  265. 59.07 s [1/3/10 built, 2/60/63 c [1/3/9 built, 1/61/63 coclippy-stable-with-std (post)> Uploading to the NixCI cache: /nix/store/r4bjy93lvnfma1awpi480n2mz3af0adx-clippy-stable-with-std-2026-07-09
  266. 59.11 s clippy-stable-with-std (post)> warning: 'warn-short-path-literals' is deprecated, use 'lint-short-path-literals = ignore' instead
  267. 59.23 s clippy-stable-with-std (post)> copying 0 paths...
  268. 59.28 s clippy-stable-with-std (post)> warning: 'warn-short-path-literals' is deprecated, use 'lint-short-path-literals = ignore' instead
  269. 59.41 s clippy-stable-with-std (post)> copying 0 paths...
  270. 59.50 s [1/4/8 built, 1/61/63 corust-stable-with-components> /nix/store/imnwv6nazijihjlgf2h3l1qm63m7l9wk-rust-stable-with-std-2026-07-09/bin:
  271. 59.50 s rust-stable-with-components> rustc: Keeping existing link to /nix/store/r4bjy93lvnfma1awpi480n2mz3af0adx-clippy-stable-with-std-2026-07-09/bin/rustc
  272. 59.50 s rust-stable-with-components> rust-gdb: Keeping existing link to /nix/store/r4bjy93lvnfma1awpi480n2mz3af0adx-clippy-stable-with-std-2026-07-09/bin/rust-gdb
  273. 59.50 s rust-stable-with-components> rust-lldb: Keeping existing link to /nix/store/r4bjy93lvnfma1awpi480n2mz3af0adx-clippy-stable-with-std-2026-07-09/bin/rust-lldb
  274. 59.50 s rust-stable-with-components> rust-gdbgui: Keeping existing link to /nix/store/r4bjy93lvnfma1awpi480n2mz3af0adx-clippy-stable-with-std-2026-07-09/bin/rust-gdbgui
  275. 59.50 s rust-stable-with-components> rustdoc: Keeping existing link to /nix/store/r4bjy93lvnfma1awpi480n2mz3af0adx-clippy-stable-with-std-2026-07-09/bin/rustdoc
  276. 59.50 s rust-stable-with-components> /nix/store/imnwv6nazijihjlgf2h3l1qm63m7l9wk-rust-stable-with-std-2026-07-09/lib:
  277. 59.50 s rust-stable-with-components> librustc_driver-a39fc8bf9e61dbb9.so: Keeping existing link to /nix/store/r4bjy93lvnfma1awpi480n2mz3af0adx-clippy-stable-with-std-2026-07-09/lib/librustc_driver-a39fc8bf9e61dbb9.so
  278. 59.99 s rust-stable-with-components (post)> Uploading to the NixCI cache: /nix/store/9pb4ikjdw4gp766ayxl6gg3b7hqm6ds4-rust-stable-with-components-2026-07-09
  279. 60.03 s rust-stable-with-components (post)> warning: 'warn-short-path-literals' is deprecated, use 'lint-short-path-literals = ignore' instead
  280. 60.16 s rust-stable-with-components (post)> copying 0 paths...
  281. 60.21 s rust-stable-with-components (post)> warning: 'warn-short-path-literals' is deprecated, use 'lint-short-path-literals = ignore' instead
  282. 60.35 s rust-stable-with-components (post)> copying 0 paths...
  283. 61.63 s [5/9 built, 1/61/63 copi [5/6 built, 63 copied (1 [1/5/6 built, 63 copied gammaloop-nextest-integration> Extracting 13 binaries, 1 build script output directory, and 3 linked paths to /build/nextest-archive-yPkpRm
  284. 63.86 s gammaloop-nextest-integration> Extracted 30 files to /build/nextest-archive-yPkpRm in 2.23s
  285. 63.88 s gammaloop-nextest-integration> ------------
  286. 63.88 s gammaloop-nextest-integration> Nextest run ID 36ad2938-36c6-477f-a109-8d8fb8db2f90 with nextest profile: ci_gammaloop
  287. 63.88 s gammaloop-nextest-integration> Starting 170 tests across 13 binaries (209 tests skipped, including 208 tests via profile.ci_gammaloop.default-filter)
  288. 153.42 s gammaloop-nextest-integration> FAIL [ 2.891s] ( 55/170) gammaloop-integration-tests::test_runs aa_aa::important::aa_aa_local_inspect_backend_consistency
  289. 153.42 s gammaloop-nextest-integration> stdout ---
  290. 153.42 s gammaloop-nextest-integration>
  291. 153.42 s gammaloop-nextest-integration> running 1 test
  292. 153.42 s gammaloop-nextest-integration> test aa_aa::important::aa_aa_local_inspect_backend_consistency ... FAILED
  293. 153.42 s gammaloop-nextest-integration>
  294. 153.42 s gammaloop-nextest-integration> failures:
  295. 153.42 s gammaloop-nextest-integration>
  296. 153.42 s gammaloop-nextest-integration> failures:
  297. 153.42 s gammaloop-nextest-integration> aa_aa::important::aa_aa_local_inspect_backend_consistency
  298. 153.42 s gammaloop-nextest-integration>
  299. 153.42 s gammaloop-nextest-integration> test result: FAILED. 0 passed; 1 failed; 0 ignored; 0 measured; 274 filtered out; finished in 2.88s
  300. 153.42 s gammaloop-nextest-integration>
  301. 153.42 s gammaloop-nextest-integration> stderr ---
  302. 153.42 s gammaloop-nextest-integration> [2026-09-23 20:51:50.374] @gammaloop_api::se... INFO : Running command import model sm-default.json
  303. 153.42 s gammaloop-nextest-integration> [2026-09-23 20:51:50.374] @import::model INFO : Loading built-in JSON model sm-default
  304. 153.42 s gammaloop-nextest-integration> [2026-09-23 20:51:50.396] @gammalooprs::model INFO : The following 15 external parameters were forced to zero by the restriction card:
  305. 153.42 s gammaloop-nextest-integration> lamWS, AWS, rhoWS, etaWS, ymc, yme, ymm, MC, Me, MM, WTau, muQ, muLe, muLmu, muLtau
  306. 153.42 s gammaloop-nextest-integration> [2026-09-23 20:51:50.396] @gammalooprs::model INFO : The following 34 vertex rules were removed by the restriction card:
  307. 153.42 s gammaloop-nextest-integration> V_82 -> (c~, d, G+) | V_83 -> (t~, d, G+) | V_84 -> (c~, s, G+) | V_85 -> (t~, s, G+) | V_86 -> (u~, b, G+) | V_87 -> (c~, b, G+) | V_90 -> (c~, d, W+) | V_91 -> (t~, d, W+) | V_92 -> (u~, s, W+) | V_94 -> (t~, s, W+) | V_95 -> (u~, b, W+) | V_96 -> (c~, b, W+) | V_101 -> (e+, e-, G0) | V_102 -> (mu+, mu-, G0) | V_104 -> (e+, e-, H) | V_105 -> (mu+, mu-, H) | V_110 -> (ve~, e-, G+) | V_111 -> (vm~, mu-, G+) | V_116 -> (b~, u, G-) | V_117 -> (d~, c, G-) | V_118 -> (s~, c, G-) | V_119 -> (b~, c, G-) | V_120 -> (d~, t, G-) | V_121 -> (s~, t, G-) | V_124 -> (s~, u, W-) | V_125 -> (b~, u, W-) | V_126 -> (d~, c, W-) | V_128 -> (b~, c, W-) | V_129 -> (d~, t, W-) | V_130 -> (s~, t, W-) | V_138 -> (c~, c, G0) | V_140 -> (c~, c, H) | V_145 -> (e+, ve, G-) | V_146 -> (mu+, vm, G-)
  308. 153.42 s gammaloop-nextest-integration> [2026-09-23 20:51:50.396] @gammalooprs::model INFO : The following 36 couplings were removed by the restriction card:
  309. 153.42 s gammaloop-nextest-integration> GC_13, GC_14, GC_16, GC_17, GC_18, GC_19, GC_20, GC_22, GC_23, GC_24, GC_25, GC_26, GC_28, GC_29, GC_42, GC_43, GC_44, GC_46, GC_47, GC_48, GC_84, GC_85, GC_86, GC_87, GC_88, GC_89, GC_90, GC_91, GC_92, GC_93, GC_101, GC_102, GC_103, GC_105, GC_106, GC_107
  310. 153.42 s gammaloop-nextest-integration> [2026-09-23 20:51:50.396] @gammaloop_api::se... INFO : Running command run set_model_parameters
  311. 153.42 s gammaloop-nextest-integration> [2026-09-23 20:51:50.396] @gammaloop_api::se... INFO : Starting command block set_model_parameters
  312. 153.42 s gammaloop-nextest-integration> [2026-09-23 20:51:50.397] @gammaloop_api::se... INFO : Running command set model MT=173.0
  313. 153.42 s gammaloop-nextest-integration> [2026-09-23 20:51:50.401] @gammaloop_api::se... INFO : Running command set model WT=0.0
  314. 153.42 s gammaloop-nextest-integration> [2026-09-23 20:51:50.405] @gammaloop_api::se... INFO : Running command set model ymt=173.0
  315. 153.42 s gammaloop-nextest-integration> [2026-09-23 20:51:50.410] @gammaloop_api::se... INFO : Running command set model aS=0.118
  316. 153.42 s gammaloop-nextest-integration> [2026-09-23 20:51:50.414] @gammaloop_api::se... INFO : Running command set model aEWM1=137.036
  317. 153.42 s gammaloop-nextest-integration> [2026-09-23 20:51:50.419] @gammaloop_api::se... INFO : Running command set model Gf=1.166390e-05
  318. 153.42 s gammaloop-nextest-integration> [2026-09-23 20:51:50.423] @gammaloop_api::se... INFO : Running command set model MZ=91.188
  319. 153.42 s gammaloop-nextest-integration> [2026-09-23 20:51:50.428] @gammaloop_api::se... INFO : Running command set global string '
  320. 153.42 s gammaloop-nextest-integration> [global.generation.compile]
  321. 153.42 s gammaloop-nextest-integration> compilation_mode = "symjit"
  322. 153.42 s gammaloop-nextest-integration> optimization_level = "O0"
  323. 153.42 s gammaloop-nextest-integration> fast_math = false
  324. 153.42 s gammaloop-nextest-integration> [...]
  325. 153.42 s gammaloop-nextest-integration> [2026-09-23 20:51:50.428] @gammaloop_api::se... INFO : Running command import graphs ./examples/cli/aa_aa/1L/aa_aa_1L.dot -p aa_aa_all_helicities -i 1L_ppmm -o
  326. 153.42 s gammaloop-nextest-integration> [2026-09-23 20:51:50.429] @commands::import INFO : Loading graphs from '/build/source/examples/cli/aa_aa/1L/aa_aa_1L.dot'
  327. 153.42 s gammaloop-nextest-integration> [2026-09-23 20:51:50.437] @gammaloop_api::se... INFO : Running command generate existing -p aa_aa_all_helicities
  328. 153.42 s gammaloop-nextest-integration> The application panicked (crashed).
  329. 153.42 s gammaloop-nextest-integration> Message: label _func_power_ not found
  330. 153.42 s gammaloop-nextest-integration> Location: /nix/store/n9w914kh1cm59xx3spcs831cdyb56m32-vendor-cargo-deps/c19b7c6f923b580ac259164a89f2577984ad5ab09ee9d583b888f934adbbe8d0/symjit-2.25.6/src/symjit/assembler.rs:77
  331. 153.42 s gammaloop-nextest-integration>
  332. 153.42 s gammaloop-nextest-integration> ━━━━━━━━━━━━━━━━━━━━━━━━━━━━━━━━━━ BACKTRACE ━━━━━━━━━━━━━━━━━━━━━━━━━━━━━━━━━━━
  333. 153.42 s gammaloop-nextest-integration> 1: <color_eyre[51793ea62743adbd]::config::PanicHook>::panic_report<unknown>
  334. 153.42 s gammaloop-nextest-integration> at <unknown source file>:<unknown line>
  335. 153.42 s gammaloop-nextest-integration> 2: <color_eyre[51793ea62743adbd]::config::PanicHook>::into_panic_hook::{closure#0}<unknown>
  336. 153.42 s gammaloop-nextest-integration> at <unknown source file>:<unknown line>
  337. 153.42 s gammaloop-nextest-integration> 3: std[bcb96dfbba0ab899]::panicking::panic_with_hook<unknown>
  338. 153.42 s gammaloop-nextest-integration> at <unknown source file>:<unknown line>
  339. 153.42 s gammaloop-nextest-integration> 4: std[bcb96dfbba0ab899]::panicking::panic_handler::{closure#0}<unknown>
  340. 153.42 s gammaloop-nextest-integration> at <unknown source file>:<unknown line>
  341. 153.42 s gammaloop-nextest-integration> 5: std[bcb96dfbba0ab899]::sys::backtrace::__rust_end_short_backtrace::<std[bcb96dfbba0ab899]::panicking::panic_handler::{closure#0}, !><unknown>
  342. 153.42 s gammaloop-nextest-integration> at <unknown source file>:<unknown line>
  343. 153.42 s gammaloop-nextest-integration> 6: __rustc[6c289b9f9c454d21]::rust_begin_unwind<unknown>
  344. 153.42 s gammaloop-nextest-integration> at <unknown source file>:<unknown line>
  345. 153.42 s gammaloop-nextest-integration> 7: core[940e698046960fd5]::panicking::panic_fmt<unknown>
  346. 153.42 s gammaloop-nextest-integration> at <unknown source file>:<unknown line>
  347. 153.42 s gammaloop-nextest-integration> 8: <symjit[e408de789c333cd]::symjit::assembler::Assembler>::apply_jumps<unknown>
  348. 153.42 s gammaloop-nextest-integration> at <unknown source file>:<unknown line>
  349. 153.42 s gammaloop-nextest-integration> 9: <symjit[e408de789c333cd]::symjit::builder::Builder>::compile_from_mir::<symjit[e408de789c333cd]::symjit::amd::complex::AmdComplexGenerator><unknown>
  350. 153.42 s gammaloop-nextest-integration> at <unknown source file>:<unknown line>
  351. 153.42 s gammaloop-nextest-integration> 10: <symjit[e408de789c333cd]::symjit::runnable::Application>::compile_ty<unknown>
  352. 153.42 s gammaloop-nextest-integration> at <unknown source file>:<unknown line>
  353. 153.42 s gammaloop-nextest-integration> 11: <symjit[e408de789c333cd]::symjit::runnable::Application>::with_mir<unknown>
  354. 153.42 s gammaloop-nextest-integration> at <unknown source file>:<unknown line>
  355. 153.42 s gammaloop-nextest-integration> 12: <symjit[e408de789c333cd]::symjit::composer::DirectTranslator as symjit[e408de789c333cd]::symjit::composer::Composer>::compile<unknown>
  356. 153.42 s gammaloop-nextest-integration> at <unknown source file>:<unknown line>
  357. 153.42 s gammaloop-nextest-integration> 13: <symjit[e408de789c333cd]::symjit::compiler::Translator as symjit[e408de789c333cd]::symjit::composer::Composer>::compile<unknown>
  358. 153.42 s gammaloop-nextest-integration> at <unknown source file>:<unknown line>
  359. 153.42 s gammaloop-nextest-integration> 14: <numerica[124dab8567f4861e]::domains::float::complex::Complex<f64> as symbolica[10e259bab675d243]::evaluate::backend::JITCompiledNumber>::jit_compile<unknown>
  360. 153.42 s gammaloop-nextest-integration> at <unknown source file>:<unknown line>
  361. 153.42 s gammaloop-nextest-integration> 15: <gammalooprs[917cbd3df9e68f8f]::integrands::process::evaluators::GenericEvaluator>::activate_symjit<unknown>
  362. 153.42 s gammaloop-nextest-integration> at <unknown source file>:<unknown line>
  363. 153.42 s gammaloop-nextest-integration> 16: <gammalooprs[917cbd3df9e68f8f]::integrands::process::amplitude::AmplitudeIntegrand>::prepare_runtime_backends_after_generation_with_compile_times<unknown>
  364. 153.42 s gammaloop-nextest-integration> at <unknown source file>:<unknown line>
  365. 153.42 s gammaloop-nextest-integration> 17: <gammalooprs[917cbd3df9e68f8f]::processes::amplitude::Amplitude>::build_integrand<unknown>
  366. 153.42 s gammaloop-nextest-integration> at <unknown source file>:<unknown line>
  367. 153.42 s gammaloop-nextest-integration> 18: <gammalooprs[917cbd3df9e68f8f]::processes::process::Process>::generate_integrands<unknown>
  368. 153.42 s gammaloop-nextest-integration> at <unknown source file>:<unknown line>
  369. 153.42 s gammaloop-nextest-integration> 19: <gammaloop_api[9ebf6628f97aeb57]::state::State>::generate_integrand<unknown>
  370. 153.42 s gammaloop-nextest-integration> at <unknown source file>:<unknown line>
  371. 153.42 s gammaloop-nextest-integration> 20: <gammaloop_api[9ebf6628f97aeb57]::commands::generate::Generate>::run::<&std[bcb96dfbba0ab899]::path::PathBuf><unknown>
  372. 153.42 s gammaloop-nextest-integration> at <unknown source file>:<unknown line>
  373. 153.42 s gammaloop-nextest-integration> 21: <gammaloop_api[9ebf6628f97aeb57]::commands::Commands>::run<unknown>
  374. 153.42 s gammaloop-nextest-integration> at <unknown source file>:<unknown line>
  375. 153.42 s gammaloop-nextest-integration> 22: <gammaloop_api[9ebf6628f97aeb57]::session::CliSession>::execute_prepared<unknown>
  376. 153.42 s gammaloop-nextest-integration> at <unknown source file>:<unknown line>
  377. 153.42 s gammaloop-nextest-integration> 23: <gammaloop_api[9ebf6628f97aeb57]::session::CliSession>::execute_command<unknown>
  378. 153.42 s gammaloop-nextest-integration> at <unknown source file>:<unknown line>
  379. 153.42 s gammaloop-nextest-integration> 24: <gammaloop_integration_tests[191607b70c61cd5a]::CLIState>::run_command<unknown>
  380. 153.42 s gammaloop-nextest-integration> at <unknown source file>:<unknown line>
  381. 153.42 s gammaloop-nextest-integration> 25: test_runs[9b7e2dc2dc4f29b0]::aa_aa::generate_aa_aa_helicity_family<unknown>
  382. 153.42 s gammaloop-nextest-integration> at <unknown source file>:<unknown line>
  383. 153.42 s gammaloop-nextest-integration> 26: <test_runs[9b7e2dc2dc4f29b0]::aa_aa::important::aa_aa_local_inspect_backend_consistency::{closure#0} as core[940e698046960fd5]::ops::function::FnOnce<()>>::call_once<unknown>
  384. 153.42 s gammaloop-nextest-integration> at <unknown source file>:<unknown line>
  385. 153.42 s gammaloop-nextest-integration> 27: serial_test[cd99724524a2f1c0]::serial_code_lock::local_serial_core_with_return::<(), eyre[cb2fd339c0c40fca]::Report><unknown>
  386. 153.42 s gammaloop-nextest-integration> at <unknown source file>:<unknown line>
  387. 153.42 s gammaloop-nextest-integration> 28: <test_runs[9b7e2dc2dc4f29b0]::aa_aa::important::aa_aa_local_inspect_backend_consistency::{closure#0} as core[940e698046960fd5]::ops::function::FnOnce<()>>::call_once<unknown>
  388. 153.42 s gammaloop-nextest-integration> at <unknown source file>:<unknown line>
  389. 153.42 s gammaloop-nextest-integration> 29: test[75d6903177b1d7e9]::__rust_begin_short_backtrace::<core[940e698046960fd5]::result::Result<(), alloc[2ea6bcb46fca0c42]::string::String>, fn() -> core[940e698046960fd5]::result::Result<(), alloc[2ea6bcb46fca0c42]::string::String>><unknown>
  390. 153.42 s gammaloop-nextest-integration> at <unknown source file>:<unknown line>
  391. 153.42 s gammaloop-nextest-integration> 30: test[75d6903177b1d7e9]::run_test::{closure#0}<unknown>
  392. 153.42 s gammaloop-nextest-integration> at <unknown source file>:<unknown line>
  393. 153.42 s gammaloop-nextest-integration> 31: std[bcb96dfbba0ab899]::sys::backtrace::__rust_begin_short_backtrace::<test[75d6903177b1d7e9]::run_test::{closure#1}, ()><unknown>
  394. 153.42 s gammaloop-nextest-integration> at <unknown source file>:<unknown line>
  395. 153.42 s gammaloop-nextest-integration> 32: <std[bcb96dfbba0ab899]::thread::lifecycle::spawn_unchecked<test[75d6903177b1d7e9]::run_test::{closure#1}, ()>::{closure#1} as core[940e698046960fd5]::ops::function::FnOnce<()>>::call_once::{shim:vtable#0}<unknown>
  396. 153.42 s gammaloop-nextest-integration> at <unknown source file>:<unknown line>
  397. 153.42 s gammaloop-nextest-integration> 33: <std[bcb96dfbba0ab899]::sys::thread::unix::Thread>::new::thread_start<unknown>
  398. 153.42 s gammaloop-nextest-integration> at <unknown source file>:<unknown line>
  399. 153.42 s gammaloop-nextest-integration> 34: start_thread<unknown>
  400. 153.42 s gammaloop-nextest-integration> at <unknown source file>:<unknown line>
  401. 153.42 s gammaloop-nextest-integration> 35: __clone3<unknown>
  402. 153.42 s gammaloop-nextest-integration> at <unknown source file>:<unknown line>
  403. 153.42 s gammaloop-nextest-integration>
  404. 153.42 s gammaloop-nextest-integration> Run with COLORBT_SHOW_HIDDEN=1 environment variable to disable frame filtering.
  405. 153.42 s gammaloop-nextest-integration> Run with RUST_BACKTRACE=full to include source snippets.
  406. 153.42 s gammaloop-nextest-integration> Warning: SpanTrace capture is Unsupported.
  407. 153.42 s gammaloop-nextest-integration> Ensure that you've setup a tracing-error ErrorLayer and the semver versions are compatible
  408. 153.42 s gammaloop-nextest-integration>
  409. 195.21 s gammaloop-nextest-integration> FAIL [ 2.562s] (158/170) gammaloop-integration-tests::uv thermal_sunrise_uv
  410. 195.21 s gammaloop-nextest-integration> stdout ---
  411. 195.21 s gammaloop-nextest-integration>
  412. 195.21 s gammaloop-nextest-integration> running 1 test
  413. 195.21 s gammaloop-nextest-integration> test thermal_sunrise_uv ... FAILED
  414. 195.21 s gammaloop-nextest-integration>
  415. 195.21 s gammaloop-nextest-integration> failures:
  416. 195.21 s gammaloop-nextest-integration>
  417. 195.21 s gammaloop-nextest-integration> failures:
  418. 195.21 s gammaloop-nextest-integration> thermal_sunrise_uv
  419. 195.21 s gammaloop-nextest-integration>
  420. 195.21 s gammaloop-nextest-integration> test result: FAILED. 0 passed; 1 failed; 0 ignored; 0 measured; 31 filtered out; finished in 2.55s
  421. 195.21 s gammaloop-nextest-integration>
  422. 195.21 s gammaloop-nextest-integration> stderr ---
  423. 195.21 s gammaloop-nextest-integration> [2026-09-23 20:52:32.581] @gammaloop_api::se... INFO : Running command run generate
  424. 195.21 s gammaloop-nextest-integration> [2026-09-23 20:52:32.581] @gammaloop_api::se... INFO : Starting command block generate
  425. 195.21 s gammaloop-nextest-integration> [2026-09-23 20:52:32.581] @gammaloop_api::se... INFO : Running command import model sm-default.json
  426. 195.21 s gammaloop-nextest-integration> [2026-09-23 20:52:32.581] @import::model INFO : Loading built-in JSON model sm-default
  427. 195.21 s gammaloop-nextest-integration> [2026-09-23 20:52:32.628] @gammalooprs::model INFO : The following 15 external parameters were forced to zero by the restriction card:
  428. 195.21 s gammaloop-nextest-integration> lamWS, AWS, rhoWS, etaWS, ymc, yme, ymm, MC, Me, MM, WTau, muQ, muLe, muLmu, muLtau
  429. 195.21 s gammaloop-nextest-integration> [2026-09-23 20:52:32.628] @gammalooprs::model INFO : The following 34 vertex rules were removed by the restriction card:
  430. 195.21 s gammaloop-nextest-integration> V_82 -> (c~, d, G+) | V_83 -> (t~, d, G+) | V_84 -> (c~, s, G+) | V_85 -> (t~, s, G+) | V_86 -> (u~, b, G+) | V_87 -> (c~, b, G+) | V_90 -> (c~, d, W+) | V_91 -> (t~, d, W+) | V_92 -> (u~, s, W+) | V_94 -> (t~, s, W+) | V_95 -> (u~, b, W+) | V_96 -> (c~, b, W+) | V_101 -> (e+, e-, G0) | V_102 -> (mu+, mu-, G0) | V_104 -> (e+, e-, H) | V_105 -> (mu+, mu-, H) | V_110 -> (ve~, e-, G+) | V_111 -> (vm~, mu-, G+) | V_116 -> (b~, u, G-) | V_117 -> (d~, c, G-) | V_118 -> (s~, c, G-) | V_119 -> (b~, c, G-) | V_120 -> (d~, t, G-) | V_121 -> (s~, t, G-) | V_124 -> (s~, u, W-) | V_125 -> (b~, u, W-) | V_126 -> (d~, c, W-) | V_128 -> (b~, c, W-) | V_129 -> (d~, t, W-) | V_130 -> (s~, t, W-) | V_138 -> (c~, c, G0) | V_140 -> (c~, c, H) | V_145 -> (e+, ve, G-) | V_146 -> (mu+, vm, G-)
  431. 195.21 s gammaloop-nextest-integration> [2026-09-23 20:52:32.628] @gammalooprs::model INFO : The following 36 couplings were removed by the restriction card:
  432. 195.21 s gammaloop-nextest-integration> GC_13, GC_14, GC_16, GC_17, GC_18, GC_19, GC_20, GC_22, GC_23, GC_24, GC_25, GC_26, GC_28, GC_29, GC_42, GC_43, GC_44, GC_46, GC_47, GC_48, GC_84, GC_85, GC_86, GC_87, GC_88, GC_89, GC_90, GC_91, GC_92, GC_93, GC_101, GC_102, GC_103, GC_105, GC_106, GC_107
  433. 195.21 s gammaloop-nextest-integration> [2026-09-23 20:52:32.628] @gammaloop_api::se... INFO : Running command remove processes
  434. 195.21 s gammaloop-nextest-integration> [2026-09-23 20:52:32.628] @gammaloop_api::se... INFO : Running command generate amp {} > {} [{2}] | g u
  435. 195.21 s gammaloop-nextest-integration> --numerator-grouping group_identical_graphs_up_to_scalar_rescaling
  436. 195.21 s gammaloop-nextest-integration> --max-n-bridges 0
  437. 195.21 s gammaloop-nextest-integration> --number-of-factorized-loop-subtopologies 1 1
  438. 195.21 s gammaloop-nextest-integration> --number-of-anticommutating-loops 1 1
  439. 195.21 s gammaloop-nextest-integration> [...]
  440. 195.21 s gammaloop-nextest-integration> [2026-09-23 20:52:32.629] @feyngen::diagram_... INFO : 0s | Δ=0s | Starting Feynman graph generation with Symbolica...
  441. 195.21 s gammaloop-nextest-integration> [2026-09-23 20:52:32.630] @feyngen::diagram_... INFO : 0s | Δ=0s | Number of graphs resulting from Symbolica generation: 3
  442. 195.21 s gammaloop-nextest-integration> [2026-09-23 20:52:32.630] @feyngen::diagram_... INFO : 0s | Δ=0s | Number of graphs retained after removal of vetoed topologies: 2
  443. 195.21 s gammaloop-nextest-integration> [2026-09-23 20:52:32.630] @feyngen::diagram_... INFO : 0s | Δ=0s | Number of graphs after vertex info assignment: 2
  444. 195.21 s gammaloop-nextest-integration> [2026-09-23 20:52:32.630] @feyngen::diagram_... INFO : 0s | Δ=0s | Number of graphs after all complete graphs filters are applied: 2
  445. 195.21 s gammaloop-nextest-integration> [2026-09-23 20:52:32.630] @feyngen::diagram_... INFO : 0s | Δ=0s | Number of graphs after closed anticommutating chains analysis: 1
  446. 195.21 s gammaloop-nextest-integration> [2026-09-23 20:52:32.630] @feyngen::diagram_... INFO : 0s | Δ=0s | Number of graphs after symmetrization of external states: 1
  447. 195.21 s gammaloop-nextest-integration> [2026-09-23 20:52:32.630] @feyngen::diagram_... INFO : 0s | Δ=0s | Number of graphs after canonization of vertices, edges and flows (graph labels assigned here): 1
  448. 195.21 s gammaloop-nextest-integration> [2026-09-23 20:52:32.642] @feyngen::diagram_... INFO : 0s | Δ=0s | Number of graphs after numerator-aware grouping with strategy 'up to a scalar rescaling': 1 (1 isomorphically unique graph, 0 color zero, 0 lorentz zero, 0 grouped and 0 cancellation)
  449. 195.21 s gammaloop-nextest-integration> [2026-09-23 20:52:32.642] @feyngen::diagram_... INFO : ( Sum of the symmetry factors from each graph generated = -1/2 )
  450. 195.21 s gammaloop-nextest-integration> [2026-09-23 20:52:32.642] @commands::generate INFO : Generated amplitude 1 graphs.
  451. 195.21 s gammaloop-nextest-integration> [2026-09-23 20:52:32.642] @commands::generate INFO : Only diagram generation was requested, skipping integrand generation. You can generate integrands later using the 'generate existing <options>' command.
  452. 195.21 s gammaloop-nextest-integration> [2026-09-23 20:52:32.642] @gammaloop_api::se... INFO : Running command generate
  453. 195.21 s gammaloop-nextest-integration> The application panicked (crashed).
  454. 195.21 s gammaloop-nextest-integration> Message: label _func_power_ not found
  455. 195.21 s gammaloop-nextest-integration> Location: /nix/store/n9w914kh1cm59xx3spcs831cdyb56m32-vendor-cargo-deps/c19b7c6f923b580ac259164a89f2577984ad5ab09ee9d583b888f934adbbe8d0/symjit-2.25.6/src/symjit/assembler.rs:77
  456. 195.21 s gammaloop-nextest-integration>
  457. 195.21 s gammaloop-nextest-integration> ━━━━━━━━━━━━━━━━━━━━━━━━━━━━━━━━━━ BACKTRACE ━━━━━━━━━━━━━━━━━━━━━━━━━━━━━━━━━━━
  458. 195.21 s gammaloop-nextest-integration> 1: <color_eyre[51793ea62743adbd]::config::PanicHook>::panic_report<unknown>
  459. 195.21 s gammaloop-nextest-integration> at <unknown source file>:<unknown line>
  460. 195.21 s gammaloop-nextest-integration> 2: <color_eyre[51793ea62743adbd]::config::PanicHook>::into_panic_hook::{closure#0}<unknown>
  461. 195.21 s gammaloop-nextest-integration> at <unknown source file>:<unknown line>
  462. 195.21 s gammaloop-nextest-integration> 3: std[bcb96dfbba0ab899]::panicking::panic_with_hook<unknown>
  463. 195.21 s gammaloop-nextest-integration> at <unknown source file>:<unknown line>
  464. 195.21 s gammaloop-nextest-integration> 4: std[bcb96dfbba0ab899]::panicking::panic_handler::{closure#0}<unknown>
  465. 195.21 s gammaloop-nextest-integration> at <unknown source file>:<unknown line>
  466. 195.21 s gammaloop-nextest-integration> 5: std[bcb96dfbba0ab899]::sys::backtrace::__rust_end_short_backtrace::<std[bcb96dfbba0ab899]::panicking::panic_handler::{closure#0}, !><unknown>
  467. 195.21 s gammaloop-nextest-integration> at <unknown source file>:<unknown line>
  468. 195.21 s gammaloop-nextest-integration> 6: __rustc[6c289b9f9c454d21]::rust_begin_unwind<unknown>
  469. 195.21 s gammaloop-nextest-integration> at <unknown source file>:<unknown line>
  470. 195.21 s gammaloop-nextest-integration> 7: core[940e698046960fd5]::panicking::panic_fmt<unknown>
  471. 195.21 s gammaloop-nextest-integration> at <unknown source file>:<unknown line>
  472. 195.21 s gammaloop-nextest-integration> 8: <symjit[e408de789c333cd]::symjit::assembler::Assembler>::apply_jumps<unknown>
  473. 195.21 s gammaloop-nextest-integration> at <unknown source file>:<unknown line>
  474. 195.21 s gammaloop-nextest-integration> 9: <symjit[e408de789c333cd]::symjit::builder::Builder>::compile_from_mir::<symjit[e408de789c333cd]::symjit::amd::complex::AmdComplexGenerator><unknown>
  475. 195.21 s gammaloop-nextest-integration> at <unknown source file>:<unknown line>
  476. 195.21 s gammaloop-nextest-integration> 10: <symjit[e408de789c333cd]::symjit::runnable::Application>::compile_ty<unknown>
  477. 195.21 s gammaloop-nextest-integration> at <unknown source file>:<unknown line>
  478. 195.21 s gammaloop-nextest-integration> 11: <symjit[e408de789c333cd]::symjit::runnable::Application>::with_mir<unknown>
  479. 195.21 s gammaloop-nextest-integration> at <unknown source file>:<unknown line>
  480. 195.21 s gammaloop-nextest-integration> 12: <symjit[e408de789c333cd]::symjit::composer::DirectTranslator as symjit[e408de789c333cd]::symjit::composer::Composer>::compile<unknown>
  481. 195.21 s gammaloop-nextest-integration> at <unknown source file>:<unknown line>
  482. 195.21 s gammaloop-nextest-integration> 13: <symjit[e408de789c333cd]::symjit::compiler::Translator as symjit[e408de789c333cd]::symjit::composer::Composer>::compile<unknown>
  483. 195.21 s gammaloop-nextest-integration> at <unknown source file>:<unknown line>
  484. 195.21 s gammaloop-nextest-integration> 14: <numerica[124dab8567f4861e]::domains::float::complex::Complex<f64> as symbolica[10e259bab675d243]::evaluate::backend::JITCompiledNumber>::jit_compile<unknown>
  485. 195.21 s gammaloop-nextest-integration> at <unknown source file>:<unknown line>
  486. 195.21 s gammaloop-nextest-integration> 15: <gammalooprs[917cbd3df9e68f8f]::integrands::process::evaluators::GenericEvaluator>::activate_symjit<unknown>
  487. 195.21 s gammaloop-nextest-integration> at <unknown source file>:<unknown line>
  488. 195.21 s gammaloop-nextest-integration> 16: <gammalooprs[917cbd3df9e68f8f]::integrands::process::amplitude::AmplitudeIntegrand>::prepare_runtime_backends_after_generation_with_compile_times<unknown>
  489. 195.21 s gammaloop-nextest-integration> at <unknown source file>:<unknown line>
  490. 195.21 s gammaloop-nextest-integration> 17: <gammalooprs[917cbd3df9e68f8f]::processes::amplitude::Amplitude>::build_integrand<unknown>
  491. 195.21 s gammaloop-nextest-integration> at <unknown source file>:<unknown line>
  492. 195.21 s gammaloop-nextest-integration> 18: <gammalooprs[917cbd3df9e68f8f]::processes::process::Process>::generate_integrands<unknown>
  493. 195.21 s gammaloop-nextest-integration> at <unknown source file>:<unknown line>
  494. 195.21 s gammaloop-nextest-integration> 19: <gammalooprs[917cbd3df9e68f8f]::processes::ProcessList>::generate_integrands<unknown>
  495. 195.21 s gammaloop-nextest-integration> at <unknown source file>:<unknown line>
  496. 195.21 s gammaloop-nextest-integration> 20: <gammaloop_api[9ebf6628f97aeb57]::state::State>::generate_integrands<unknown>
  497. 195.21 s gammaloop-nextest-integration> at <unknown source file>:<unknown line>
  498. 195.21 s gammaloop-nextest-integration> 21: <gammaloop_api[9ebf6628f97aeb57]::commands::generate::Generate>::run::<&std[bcb96dfbba0ab899]::path::PathBuf><unknown>
  499. 195.21 s gammaloop-nextest-integration> at <unknown source file>:<unknown line>
  500. 195.21 s gammaloop-nextest-integration> 22: <gammaloop_api[9ebf6628f97aeb57]::commands::Commands>::run<unknown>
  501. 195.21 s gammaloop-nextest-integration> at <unknown source file>:<unknown line>
  502. 195.21 s gammaloop-nextest-integration> 23: <gammaloop_api[9ebf6628f97aeb57]::session::CliSession>::execute_prepared<unknown>
  503. 195.21 s gammaloop-nextest-integration> at <unknown source file>:<unknown line>
  504. 195.21 s gammaloop-nextest-integration> 24: <gammaloop_api[9ebf6628f97aeb57]::session::CliSession>::execute_prepared_commands<unknown>
  505. 195.21 s gammaloop-nextest-integration> at <unknown source file>:<unknown line>
  506. 195.21 s gammaloop-nextest-integration> 25: <gammaloop_api[9ebf6628f97aeb57]::session::CliSession>::execute_prepared<unknown>
  507. 195.21 s gammaloop-nextest-integration> at <unknown source file>:<unknown line>
  508. 195.21 s gammaloop-nextest-integration> 26: <gammaloop_api[9ebf6628f97aeb57]::session::CliSession>::execute_command<unknown>
  509. 195.21 s gammaloop-nextest-integration> at <unknown source file>:<unknown line>
  510. 195.21 s gammaloop-nextest-integration> 27: <gammaloop_integration_tests[191607b70c61cd5a]::CLIState>::run_command<unknown>
  511. 195.21 s gammaloop-nextest-integration> at <unknown source file>:<unknown line>
  512. 195.21 s gammaloop-nextest-integration> 28: uv[3c7454ef256d6487]::run_single_integrated_uv_case<unknown>
  513. 195.21 s gammaloop-nextest-integration> at <unknown source file>:<unknown line>
  514. 195.21 s gammaloop-nextest-integration> 29: <uv[3c7454ef256d6487]::thermal_sunrise_uv::{closure#0} as core[940e698046960fd5]::ops::function::FnOnce<()>>::call_once<unknown>
  515. 195.21 s gammaloop-nextest-integration> at <unknown source file>:<unknown line>
  516. 195.21 s gammaloop-nextest-integration> 30: test[75d6903177b1d7e9]::__rust_begin_short_backtrace::<core[940e698046960fd5]::result::Result<(), alloc[2ea6bcb46fca0c42]::string::String>, fn() -> core[940e698046960fd5]::result::Result<(), alloc[2ea6bcb46fca0c42]::string::String>><unknown>
  517. 195.21 s gammaloop-nextest-integration> at <unknown source file>:<unknown line>
  518. 195.21 s gammaloop-nextest-integration> 31: test[75d6903177b1d7e9]::run_test::{closure#0}<unknown>
  519. 195.21 s gammaloop-nextest-integration> at <unknown source file>:<unknown line>
  520. 195.21 s gammaloop-nextest-integration> 32: std[bcb96dfbba0ab899]::sys::backtrace::__rust_begin_short_backtrace::<test[75d6903177b1d7e9]::run_test::{closure#1}, ()><unknown>
  521. 195.21 s gammaloop-nextest-integration> at <unknown source file>:<unknown line>
  522. 195.21 s gammaloop-nextest-integration> 33: <std[bcb96dfbba0ab899]::thread::lifecycle::spawn_unchecked<test[75d6903177b1d7e9]::run_test::{closure#1}, ()>::{closure#1} as core[940e698046960fd5]::ops::function::FnOnce<()>>::call_once::{shim:vtable#0}<unknown>
  523. 195.21 s gammaloop-nextest-integration> at <unknown source file>:<unknown line>
  524. 195.21 s gammaloop-nextest-integration> 34: <std[bcb96dfbba0ab899]::sys::thread::unix::Thread>::new::thread_start<unknown>
  525. 195.21 s gammaloop-nextest-integration> at <unknown source file>:<unknown line>
  526. 195.21 s gammaloop-nextest-integration> 35: start_thread<unknown>
  527. 195.21 s gammaloop-nextest-integration> at <unknown source file>:<unknown line>
  528. 195.21 s gammaloop-nextest-integration> 36: __clone3<unknown>
  529. 195.21 s gammaloop-nextest-integration> at <unknown source file>:<unknown line>
  530. 195.21 s gammaloop-nextest-integration>
  531. 195.21 s gammaloop-nextest-integration> Run with COLORBT_SHOW_HIDDEN=1 environment variable to disable frame filtering.
  532. 195.21 s gammaloop-nextest-integration> Run with RUST_BACKTRACE=full to include source snippets.
  533. 195.21 s gammaloop-nextest-integration> Warning: SpanTrace capture is Unsupported.
  534. 195.21 s gammaloop-nextest-integration> Ensure that you've setup a tracing-error ErrorLayer and the semver versions are compatible
  535. 195.21 s gammaloop-nextest-integration>
  536. 248.04 s gammaloop-nextest-integration> ------------
  537. 248.04 s gammaloop-nextest-integration> Summary [ 184.164s] 170 tests run: 168 passed, 2 failed, 209 skipped
  538. 248.04 s gammaloop-nextest-integration> FAIL [ 2.891s] ( 55/170) gammaloop-integration-tests::test_runs aa_aa::important::aa_aa_local_inspect_backend_consistency
  539. 248.04 s gammaloop-nextest-integration> stdout ---
  540. 248.04 s gammaloop-nextest-integration>
  541. 248.04 s gammaloop-nextest-integration> running 1 test
  542. 248.04 s gammaloop-nextest-integration> test aa_aa::important::aa_aa_local_inspect_backend_consistency ... FAILED
  543. 248.04 s gammaloop-nextest-integration>
  544. 248.04 s gammaloop-nextest-integration> failures:
  545. 248.04 s gammaloop-nextest-integration>
  546. 248.04 s gammaloop-nextest-integration> failures:
  547. 248.04 s gammaloop-nextest-integration> aa_aa::important::aa_aa_local_inspect_backend_consistency
  548. 248.04 s gammaloop-nextest-integration>
  549. 248.04 s gammaloop-nextest-integration> test result: FAILED. 0 passed; 1 failed; 0 ignored; 0 measured; 274 filtered out; finished in 2.88s
  550. 248.04 s gammaloop-nextest-integration>
  551. 248.04 s gammaloop-nextest-integration> stderr ---
  552. 248.04 s gammaloop-nextest-integration> [2026-09-23 20:51:50.374] @gammaloop_api::se... INFO : Running command import model sm-default.json
  553. 248.04 s gammaloop-nextest-integration> [2026-09-23 20:51:50.374] @import::model INFO : Loading built-in JSON model sm-default
  554. 248.04 s gammaloop-nextest-integration> [2026-09-23 20:51:50.396] @gammalooprs::model INFO : The following 15 external parameters were forced to zero by the restriction card:
  555. 248.04 s gammaloop-nextest-integration> lamWS, AWS, rhoWS, etaWS, ymc, yme, ymm, MC, Me, MM, WTau, muQ, muLe, muLmu, muLtau
  556. 248.04 s gammaloop-nextest-integration> [2026-09-23 20:51:50.396] @gammalooprs::model INFO : The following 34 vertex rules were removed by the restriction card:
  557. 248.04 s gammaloop-nextest-integration> V_82 -> (c~, d, G+) | V_83 -> (t~, d, G+) | V_84 -> (c~, s, G+) | V_85 -> (t~, s, G+) | V_86 -> (u~, b, G+) | V_87 -> (c~, b, G+) | V_90 -> (c~, d, W+) | V_91 -> (t~, d, W+) | V_92 -> (u~, s, W+) | V_94 -> (t~, s, W+) | V_95 -> (u~, b, W+) | V_96 -> (c~, b, W+) | V_101 -> (e+, e-, G0) | V_102 -> (mu+, mu-, G0) | V_104 -> (e+, e-, H) | V_105 -> (mu+, mu-, H) | V_110 -> (ve~, e-, G+) | V_111 -> (vm~, mu-, G+) | V_116 -> (b~, u, G-) | V_117 -> (d~, c, G-) | V_118 -> (s~, c, G-) | V_119 -> (b~, c, G-) | V_120 -> (d~, t, G-) | V_121 -> (s~, t, G-) | V_124 -> (s~, u, W-) | V_125 -> (b~, u, W-) | V_126 -> (d~, c, W-) | V_128 -> (b~, c, W-) | V_129 -> (d~, t, W-) | V_130 -> (s~, t, W-) | V_138 -> (c~, c, G0) | V_140 -> (c~, c, H) | V_145 -> (e+, ve, G-) | V_146 -> (mu+, vm, G-)
  558. 248.04 s gammaloop-nextest-integration> [2026-09-23 20:51:50.396] @gammalooprs::model INFO : The following 36 couplings were removed by the restriction card:
  559. 248.04 s gammaloop-nextest-integration> GC_13, GC_14, GC_16, GC_17, GC_18, GC_19, GC_20, GC_22, GC_23, GC_24, GC_25, GC_26, GC_28, GC_29, GC_42, GC_43, GC_44, GC_46, GC_47, GC_48, GC_84, GC_85, GC_86, GC_87, GC_88, GC_89, GC_90, GC_91, GC_92, GC_93, GC_101, GC_102, GC_103, GC_105, GC_106, GC_107
  560. 248.04 s gammaloop-nextest-integration> [2026-09-23 20:51:50.396] @gammaloop_api::se... INFO : Running command run set_model_parameters
  561. 248.04 s gammaloop-nextest-integration> [2026-09-23 20:51:50.396] @gammaloop_api::se... INFO : Starting command block set_model_parameters
  562. 248.04 s gammaloop-nextest-integration> [2026-09-23 20:51:50.397] @gammaloop_api::se... INFO : Running command set model MT=173.0
  563. 248.04 s gammaloop-nextest-integration> [2026-09-23 20:51:50.401] @gammaloop_api::se... INFO : Running command set model WT=0.0
  564. 248.04 s gammaloop-nextest-integration> [2026-09-23 20:51:50.405] @gammaloop_api::se... INFO : Running command set model ymt=173.0
  565. 248.04 s gammaloop-nextest-integration> [2026-09-23 20:51:50.410] @gammaloop_api::se... INFO : Running command set model aS=0.118
  566. 248.04 s gammaloop-nextest-integration> [2026-09-23 20:51:50.414] @gammaloop_api::se... INFO : Running command set model aEWM1=137.036
  567. 248.04 s gammaloop-nextest-integration> [2026-09-23 20:51:50.419] @gammaloop_api::se... INFO : Running command set model Gf=1.166390e-05
  568. 248.04 s gammaloop-nextest-integration> [2026-09-23 20:51:50.423] @gammaloop_api::se... INFO : Running command set model MZ=91.188
  569. 248.04 s gammaloop-nextest-integration> [2026-09-23 20:51:50.428] @gammaloop_api::se... INFO : Running command set global string '
  570. 248.04 s gammaloop-nextest-integration> [global.generation.compile]
  571. 248.04 s gammaloop-nextest-integration> compilation_mode = "symjit"
  572. 248.04 s gammaloop-nextest-integration> optimization_level = "O0"
  573. 248.04 s gammaloop-nextest-integration> fast_math = false
  574. 248.04 s gammaloop-nextest-integration> [...]
  575. 248.04 s gammaloop-nextest-integration> [2026-09-23 20:51:50.428] @gammaloop_api::se... INFO : Running command import graphs ./examples/cli/aa_aa/1L/aa_aa_1L.dot -p aa_aa_all_helicities -i 1L_ppmm -o
  576. 248.04 s gammaloop-nextest-integration> [2026-09-23 20:51:50.429] @commands::import INFO : Loading graphs from '/build/source/examples/cli/aa_aa/1L/aa_aa_1L.dot'
  577. 248.04 s gammaloop-nextest-integration> [2026-09-23 20:51:50.437] @gammaloop_api::se... INFO : Running command generate existing -p aa_aa_all_helicities
  578. 248.04 s gammaloop-nextest-integration> The application panicked (crashed).
  579. 248.04 s gammaloop-nextest-integration> Message: label _func_power_ not found
  580. 248.04 s gammaloop-nextest-integration> Location: /nix/store/n9w914kh1cm59xx3spcs831cdyb56m32-vendor-cargo-deps/c19b7c6f923b580ac259164a89f2577984ad5ab09ee9d583b888f934adbbe8d0/symjit-2.25.6/src/symjit/assembler.rs:77
  581. 248.04 s gammaloop-nextest-integration>
  582. 248.04 s gammaloop-nextest-integration> ━━━━━━━━━━━━━━━━━━━━━━━━━━━━━━━━━━ BACKTRACE ━━━━━━━━━━━━━━━━━━━━━━━━━━━━━━━━━━━
  583. 248.04 s gammaloop-nextest-integration> 1: <color_eyre[51793ea62743adbd]::config::PanicHook>::panic_report<unknown>
  584. 248.04 s gammaloop-nextest-integration> at <unknown source file>:<unknown line>
  585. 248.04 s gammaloop-nextest-integration> 2: <color_eyre[51793ea62743adbd]::config::PanicHook>::into_panic_hook::{closure#0}<unknown>
  586. 248.04 s gammaloop-nextest-integration> at <unknown source file>:<unknown line>
  587. 248.04 s gammaloop-nextest-integration> 3: std[bcb96dfbba0ab899]::panicking::panic_with_hook<unknown>
  588. 248.04 s gammaloop-nextest-integration> at <unknown source file>:<unknown line>
  589. 248.04 s gammaloop-nextest-integration> 4: std[bcb96dfbba0ab899]::panicking::panic_handler::{closure#0}<unknown>
  590. 248.04 s gammaloop-nextest-integration> at <unknown source file>:<unknown line>
  591. 248.04 s gammaloop-nextest-integration> 5: std[bcb96dfbba0ab899]::sys::backtrace::__rust_end_short_backtrace::<std[bcb96dfbba0ab899]::panicking::panic_handler::{closure#0}, !><unknown>
  592. 248.04 s gammaloop-nextest-integration> at <unknown source file>:<unknown line>
  593. 248.04 s gammaloop-nextest-integration> 6: __rustc[6c289b9f9c454d21]::rust_begin_unwind<unknown>
  594. 248.04 s gammaloop-nextest-integration> at <unknown source file>:<unknown line>
  595. 248.04 s gammaloop-nextest-integration> 7: core[940e698046960fd5]::panicking::panic_fmt<unknown>
  596. 248.04 s gammaloop-nextest-integration> at <unknown source file>:<unknown line>
  597. 248.04 s gammaloop-nextest-integration> 8: <symjit[e408de789c333cd]::symjit::assembler::Assembler>::apply_jumps<unknown>
  598. 248.04 s gammaloop-nextest-integration> at <unknown source file>:<unknown line>
  599. 248.04 s gammaloop-nextest-integration> 9: <symjit[e408de789c333cd]::symjit::builder::Builder>::compile_from_mir::<symjit[e408de789c333cd]::symjit::amd::complex::AmdComplexGenerator><unknown>
  600. 248.04 s gammaloop-nextest-integration> at <unknown source file>:<unknown line>
  601. 248.04 s gammaloop-nextest-integration> 10: <symjit[e408de789c333cd]::symjit::runnable::Application>::compile_ty<unknown>
  602. 248.04 s gammaloop-nextest-integration> at <unknown source file>:<unknown line>
  603. 248.04 s gammaloop-nextest-integration> 11: <symjit[e408de789c333cd]::symjit::runnable::Application>::with_mir<unknown>
  604. 248.04 s gammaloop-nextest-integration> at <unknown source file>:<unknown line>
  605. 248.04 s gammaloop-nextest-integration> 12: <symjit[e408de789c333cd]::symjit::composer::DirectTranslator as symjit[e408de789c333cd]::symjit::composer::Composer>::compile<unknown>
  606. 248.04 s gammaloop-nextest-integration> at <unknown source file>:<unknown line>
  607. 248.04 s gammaloop-nextest-integration> 13: <symjit[e408de789c333cd]::symjit::compiler::Translator as symjit[e408de789c333cd]::symjit::composer::Composer>::compile<unknown>
  608. 248.04 s gammaloop-nextest-integration> at <unknown source file>:<unknown line>
  609. 248.04 s gammaloop-nextest-integration> 14: <numerica[124dab8567f4861e]::domains::float::complex::Complex<f64> as symbolica[10e259bab675d243]::evaluate::backend::JITCompiledNumber>::jit_compile<unknown>
  610. 248.04 s gammaloop-nextest-integration> at <unknown source file>:<unknown line>
  611. 248.04 s gammaloop-nextest-integration> 15: <gammalooprs[917cbd3df9e68f8f]::integrands::process::evaluators::GenericEvaluator>::activate_symjit<unknown>
  612. 248.04 s gammaloop-nextest-integration> at <unknown source file>:<unknown line>
  613. 248.04 s gammaloop-nextest-integration> 16: <gammalooprs[917cbd3df9e68f8f]::integrands::process::amplitude::AmplitudeIntegrand>::prepare_runtime_backends_after_generation_with_compile_times<unknown>
  614. 248.04 s gammaloop-nextest-integration> at <unknown source file>:<unknown line>
  615. 248.04 s gammaloop-nextest-integration> 17: <gammalooprs[917cbd3df9e68f8f]::processes::amplitude::Amplitude>::build_integrand<unknown>
  616. 248.04 s gammaloop-nextest-integration> at <unknown source file>:<unknown line>
  617. 248.04 s gammaloop-nextest-integration> 18: <gammalooprs[917cbd3df9e68f8f]::processes::process::Process>::generate_integrands<unknown>
  618. 248.04 s gammaloop-nextest-integration> at <unknown source file>:<unknown line>
  619. 248.04 s gammaloop-nextest-integration> 19: <gammaloop_api[9ebf6628f97aeb57]::state::State>::generate_integrand<unknown>
  620. 248.04 s gammaloop-nextest-integration> at <unknown source file>:<unknown line>
  621. 248.04 s gammaloop-nextest-integration> 20: <gammaloop_api[9ebf6628f97aeb57]::commands::generate::Generate>::run::<&std[bcb96dfbba0ab899]::path::PathBuf><unknown>
  622. 248.04 s gammaloop-nextest-integration> at <unknown source file>:<unknown line>
  623. 248.04 s gammaloop-nextest-integration> 21: <gammaloop_api[9ebf6628f97aeb57]::commands::Commands>::run<unknown>
  624. 248.04 s gammaloop-nextest-integration> at <unknown source file>:<unknown line>
  625. 248.04 s gammaloop-nextest-integration> 22: <gammaloop_api[9ebf6628f97aeb57]::session::CliSession>::execute_prepared<unknown>
  626. 248.04 s gammaloop-nextest-integration> at <unknown source file>:<unknown line>
  627. 248.04 s gammaloop-nextest-integration> 23: <gammaloop_api[9ebf6628f97aeb57]::session::CliSession>::execute_command<unknown>
  628. 248.04 s gammaloop-nextest-integration> at <unknown source file>:<unknown line>
  629. 248.04 s gammaloop-nextest-integration> 24: <gammaloop_integration_tests[191607b70c61cd5a]::CLIState>::run_command<unknown>
  630. 248.04 s gammaloop-nextest-integration> at <unknown source file>:<unknown line>
  631. 248.04 s gammaloop-nextest-integration> 25: test_runs[9b7e2dc2dc4f29b0]::aa_aa::generate_aa_aa_helicity_family<unknown>
  632. 248.04 s gammaloop-nextest-integration> at <unknown source file>:<unknown line>
  633. 248.04 s gammaloop-nextest-integration> 26: <test_runs[9b7e2dc2dc4f29b0]::aa_aa::important::aa_aa_local_inspect_backend_consistency::{closure#0} as core[940e698046960fd5]::ops::function::FnOnce<()>>::call_once<unknown>
  634. 248.04 s gammaloop-nextest-integration> at <unknown source file>:<unknown line>
  635. 248.04 s gammaloop-nextest-integration> 27: serial_test[cd99724524a2f1c0]::serial_code_lock::local_serial_core_with_return::<(), eyre[cb2fd339c0c40fca]::Report><unknown>
  636. 248.04 s gammaloop-nextest-integration> at <unknown source file>:<unknown line>
  637. 248.04 s gammaloop-nextest-integration> 28: <test_runs[9b7e2dc2dc4f29b0]::aa_aa::important::aa_aa_local_inspect_backend_consistency::{closure#0} as core[940e698046960fd5]::ops::function::FnOnce<()>>::call_once<unknown>
  638. 248.04 s gammaloop-nextest-integration> at <unknown source file>:<unknown line>
  639. 248.04 s gammaloop-nextest-integration> 29: test[75d6903177b1d7e9]::__rust_begin_short_backtrace::<core[940e698046960fd5]::result::Result<(), alloc[2ea6bcb46fca0c42]::string::String>, fn() -> core[940e698046960fd5]::result::Result<(), alloc[2ea6bcb46fca0c42]::string::String>><unknown>
  640. 248.04 s gammaloop-nextest-integration> at <unknown source file>:<unknown line>
  641. 248.04 s gammaloop-nextest-integration> 30: test[75d6903177b1d7e9]::run_test::{closure#0}<unknown>
  642. 248.04 s gammaloop-nextest-integration> at <unknown source file>:<unknown line>
  643. 248.04 s gammaloop-nextest-integration> 31: std[bcb96dfbba0ab899]::sys::backtrace::__rust_begin_short_backtrace::<test[75d6903177b1d7e9]::run_test::{closure#1}, ()><unknown>
  644. 248.04 s gammaloop-nextest-integration> at <unknown source file>:<unknown line>
  645. 248.04 s gammaloop-nextest-integration> 32: <std[bcb96dfbba0ab899]::thread::lifecycle::spawn_unchecked<test[75d6903177b1d7e9]::run_test::{closure#1}, ()>::{closure#1} as core[940e698046960fd5]::ops::function::FnOnce<()>>::call_once::{shim:vtable#0}<unknown>
  646. 248.04 s gammaloop-nextest-integration> at <unknown source file>:<unknown line>
  647. 248.04 s gammaloop-nextest-integration> 33: <std[bcb96dfbba0ab899]::sys::thread::unix::Thread>::new::thread_start<unknown>
  648. 248.04 s gammaloop-nextest-integration> at <unknown source file>:<unknown line>
  649. 248.04 s gammaloop-nextest-integration> 34: start_thread<unknown>
  650. 248.04 s gammaloop-nextest-integration> at <unknown source file>:<unknown line>
  651. 248.04 s gammaloop-nextest-integration> 35: __clone3<unknown>
  652. 248.04 s gammaloop-nextest-integration> at <unknown source file>:<unknown line>
  653. 248.04 s gammaloop-nextest-integration>
  654. 248.04 s gammaloop-nextest-integration> Run with COLORBT_SHOW_HIDDEN=1 environment variable to disable frame filtering.
  655. 248.04 s gammaloop-nextest-integration> Run with RUST_BACKTRACE=full to include source snippets.
  656. 248.04 s gammaloop-nextest-integration> Warning: SpanTrace capture is Unsupported.
  657. 248.04 s gammaloop-nextest-integration> Ensure that you've setup a tracing-error ErrorLayer and the semver versions are compatible
  658. 248.04 s gammaloop-nextest-integration>
  659. 248.04 s gammaloop-nextest-integration> FAIL [ 2.562s] (158/170) gammaloop-integration-tests::uv thermal_sunrise_uv
  660. 248.04 s gammaloop-nextest-integration> stdout ---
  661. 248.04 s gammaloop-nextest-integration>
  662. 248.04 s gammaloop-nextest-integration> running 1 test
  663. 248.04 s gammaloop-nextest-integration> test thermal_sunrise_uv ... FAILED
  664. 248.04 s gammaloop-nextest-integration>
  665. 248.04 s gammaloop-nextest-integration> failures:
  666. 248.04 s gammaloop-nextest-integration>
  667. 248.04 s gammaloop-nextest-integration> failures:
  668. 248.04 s gammaloop-nextest-integration> thermal_sunrise_uv
  669. 248.04 s gammaloop-nextest-integration>
  670. 248.04 s gammaloop-nextest-integration> test result: FAILED. 0 passed; 1 failed; 0 ignored; 0 measured; 31 filtered out; finished in 2.55s
  671. 248.04 s gammaloop-nextest-integration>
  672. 248.04 s gammaloop-nextest-integration> stderr ---
  673. 248.04 s gammaloop-nextest-integration> [2026-09-23 20:52:32.581] @gammaloop_api::se... INFO : Running command run generate
  674. 248.04 s gammaloop-nextest-integration> [2026-09-23 20:52:32.581] @gammaloop_api::se... INFO : Starting command block generate
  675. 248.04 s gammaloop-nextest-integration> [2026-09-23 20:52:32.581] @gammaloop_api::se... INFO : Running command import model sm-default.json
  676. 248.04 s gammaloop-nextest-integration> [2026-09-23 20:52:32.581] @import::model INFO : Loading built-in JSON model sm-default
  677. 248.04 s gammaloop-nextest-integration> [2026-09-23 20:52:32.628] @gammalooprs::model INFO : The following 15 external parameters were forced to zero by the restriction card:
  678. 248.04 s gammaloop-nextest-integration> lamWS, AWS, rhoWS, etaWS, ymc, yme, ymm, MC, Me, MM, WTau, muQ, muLe, muLmu, muLtau
  679. 248.04 s gammaloop-nextest-integration> [2026-09-23 20:52:32.628] @gammalooprs::model INFO : The following 34 vertex rules were removed by the restriction card:
  680. 248.05 s gammaloop-nextest-integration> V_82 -> (c~, d, G+) | V_83 -> (t~, d, G+) | V_84 -> (c~, s, G+) | V_85 -> (t~, s, G+) | V_86 -> (u~, b, G+) | V_87 -> (c~, b, G+) | V_90 -> (c~, d, W+) | V_91 -> (t~, d, W+) | V_92 -> (u~, s, W+) | V_94 -> (t~, s, W+) | V_95 -> (u~, b, W+) | V_96 -> (c~, b, W+) | V_101 -> (e+, e-, G0) | V_102 -> (mu+, mu-, G0) | V_104 -> (e+, e-, H) | V_105 -> (mu+, mu-, H) | V_110 -> (ve~, e-, G+) | V_111 -> (vm~, mu-, G+) | V_116 -> (b~, u, G-) | V_117 -> (d~, c, G-) | V_118 -> (s~, c, G-) | V_119 -> (b~, c, G-) | V_120 -> (d~, t, G-) | V_121 -> (s~, t, G-) | V_124 -> (s~, u, W-) | V_125 -> (b~, u, W-) | V_126 -> (d~, c, W-) | V_128 -> (b~, c, W-) | V_129 -> (d~, t, W-) | V_130 -> (s~, t, W-) | V_138 -> (c~, c, G0) | V_140 -> (c~, c, H) | V_145 -> (e+, ve, G-) | V_146 -> (mu+, vm, G-)
  681. 248.05 s gammaloop-nextest-integration> [2026-09-23 20:52:32.628] @gammalooprs::model INFO : The following 36 couplings were removed by the restriction card:
  682. 248.05 s gammaloop-nextest-integration> GC_13, GC_14, GC_16, GC_17, GC_18, GC_19, GC_20, GC_22, GC_23, GC_24, GC_25, GC_26, GC_28, GC_29, GC_42, GC_43, GC_44, GC_46, GC_47, GC_48, GC_84, GC_85, GC_86, GC_87, GC_88, GC_89, GC_90, GC_91, GC_92, GC_93, GC_101, GC_102, GC_103, GC_105, GC_106, GC_107
  683. 248.05 s gammaloop-nextest-integration> [2026-09-23 20:52:32.628] @gammaloop_api::se... INFO : Running command remove processes
  684. 248.05 s gammaloop-nextest-integration> [2026-09-23 20:52:32.628] @gammaloop_api::se... INFO : Running command generate amp {} > {} [{2}] | g u
  685. 248.05 s gammaloop-nextest-integration> --numerator-grouping group_identical_graphs_up_to_scalar_rescaling
  686. 248.05 s gammaloop-nextest-integration> --max-n-bridges 0
  687. 248.05 s gammaloop-nextest-integration> --number-of-factorized-loop-subtopologies 1 1
  688. 248.05 s gammaloop-nextest-integration> --number-of-anticommutating-loops 1 1
  689. 248.05 s gammaloop-nextest-integration> [...]
  690. 248.05 s gammaloop-nextest-integration> [2026-09-23 20:52:32.629] @feyngen::diagram_... INFO : 0s | Δ=0s | Starting Feynman graph generation with Symbolica...
  691. 248.05 s gammaloop-nextest-integration> [2026-09-23 20:52:32.630] @feyngen::diagram_... INFO : 0s | Δ=0s | Number of graphs resulting from Symbolica generation: 3
  692. 248.05 s gammaloop-nextest-integration> [2026-09-23 20:52:32.630] @feyngen::diagram_... INFO : 0s | Δ=0s | Number of graphs retained after removal of vetoed topologies: 2
  693. 248.05 s gammaloop-nextest-integration> [2026-09-23 20:52:32.630] @feyngen::diagram_... INFO : 0s | Δ=0s | Number of graphs after vertex info assignment: 2
  694. 248.05 s gammaloop-nextest-integration> [2026-09-23 20:52:32.630] @feyngen::diagram_... INFO : 0s | Δ=0s | Number of graphs after all complete graphs filters are applied: 2
  695. 248.05 s gammaloop-nextest-integration> [2026-09-23 20:52:32.630] @feyngen::diagram_... INFO : 0s | Δ=0s | Number of graphs after closed anticommutating chains analysis: 1
  696. 248.05 s gammaloop-nextest-integration> [2026-09-23 20:52:32.630] @feyngen::diagram_... INFO : 0s | Δ=0s | Number of graphs after symmetrization of external states: 1
  697. 248.05 s gammaloop-nextest-integration> [2026-09-23 20:52:32.630] @feyngen::diagram_... INFO : 0s | Δ=0s | Number of graphs after canonization of vertices, edges and flows (graph labels assigned here): 1
  698. 248.05 s gammaloop-nextest-integration> [2026-09-23 20:52:32.642] @feyngen::diagram_... INFO : 0s | Δ=0s | Number of graphs after numerator-aware grouping with strategy 'up to a scalar rescaling': 1 (1 isomorphically unique graph, 0 color zero, 0 lorentz zero, 0 grouped and 0 cancellation)
  699. 248.05 s gammaloop-nextest-integration> [2026-09-23 20:52:32.642] @feyngen::diagram_... INFO : ( Sum of the symmetry factors from each graph generated = -1/2 )
  700. 248.05 s gammaloop-nextest-integration> [2026-09-23 20:52:32.642] @commands::generate INFO : Generated amplitude 1 graphs.
  701. 248.05 s gammaloop-nextest-integration> [2026-09-23 20:52:32.642] @commands::generate INFO : Only diagram generation was requested, skipping integrand generation. You can generate integrands later using the 'generate existing <options>' command.
  702. 248.05 s gammaloop-nextest-integration> [2026-09-23 20:52:32.642] @gammaloop_api::se... INFO : Running command generate
  703. 248.05 s gammaloop-nextest-integration> The application panicked (crashed).
  704. 248.05 s gammaloop-nextest-integration> Message: label _func_power_ not found
  705. 248.05 s gammaloop-nextest-integration> Location: /nix/store/n9w914kh1cm59xx3spcs831cdyb56m32-vendor-cargo-deps/c19b7c6f923b580ac259164a89f2577984ad5ab09ee9d583b888f934adbbe8d0/symjit-2.25.6/src/symjit/assembler.rs:77
  706. 248.05 s gammaloop-nextest-integration>
  707. 248.05 s gammaloop-nextest-integration> ━━━━━━━━━━━━━━━━━━━━━━━━━━━━━━━━━━ BACKTRACE ━━━━━━━━━━━━━━━━━━━━━━━━━━━━━━━━━━━
  708. 248.05 s gammaloop-nextest-integration> 1: <color_eyre[51793ea62743adbd]::config::PanicHook>::panic_report<unknown>
  709. 248.05 s gammaloop-nextest-integration> at <unknown source file>:<unknown line>
  710. 248.05 s gammaloop-nextest-integration> 2: <color_eyre[51793ea62743adbd]::config::PanicHook>::into_panic_hook::{closure#0}<unknown>
  711. 248.05 s gammaloop-nextest-integration> at <unknown source file>:<unknown line>
  712. 248.05 s gammaloop-nextest-integration> 3: std[bcb96dfbba0ab899]::panicking::panic_with_hook<unknown>
  713. 248.05 s gammaloop-nextest-integration> at <unknown source file>:<unknown line>
  714. 248.05 s gammaloop-nextest-integration> 4: std[bcb96dfbba0ab899]::panicking::panic_handler::{closure#0}<unknown>
  715. 248.05 s gammaloop-nextest-integration> at <unknown source file>:<unknown line>
  716. 248.05 s gammaloop-nextest-integration> 5: std[bcb96dfbba0ab899]::sys::backtrace::__rust_end_short_backtrace::<std[bcb96dfbba0ab899]::panicking::panic_handler::{closure#0}, !><unknown>
  717. 248.05 s gammaloop-nextest-integration> at <unknown source file>:<unknown line>
  718. 248.05 s gammaloop-nextest-integration> 6: __rustc[6c289b9f9c454d21]::rust_begin_unwind<unknown>
  719. 248.05 s gammaloop-nextest-integration> at <unknown source file>:<unknown line>
  720. 248.05 s gammaloop-nextest-integration> 7: core[940e698046960fd5]::panicking::panic_fmt<unknown>
  721. 248.05 s gammaloop-nextest-integration> at <unknown source file>:<unknown line>
  722. 248.05 s gammaloop-nextest-integration> 8: <symjit[e408de789c333cd]::symjit::assembler::Assembler>::apply_jumps<unknown>
  723. 248.05 s gammaloop-nextest-integration> at <unknown source file>:<unknown line>
  724. 248.05 s gammaloop-nextest-integration> 9: <symjit[e408de789c333cd]::symjit::builder::Builder>::compile_from_mir::<symjit[e408de789c333cd]::symjit::amd::complex::AmdComplexGenerator><unknown>
  725. 248.05 s gammaloop-nextest-integration> at <unknown source file>:<unknown line>
  726. 248.05 s gammaloop-nextest-integration> 10: <symjit[e408de789c333cd]::symjit::runnable::Application>::compile_ty<unknown>
  727. 248.05 s gammaloop-nextest-integration> at <unknown source file>:<unknown line>
  728. 248.05 s gammaloop-nextest-integration> 11: <symjit[e408de789c333cd]::symjit::runnable::Application>::with_mir<unknown>
  729. 248.05 s gammaloop-nextest-integration> at <unknown source file>:<unknown line>
  730. 248.05 s gammaloop-nextest-integration> 12: <symjit[e408de789c333cd]::symjit::composer::DirectTranslator as symjit[e408de789c333cd]::symjit::composer::Composer>::compile<unknown>
  731. 248.05 s gammaloop-nextest-integration> at <unknown source file>:<unknown line>
  732. 248.05 s gammaloop-nextest-integration> 13: <symjit[e408de789c333cd]::symjit::compiler::Translator as symjit[e408de789c333cd]::symjit::composer::Composer>::compile<unknown>
  733. 248.05 s gammaloop-nextest-integration> at <unknown source file>:<unknown line>
  734. 248.05 s gammaloop-nextest-integration> 14: <numerica[124dab8567f4861e]::domains::float::complex::Complex<f64> as symbolica[10e259bab675d243]::evaluate::backend::JITCompiledNumber>::jit_compile<unknown>
  735. 248.05 s gammaloop-nextest-integration> at <unknown source file>:<unknown line>
  736. 248.05 s gammaloop-nextest-integration> 15: <gammalooprs[917cbd3df9e68f8f]::integrands::process::evaluators::GenericEvaluator>::activate_symjit<unknown>
  737. 248.05 s gammaloop-nextest-integration> at <unknown source file>:<unknown line>
  738. 248.05 s gammaloop-nextest-integration> 16: <gammalooprs[917cbd3df9e68f8f]::integrands::process::amplitude::AmplitudeIntegrand>::prepare_runtime_backends_after_generation_with_compile_times<unknown>
  739. 248.05 s gammaloop-nextest-integration> at <unknown source file>:<unknown line>
  740. 248.05 s gammaloop-nextest-integration> 17: <gammalooprs[917cbd3df9e68f8f]::processes::amplitude::Amplitude>::build_integrand<unknown>
  741. 248.05 s gammaloop-nextest-integration> at <unknown source file>:<unknown line>
  742. 248.05 s gammaloop-nextest-integration> 18: <gammalooprs[917cbd3df9e68f8f]::processes::process::Process>::generate_integrands<unknown>
  743. 248.05 s gammaloop-nextest-integration> at <unknown source file>:<unknown line>
  744. 248.05 s gammaloop-nextest-integration> 19: <gammalooprs[917cbd3df9e68f8f]::processes::ProcessList>::generate_integrands<unknown>
  745. 248.05 s gammaloop-nextest-integration> at <unknown source file>:<unknown line>
  746. 248.05 s gammaloop-nextest-integration> 20: <gammaloop_api[9ebf6628f97aeb57]::state::State>::generate_integrands<unknown>
  747. 248.05 s gammaloop-nextest-integration> at <unknown source file>:<unknown line>
  748. 248.05 s gammaloop-nextest-integration> 21: <gammaloop_api[9ebf6628f97aeb57]::commands::generate::Generate>::run::<&std[bcb96dfbba0ab899]::path::PathBuf><unknown>
  749. 248.05 s gammaloop-nextest-integration> at <unknown source file>:<unknown line>
  750. 248.05 s gammaloop-nextest-integration> 22: <gammaloop_api[9ebf6628f97aeb57]::commands::Commands>::run<unknown>
  751. 248.05 s gammaloop-nextest-integration> at <unknown source file>:<unknown line>
  752. 248.05 s gammaloop-nextest-integration> 23: <gammaloop_api[9ebf6628f97aeb57]::session::CliSession>::execute_prepared<unknown>
  753. 248.05 s gammaloop-nextest-integration> at <unknown source file>:<unknown line>
  754. 248.05 s gammaloop-nextest-integration> 24: <gammaloop_api[9ebf6628f97aeb57]::session::CliSession>::execute_prepared_commands<unknown>
  755. 248.05 s gammaloop-nextest-integration> at <unknown source file>:<unknown line>
  756. 248.05 s gammaloop-nextest-integration> 25: <gammaloop_api[9ebf6628f97aeb57]::session::CliSession>::execute_prepared<unknown>
  757. 248.05 s gammaloop-nextest-integration> at <unknown source file>:<unknown line>
  758. 248.05 s gammaloop-nextest-integration> 26: <gammaloop_api[9ebf6628f97aeb57]::session::CliSession>::execute_command<unknown>
  759. 248.05 s gammaloop-nextest-integration> at <unknown source file>:<unknown line>
  760. 248.05 s gammaloop-nextest-integration> 27: <gammaloop_integration_tests[191607b70c61cd5a]::CLIState>::run_command<unknown>
  761. 248.05 s gammaloop-nextest-integration> at <unknown source file>:<unknown line>
  762. 248.05 s gammaloop-nextest-integration> 28: uv[3c7454ef256d6487]::run_single_integrated_uv_case<unknown>
  763. 248.05 s gammaloop-nextest-integration> at <unknown source file>:<unknown line>
  764. 248.05 s gammaloop-nextest-integration> 29: <uv[3c7454ef256d6487]::thermal_sunrise_uv::{closure#0} as core[940e698046960fd5]::ops::function::FnOnce<()>>::call_once<unknown>
  765. 248.05 s gammaloop-nextest-integration> at <unknown source file>:<unknown line>
  766. 248.05 s gammaloop-nextest-integration> 30: test[75d6903177b1d7e9]::__rust_begin_short_backtrace::<core[940e698046960fd5]::result::Result<(), alloc[2ea6bcb46fca0c42]::string::String>, fn() -> core[940e698046960fd5]::result::Result<(), alloc[2ea6bcb46fca0c42]::string::String>><unknown>
  767. 248.05 s gammaloop-nextest-integration> at <unknown source file>:<unknown line>
  768. 248.05 s gammaloop-nextest-integration> 31: test[75d6903177b1d7e9]::run_test::{closure#0}<unknown>
  769. 248.05 s gammaloop-nextest-integration> at <unknown source file>:<unknown line>
  770. 248.05 s gammaloop-nextest-integration> 32: std[bcb96dfbba0ab899]::sys::backtrace::__rust_begin_short_backtrace::<test[75d6903177b1d7e9]::run_test::{closure#1}, ()><unknown>
  771. 248.05 s gammaloop-nextest-integration> at <unknown source file>:<unknown line>
  772. 248.05 s gammaloop-nextest-integration> 33: <std[bcb96dfbba0ab899]::thread::lifecycle::spawn_unchecked<test[75d6903177b1d7e9]::run_test::{closure#1}, ()>::{closure#1} as core[940e698046960fd5]::ops::function::FnOnce<()>>::call_once::{shim:vtable#0}<unknown>
  773. 248.05 s gammaloop-nextest-integration> at <unknown source file>:<unknown line>
  774. 248.05 s gammaloop-nextest-integration> 34: <std[bcb96dfbba0ab899]::sys::thread::unix::Thread>::new::thread_start<unknown>
  775. 248.05 s gammaloop-nextest-integration> at <unknown source file>:<unknown line>
  776. 248.05 s gammaloop-nextest-integration> 35: start_thread<unknown>
  777. 248.05 s gammaloop-nextest-integration> at <unknown source file>:<unknown line>
  778. 248.05 s gammaloop-nextest-integration> 36: __clone3<unknown>
  779. 248.05 s gammaloop-nextest-integration> at <unknown source file>:<unknown line>
  780. 248.05 s gammaloop-nextest-integration>
  781. 248.05 s gammaloop-nextest-integration> Run with COLORBT_SHOW_HIDDEN=1 environment variable to disable frame filtering.
  782. 248.05 s gammaloop-nextest-integration> Run with RUST_BACKTRACE=full to include source snippets.
  783. 248.05 s gammaloop-nextest-integration> Warning: SpanTrace capture is Unsupported.
  784. 248.05 s gammaloop-nextest-integration> Ensure that you've setup a tracing-error ErrorLayer and the semver versions are compatible
  785. 248.05 s gammaloop-nextest-integration>
  786. 248.25 s gammaloop-nextest-integration> error: test run failed
  787. 248.27 s gammaloop-nextest-integration>
  788. 248.27 s gammaloop-nextest-integration> ========== nextest test summary ==========
  789. 248.27 s gammaloop-nextest-integration> report: target/nextest/ci_gammaloop/junit.xml
  790. 248.27 s gammaloop-nextest-integration> tests: 170, failures: 2, errors: 0
  791. 248.27 s gammaloop-nextest-integration>
  792. 248.27 s gammaloop-nextest-integration> 1. gammaloop-integration-tests::test_runs::aa_aa::important::aa_aa_local_inspect_backend_consistency
  793. 248.27 s gammaloop-nextest-integration> failure: test failure with exit code 101
  794. 248.27 s gammaloop-nextest-integration> system-out
  795. 248.27 s gammaloop-nextest-integration> running 1 test
  796. 248.27 s gammaloop-nextest-integration> test aa_aa::important::aa_aa_local_inspect_backend_consistency ... FAILED
  797. 248.27 s gammaloop-nextest-integration>
  798. 248.27 s gammaloop-nextest-integration> failures:
  799. 248.27 s gammaloop-nextest-integration>
  800. 248.27 s gammaloop-nextest-integration> failures:
  801. 248.27 s gammaloop-nextest-integration> aa_aa::important::aa_aa_local_inspect_backend_consistency
  802. 248.27 s gammaloop-nextest-integration>
  803. 248.27 s gammaloop-nextest-integration> test result: FAILED. 0 passed; 1 failed; 0 ignored; 0 measured; 274 filtered out; finished in 2.88s
  804. 248.27 s gammaloop-nextest-integration> system-err
  805. 248.27 s gammaloop-nextest-integration> [2026-09-23 20:51:50.374] @gammaloop_api::se... INFO : Running command import model sm-default.json
  806. 248.27 s gammaloop-nextest-integration> [2026-09-23 20:51:50.374] @import::model INFO : Loading built-in JSON model sm-default
  807. 248.27 s gammaloop-nextest-integration> [2026-09-23 20:51:50.396] @gammalooprs::model INFO : The following 15 external parameters were forced to zero by the restriction card:
  808. 248.27 s gammaloop-nextest-integration> lamWS, AWS, rhoWS, etaWS, ymc, yme, ymm, MC, Me, MM, WTau, muQ, muLe, muLmu, muLtau
  809. 248.27 s gammaloop-nextest-integration> [2026-09-23 20:51:50.396] @gammalooprs::model INFO : The following 34 vertex rules were removed by the restriction card:
  810. 248.27 s gammaloop-nextest-integration> V_82 -> (c~, d, G+) | V_83 -> (t~, d, G+) | V_84 -> (c~, s, G+) | V_85 -> (t~, s, G+) | V_86 -> (u~, b, G+) | V_87 -> (c~, b, G+) | V_90 -> (c~, d, W+) | V_91 -> (t~, d, W+) | V_92 -> (u~, s, W+) | V_94 -> (t~, s, W+) | V_95 -> (u~, b, W+) | V_96 -> (c~, b, W+) | V_101 -> (e+, e-, G0) | V_102 -> (mu+, mu-, G0) | V_104 -> (e+, e-, H) | V_105 -> (mu+, mu-, H) | V_110 -> (ve~, e-, G+) | V_111 -> (vm~, mu-, G+) | V_116 -> (b~, u, G-) | V_117 -> (d~, c, G-) | V_118 -> (s~, c, G-) | V_119 -> (b~, c, G-) | V_120 -> (d~, t, G-) | V_121 -> (s~, t, G-) | V_124 -> (s~, u, W-) | V_125 -> (b~, u, W-) | V_126 -> (d~, c, W-) | V_128 -> (b~, c, W-) | V_129 -> (d~, t, W-) | V_130 -> (s~, t, W-) | V_138 -> (c~, c, G0) | V_140 -> (c~, c, H) | V_145 -> (e+, ve, G-) | V_146 -> (mu+, vm, G-)
  811. 248.27 s gammaloop-nextest-integration> [2026-09-23 20:51:50.396] @gammalooprs::model INFO : The following 36 couplings were removed by the restriction card:
  812. 248.27 s gammaloop-nextest-integration> GC_13, GC_14, GC_16, GC_17, GC_18, GC_19, GC_20, GC_22, GC_23, GC_24, GC_25, GC_26, GC_28, GC_29, GC_42, GC_43, GC_44, GC_46, GC_47, GC_48, GC_84, GC_85, GC_86, GC_87, GC_88, GC_89, GC_90, GC_91, GC_92, GC_93, GC_101, GC_102, GC_103, GC_105, GC_106, GC_107
  813. 248.27 s gammaloop-nextest-integration> [2026-09-23 20:51:50.396] @gammaloop_api::se... INFO : Running command run set_model_parameters
  814. 248.27 s gammaloop-nextest-integration> [2026-09-23 20:51:50.396] @gammaloop_api::se... INFO : Starting command block set_model_parameters
  815. 248.27 s gammaloop-nextest-integration> [2026-09-23 20:51:50.397] @gammaloop_api::se... INFO : Running command set model MT=173.0
  816. 248.27 s gammaloop-nextest-integration> [2026-09-23 20:51:50.401] @gammaloop_api::se... INFO : Running command set model WT=0.0
  817. 248.27 s gammaloop-nextest-integration> [2026-09-23 20:51:50.405] @gammaloop_api::se... INFO : Running command set model ymt=173.0
  818. 248.27 s gammaloop-nextest-integration> [2026-09-23 20:51:50.410] @gammaloop_api::se... INFO : Running command set model aS=0.118
  819. 248.27 s gammaloop-nextest-integration> [2026-09-23 20:51:50.414] @gammaloop_api::se... INFO : Running command set model aEWM1=137.036
  820. 248.27 s gammaloop-nextest-integration> [2026-09-23 20:51:50.419] @gammaloop_api::se... INFO : Running command set model Gf=1.166390e-05
  821. 248.27 s gammaloop-nextest-integration> [2026-09-23 20:51:50.423] @gammaloop_api::se... INFO : Running command set model MZ=91.188
  822. 248.27 s gammaloop-nextest-integration> [2026-09-23 20:51:50.428] @gammaloop_api::se... INFO : Running command set global string '
  823. 248.27 s gammaloop-nextest-integration> [global.generation.compile]
  824. 248.27 s gammaloop-nextest-integration> compilation_mode = "symjit"
  825. 248.27 s gammaloop-nextest-integration> optimization_level = "O0"
  826. 248.27 s gammaloop-nextest-integration> fast_math = false
  827. 248.27 s gammaloop-nextest-integration> [...]
  828. 248.27 s gammaloop-nextest-integration> [2026-09-23 20:51:50.428] @gammaloop_api::se... INFO : Running command import graphs ./examples/cli/aa_aa/1L/aa_aa_1L.dot -p aa_aa_all_helicities -i 1L_ppmm -o
  829. 248.27 s gammaloop-nextest-integration> [2026-09-23 20:51:50.429] @commands::import INFO : Loading graphs from '/build/source/examples/cli/aa_aa/1L/aa_aa_1L.dot'
  830. 248.27 s gammaloop-nextest-integration> [2026-09-23 20:51:50.437] @gammaloop_api::se... INFO : Running command generate existing -p aa_aa_all_helicities
  831. 248.27 s gammaloop-nextest-integration> The application panicked (crashed).
  832. 248.27 s gammaloop-nextest-integration> Message: label _func_power_ not found
  833. 248.27 s gammaloop-nextest-integration> Location: /nix/store/n9w914kh1cm59xx3spcs831cdyb56m32-vendor-cargo-deps/c19b7c6f923b580ac259164a89f2577984ad5ab09ee9d583b888f934adbbe8d0/symjit-2.25.6/src/symjit/assembler.rs:77
  834. 248.27 s gammaloop-nextest-integration>
  835. 248.27 s gammaloop-nextest-integration> ━━━━━━━━━━━━━━━━━━━━━━━━━━━━━━━━━━ BACKTRACE ━━━━━━━━━━━━━━━━━━━━━━━━━━━━━━━━━━━
  836. 248.27 s gammaloop-nextest-integration> 1: <color_eyre[51793ea62743adbd]::config::PanicHook>::panic_report<unknown>
  837. 248.27 s gammaloop-nextest-integration> at <unknown source file>:<unknown line>
  838. 248.27 s gammaloop-nextest-integration> 2: <color_eyre[51793ea62743adbd]::config::PanicHook>::into_panic_hook::{closure#0}<unknown>
  839. 248.27 s gammaloop-nextest-integration> at <unknown source file>:<unknown line>
  840. 248.27 s gammaloop-nextest-integration> 3: std[bcb96dfbba0ab899]::panicking::panic_with_hook<unknown>
  841. 248.27 s gammaloop-nextest-integration> at <unknown source file>:<unknown line>
  842. 248.27 s gammaloop-nextest-integration> 4: std[bcb96dfbba0ab899]::panicking::panic_handler::{closure#0}<unknown>
  843. 248.27 s gammaloop-nextest-integration> at <unknown source file>:<unknown line>
  844. 248.27 s gammaloop-nextest-integration> 5: std[bcb96dfbba0ab899]::sys::backtrace::__rust_end_short_backtrace::<std[bcb96dfbba0ab899]::panicking::panic_handler::{closure#0}, !><unknown>
  845. 248.27 s gammaloop-nextest-integration> at <unknown source file>:<unknown line>
  846. 248.27 s gammaloop-nextest-integration> 6: __rustc[6c289b9f9c454d21]::rust_begin_unwind<unknown>
  847. 248.27 s gammaloop-nextest-integration> at <unknown source file>:<unknown line>
  848. 248.27 s gammaloop-nextest-integration> 7: core[940e698046960fd5]::panicking::panic_fmt<unknown>
  849. 248.27 s gammaloop-nextest-integration> at <unknown source file>:<unknown line>
  850. 248.27 s gammaloop-nextest-integration> 8: <symjit[e408de789c333cd]::symjit::assembler::Assembler>::apply_jumps<unknown>
  851. 248.27 s gammaloop-nextest-integration> at <unknown source file>:<unknown line>
  852. 248.27 s gammaloop-nextest-integration> 9: <symjit[e408de789c333cd]::symjit::builder::Builder>::compile_from_mir::<symjit[e408de789c333cd]::symjit::amd::complex::AmdComplexGenerator><unknown>
  853. 248.27 s gammaloop-nextest-integration> at <unknown source file>:<unknown line>
  854. 248.27 s gammaloop-nextest-integration> 10: <symjit[e408de789c333cd]::symjit::runnable::Application>::compile_ty<unknown>
  855. 248.27 s gammaloop-nextest-integration> at <unknown source file>:<unknown line>
  856. 248.27 s gammaloop-nextest-integration> 11: <symjit[e408de789c333cd]::symjit::runnable::Application>::with_mir<unknown>
  857. 248.27 s gammaloop-nextest-integration> at <unknown source file>:<unknown line>
  858. 248.27 s gammaloop-nextest-integration> 12: <symjit[e408de789c333cd]::symjit::composer::DirectTranslator as symjit[e408de789c333cd]::symjit::composer::Composer>::compile<unknown>
  859. 248.27 s gammaloop-nextest-integration> at <unknown source file>:<unknown line>
  860. 248.27 s gammaloop-nextest-integration> 13: <symjit[e408de789c333cd]::symjit::compiler::Translator as symjit[e408de789c333cd]::symjit::composer::Composer>::compile<unknown>
  861. 248.27 s gammaloop-nextest-integration> at <unknown source file>:<unknown line>
  862. 248.27 s gammaloop-nextest-integration> 14: <numerica[124dab8567f4861e]::domains::float::complex::Complex<f64> as symbolica[10e259bab675d243]::evaluate::backend::JITCompiledNumber>::jit_compile<unknown>
  863. 248.27 s gammaloop-nextest-integration> at <unknown source file>:<unknown line>
  864. 248.27 s gammaloop-nextest-integration> 15: <gammalooprs[917cbd3df9e68f8f]::integrands::process::evaluators::GenericEvaluator>::activate_symjit<unknown>
  865. 248.27 s gammaloop-nextest-integration> at <unknown source file>:<unknown line>
  866. 248.27 s gammaloop-nextest-integration> 16: <gammalooprs[917cbd3df9e68f8f]::integrands::process::amplitude::AmplitudeIntegrand>::prepare_runtime_backends_after_generation_with_compile_times<unknown>
  867. 248.27 s gammaloop-nextest-integration> at <unknown source file>:<unknown line>
  868. 248.27 s gammaloop-nextest-integration> 17: <gammalooprs[917cbd3df9e68f8f]::processes::amplitude::Amplitude>::build_integrand<unknown>
  869. 248.27 s gammaloop-nextest-integration> at <unknown source file>:<unknown line>
  870. 248.27 s gammaloop-nextest-integration> 18: <gammalooprs[917cbd3df9e68f8f]::processes::process::Process>::generate_integrands<unknown>
  871. 248.27 s gammaloop-nextest-integration> at <unknown source file>:<unknown line>
  872. 248.27 s gammaloop-nextest-integration> 19: <gammaloop_api[9ebf6628f97aeb57]::state::State>::generate_integrand<unknown>
  873. 248.27 s gammaloop-nextest-integration> at <unknown source file>:<unknown line>
  874. 248.27 s gammaloop-nextest-integration> 20: <gammaloop_api[9ebf6628f97aeb57]::commands::generate::Generate>::run::<&std[bcb96dfbba0ab899]::path::PathBuf><unknown>
  875. 248.27 s gammaloop-nextest-integration> at <unknown source file>:<unknown line>
  876. 248.27 s gammaloop-nextest-integration> 21: <gammaloop_api[9ebf6628f97aeb57]::commands::Commands>::run<unknown>
  877. 248.27 s gammaloop-nextest-integration> at <unknown source file>:<unknown line>
  878. 248.27 s gammaloop-nextest-integration> 22: <gammaloop_api[9ebf6628f97aeb57]::session::CliSession>::execute_prepared<unknown>
  879. 248.27 s gammaloop-nextest-integration> at <unknown source file>:<unknown line>
  880. 248.27 s gammaloop-nextest-integration> 23: <gammaloop_api[9ebf6628f97aeb57]::session::CliSession>::execute_command<unknown>
  881. 248.27 s gammaloop-nextest-integration> at <unknown source file>:<unknown line>
  882. 248.27 s gammaloop-nextest-integration> 24: <gammaloop_integration_tests[191607b70c61cd5a]::CLIState>::run_command<unknown>
  883. 248.27 s gammaloop-nextest-integration> at <unknown source file>:<unknown line>
  884. 248.27 s gammaloop-nextest-integration> 25: test_runs[9b7e2dc2dc4f29b0]::aa_aa::generate_aa_aa_helicity_family<unknown>
  885. 248.27 s gammaloop-nextest-integration> at <unknown source file>:<unknown line>
  886. 248.27 s gammaloop-nextest-integration> 26: <test_runs[9b7e2dc2dc4f29b0]::aa_aa::important::aa_aa_local_inspect_backend_consistency::{closure#0} as core[940e698046960fd5]::ops::function::FnOnce<()>>::call_once<unknown>
  887. 248.27 s gammaloop-nextest-integration> at <unknown source file>:<unknown line>
  888. 248.27 s gammaloop-nextest-integration> 27: serial_test[cd99724524a2f1c0]::serial_code_lock::local_serial_core_with_return::<(), eyre[cb2fd339c0c40fca]::Report><unknown>
  889. 248.27 s gammaloop-nextest-integration> at <unknown source file>:<unknown line>
  890. 248.27 s gammaloop-nextest-integration> 28: <test_runs[9b7e2dc2dc4f29b0]::aa_aa::important::aa_aa_local_inspect_backend_consistency::{closure#0} as core[940e698046960fd5]::ops::function::FnOnce<()>>::call_once<unknown>
  891. 248.27 s gammaloop-nextest-integration> at <unknown source file>:<unknown line>
  892. 248.27 s gammaloop-nextest-integration> 29: test[75d6903177b1d7e9]::__rust_begin_short_backtrace::<core[940e698046960fd5]::result::Result<(), alloc[2ea6bcb46fca0c42]::string::String>, fn() -> core[940e698046960fd5]::result::Result<(), alloc[2ea6bcb46fca0c42]::string::String>><unknown>
  893. 248.27 s gammaloop-nextest-integration> at <unknown source file>:<unknown line>
  894. 248.27 s gammaloop-nextest-integration> 30: test[75d6903177b1d7e9]::run_test::{closure#0}<unknown>
  895. 248.27 s gammaloop-nextest-integration> at <unknown source file>:<unknown line>
  896. 248.27 s gammaloop-nextest-integration> 31: std[bcb96dfbba0ab899]::sys::backtrace::__rust_begin_short_backtrace::<test[75d6903177b1d7e9]::run_test::{closure#1}, ()><unknown>
  897. 248.27 s gammaloop-nextest-integration> at <unknown source file>:<unknown line>
  898. 248.27 s gammaloop-nextest-integration> 32: <std[bcb96dfbba0ab899]::thread::lifecycle::spawn_unchecked<test[75d6903177b1d7e9]::run_test::{closure#1}, ()>::{closure#1} as core[940e698046960fd5]::ops::function::FnOnce<()>>::call_once::{shim:vtable#0}<unknown>
  899. 248.27 s gammaloop-nextest-integration> at <unknown source file>:<unknown line>
  900. 248.27 s gammaloop-nextest-integration> 33: <std[bcb96dfbba0ab899]::sys::thread::unix::Thread>::new::thread_start<unknown>
  901. 248.27 s gammaloop-nextest-integration> at <unknown source file>:<unknown line>
  902. 248.27 s gammaloop-nextest-integration> 34: start_thread<unknown>
  903. 248.27 s gammaloop-nextest-integration> at <unknown source file>:<unknown line>
  904. 248.27 s gammaloop-nextest-integration> 35: __clone3<unknown>
  905. 248.27 s gammaloop-nextest-integration> at <unknown source file>:<unknown line>
  906. 248.27 s gammaloop-nextest-integration>
  907. 248.27 s gammaloop-nextest-integration> Run with COLORBT_SHOW_HIDDEN=1 environment variable to disable frame filtering.
  908. 248.27 s gammaloop-nextest-integration> Run with RUST_BACKTRACE=full to include source snippets.
  909. 248.27 s gammaloop-nextest-integration> Warning: SpanTrace capture is Unsupported.
  910. 248.27 s gammaloop-nextest-integration> Ensure that you've setup a tracing-error ErrorLayer and the semver versions are compatible
  911. 248.27 s gammaloop-nextest-integration>
  912. 248.27 s gammaloop-nextest-integration> 2. gammaloop-integration-tests::uv::thermal_sunrise_uv
  913. 248.27 s gammaloop-nextest-integration> failure: test failure with exit code 101
  914. 248.27 s gammaloop-nextest-integration> system-out
  915. 248.27 s gammaloop-nextest-integration> running 1 test
  916. 248.27 s gammaloop-nextest-integration> test thermal_sunrise_uv ... FAILED
  917. 248.27 s gammaloop-nextest-integration>
  918. 248.27 s gammaloop-nextest-integration> failures:
  919. 248.27 s gammaloop-nextest-integration>
  920. 248.27 s gammaloop-nextest-integration> failures:
  921. 248.27 s gammaloop-nextest-integration> thermal_sunrise_uv
  922. 248.27 s gammaloop-nextest-integration>
  923. 248.27 s gammaloop-nextest-integration> test result: FAILED. 0 passed; 1 failed; 0 ignored; 0 measured; 31 filtered out; finished in 2.55s
  924. 248.27 s gammaloop-nextest-integration> system-err
  925. 248.27 s gammaloop-nextest-integration> [2026-09-23 20:52:32.581] @gammaloop_api::se... INFO : Running command run generate
  926. 248.27 s gammaloop-nextest-integration> [2026-09-23 20:52:32.581] @gammaloop_api::se... INFO : Starting command block generate
  927. 248.27 s gammaloop-nextest-integration> [2026-09-23 20:52:32.581] @gammaloop_api::se... INFO : Running command import model sm-default.json
  928. 248.27 s gammaloop-nextest-integration> [2026-09-23 20:52:32.581] @import::model INFO : Loading built-in JSON model sm-default
  929. 248.27 s gammaloop-nextest-integration> [2026-09-23 20:52:32.628] @gammalooprs::model INFO : The following 15 external parameters were forced to zero by the restriction card:
  930. 248.27 s gammaloop-nextest-integration> lamWS, AWS, rhoWS, etaWS, ymc, yme, ymm, MC, Me, MM, WTau, muQ, muLe, muLmu, muLtau
  931. 248.27 s gammaloop-nextest-integration> [2026-09-23 20:52:32.628] @gammalooprs::model INFO : The following 34 vertex rules were removed by the restriction card:
  932. 248.27 s gammaloop-nextest-integration> V_82 -> (c~, d, G+) | V_83 -> (t~, d, G+) | V_84 -> (c~, s, G+) | V_85 -> (t~, s, G+) | V_86 -> (u~, b, G+) | V_87 -> (c~, b, G+) | V_90 -> (c~, d, W+) | V_91 -> (t~, d, W+) | V_92 -> (u~, s, W+) | V_94 -> (t~, s, W+) | V_95 -> (u~, b, W+) | V_96 -> (c~, b, W+) | V_101 -> (e+, e-, G0) | V_102 -> (mu+, mu-, G0) | V_104 -> (e+, e-, H) | V_105 -> (mu+, mu-, H) | V_110 -> (ve~, e-, G+) | V_111 -> (vm~, mu-, G+) | V_116 -> (b~, u, G-) | V_117 -> (d~, c, G-) | V_118 -> (s~, c, G-) | V_119 -> (b~, c, G-) | V_120 -> (d~, t, G-) | V_121 -> (s~, t, G-) | V_124 -> (s~, u, W-) | V_125 -> (b~, u, W-) | V_126 -> (d~, c, W-) | V_128 -> (b~, c, W-) | V_129 -> (d~, t, W-) | V_130 -> (s~, t, W-) | V_138 -> (c~, c, G0) | V_140 -> (c~, c, H) | V_145 -> (e+, ve, G-) | V_146 -> (mu+, vm, G-)
  933. 248.27 s gammaloop-nextest-integration> [2026-09-23 20:52:32.628] @gammalooprs::model INFO : The following 36 couplings were removed by the restriction card:
  934. 248.27 s gammaloop-nextest-integration> GC_13, GC_14, GC_16, GC_17, GC_18, GC_19, GC_20, GC_22, GC_23, GC_24, GC_25, GC_26, GC_28, GC_29, GC_42, GC_43, GC_44, GC_46, GC_47, GC_48, GC_84, GC_85, GC_86, GC_87, GC_88, GC_89, GC_90, GC_91, GC_92, GC_93, GC_101, GC_102, GC_103, GC_105, GC_106, GC_107
  935. 248.27 s gammaloop-nextest-integration> [2026-09-23 20:52:32.628] @gammaloop_api::se... INFO : Running command remove processes
  936. 248.27 s gammaloop-nextest-integration> [2026-09-23 20:52:32.628] @gammaloop_api::se... INFO : Running command generate amp {} > {} [{2}] | g u
  937. 248.27 s gammaloop-nextest-integration> --numerator-grouping group_identical_graphs_up_to_scalar_rescaling
  938. 248.27 s gammaloop-nextest-integration> --max-n-bridges 0
  939. 248.27 s gammaloop-nextest-integration> --number-of-factorized-loop-subtopologies 1 1
  940. 248.27 s gammaloop-nextest-integration> --number-of-anticommutating-loops 1 1
  941. 248.27 s gammaloop-nextest-integration> [...]
  942. 248.27 s gammaloop-nextest-integration> [2026-09-23 20:52:32.629] @feyngen::diagram_... INFO : 0s | Δ=0s | Starting Feynman graph generation with Symbolica...
  943. 248.27 s gammaloop-nextest-integration> [2026-09-23 20:52:32.630] @feyngen::diagram_... INFO : 0s | Δ=0s | Number of graphs resulting from Symbolica generation: 3
  944. 248.27 s gammaloop-nextest-integration> [2026-09-23 20:52:32.630] @feyngen::diagram_... INFO : 0s | Δ=0s | Number of graphs retained after removal of vetoed topologies: 2
  945. 248.27 s gammaloop-nextest-integration> [2026-09-23 20:52:32.630] @feyngen::diagram_... INFO : 0s | Δ=0s | Number of graphs after vertex info assignment: 2
  946. 248.27 s gammaloop-nextest-integration> [2026-09-23 20:52:32.630] @feyngen::diagram_... INFO : 0s | Δ=0s | Number of graphs after all complete graphs filters are applied: 2
  947. 248.27 s gammaloop-nextest-integration> [2026-09-23 20:52:32.630] @feyngen::diagram_... INFO : 0s | Δ=0s | Number of graphs after closed anticommutating chains analysis: 1
  948. 248.27 s gammaloop-nextest-integration> [2026-09-23 20:52:32.630] @feyngen::diagram_... INFO : 0s | Δ=0s | Number of graphs after symmetrization of external states: 1
  949. 248.27 s gammaloop-nextest-integration> [2026-09-23 20:52:32.630] @feyngen::diagram_... INFO : 0s | Δ=0s | Number of graphs after canonization of vertices, edges and flows (graph labels assigned here): 1
  950. 248.27 s gammaloop-nextest-integration> [2026-09-23 20:52:32.642] @feyngen::diagram_... INFO : 0s | Δ=0s | Number of graphs after numerator-aware grouping with strategy 'up to a scalar rescaling': 1 (1 isomorphically unique graph, 0 color zero, 0 lorentz zero, 0 grouped and 0 cancellation)
  951. 248.27 s gammaloop-nextest-integration> [2026-09-23 20:52:32.642] @feyngen::diagram_... INFO : ( Sum of the symmetry factors from each graph generated = -1/2 )
  952. 248.27 s gammaloop-nextest-integration> [2026-09-23 20:52:32.642] @commands::generate INFO : Generated amplitude 1 graphs.
  953. 248.27 s gammaloop-nextest-integration> [2026-09-23 20:52:32.642] @commands::generate INFO : Only diagram generation was requested, skipping integrand generation. You can generate integrands later using the 'generate existing <options>' command.
  954. 248.27 s gammaloop-nextest-integration> [2026-09-23 20:52:32.642] @gammaloop_api::se... INFO : Running command generate
  955. 248.27 s gammaloop-nextest-integration> The application panicked (crashed).
  956. 248.27 s gammaloop-nextest-integration> Message: label _func_power_ not found
  957. 248.27 s gammaloop-nextest-integration> Location: /nix/store/n9w914kh1cm59xx3spcs831cdyb56m32-vendor-cargo-deps/c19b7c6f923b580ac259164a89f2577984ad5ab09ee9d583b888f934adbbe8d0/symjit-2.25.6/src/symjit/assembler.rs:77
  958. 248.27 s gammaloop-nextest-integration>
  959. 248.27 s gammaloop-nextest-integration> ━━━━━━━━━━━━━━━━━━━━━━━━━━━━━━━━━━ BACKTRACE ━━━━━━━━━━━━━━━━━━━━━━━━━━━━━━━━━━━
  960. 248.27 s gammaloop-nextest-integration> 1: <color_eyre[51793ea62743adbd]::config::PanicHook>::panic_report<unknown>
  961. 248.27 s gammaloop-nextest-integration> at <unknown source file>:<unknown line>
  962. 248.27 s gammaloop-nextest-integration> 2: <color_eyre[51793ea62743adbd]::config::PanicHook>::into_panic_hook::{closure#0}<unknown>
  963. 248.27 s gammaloop-nextest-integration> at <unknown source file>:<unknown line>
  964. 248.27 s gammaloop-nextest-integration> 3: std[bcb96dfbba0ab899]::panicking::panic_with_hook<unknown>
  965. 248.27 s gammaloop-nextest-integration> at <unknown source file>:<unknown line>
  966. 248.27 s gammaloop-nextest-integration> 4: std[bcb96dfbba0ab899]::panicking::panic_handler::{closure#0}<unknown>
  967. 248.27 s gammaloop-nextest-integration> at <unknown source file>:<unknown line>
  968. 248.27 s gammaloop-nextest-integration> 5: std[bcb96dfbba0ab899]::sys::backtrace::__rust_end_short_backtrace::<std[bcb96dfbba0ab899]::panicking::panic_handler::{closure#0}, !><unknown>
  969. 248.27 s gammaloop-nextest-integration> at <unknown source file>:<unknown line>
  970. 248.27 s gammaloop-nextest-integration> 6: __rustc[6c289b9f9c454d21]::rust_begin_unwind<unknown>
  971. 248.27 s gammaloop-nextest-integration> at <unknown source file>:<unknown line>
  972. 248.27 s gammaloop-nextest-integration> 7: core[940e698046960fd5]::panicking::panic_fmt<unknown>
  973. 248.27 s gammaloop-nextest-integration> at <unknown source file>:<unknown line>
  974. 248.27 s gammaloop-nextest-integration> 8: <symjit[e408de789c333cd]::symjit::assembler::Assembler>::apply_jumps<unknown>
  975. 248.27 s gammaloop-nextest-integration> at <unknown source file>:<unknown line>
  976. 248.27 s gammaloop-nextest-integration> 9: <symjit[e408de789c333cd]::symjit::builder::Builder>::compile_from_mir::<symjit[e408de789c333cd]::symjit::amd::complex::AmdComplexGenerator><unknown>
  977. 248.27 s gammaloop-nextest-integration> at <unknown source file>:<unknown line>
  978. 248.27 s gammaloop-nextest-integration> 10: <symjit[e408de789c333cd]::symjit::runnable::Application>::compile_ty<unknown>
  979. 248.27 s gammaloop-nextest-integration> at <unknown source file>:<unknown line>
  980. 248.27 s gammaloop-nextest-integration> 11: <symjit[e408de789c333cd]::symjit::runnable::Application>::with_mir<unknown>
  981. 248.27 s gammaloop-nextest-integration> at <unknown source file>:<unknown line>
  982. 248.27 s gammaloop-nextest-integration> 12: <symjit[e408de789c333cd]::symjit::composer::DirectTranslator as symjit[e408de789c333cd]::symjit::composer::Composer>::compile<unknown>
  983. 248.27 s gammaloop-nextest-integration> at <unknown source file>:<unknown line>
  984. 248.27 s gammaloop-nextest-integration> 13: <symjit[e408de789c333cd]::symjit::compiler::Translator as symjit[e408de789c333cd]::symjit::composer::Composer>::compile<unknown>
  985. 248.27 s gammaloop-nextest-integration> at <unknown source file>:<unknown line>
  986. 248.27 s gammaloop-nextest-integration> 14: <numerica[124dab8567f4861e]::domains::float::complex::Complex<f64> as symbolica[10e259bab675d243]::evaluate::backend::JITCompiledNumber>::jit_compile<unknown>
  987. 248.27 s gammaloop-nextest-integration> at <unknown source file>:<unknown line>
  988. 248.27 s gammaloop-nextest-integration> 15: <gammalooprs[917cbd3df9e68f8f]::integrands::process::evaluators::GenericEvaluator>::activate_symjit<unknown>
  989. 248.27 s gammaloop-nextest-integration> at <unknown source file>:<unknown line>
  990. 248.27 s gammaloop-nextest-integration> 16: <gammalooprs[917cbd3df9e68f8f]::integrands::process::amplitude::AmplitudeIntegrand>::prepare_runtime_backends_after_generation_with_compile_times<unknown>
  991. 248.27 s gammaloop-nextest-integration> at <unknown source file>:<unknown line>
  992. 248.27 s gammaloop-nextest-integration> 17: <gammalooprs[917cbd3df9e68f8f]::processes::amplitude::Amplitude>::build_integrand<unknown>
  993. 248.27 s gammaloop-nextest-integration> at <unknown source file>:<unknown line>
  994. 248.27 s gammaloop-nextest-integration> 18: <gammalooprs[917cbd3df9e68f8f]::processes::process::Process>::generate_integrands<unknown>
  995. 248.27 s gammaloop-nextest-integration> at <unknown source file>:<unknown line>
  996. 248.27 s gammaloop-nextest-integration> 19: <gammalooprs[917cbd3df9e68f8f]::processes::ProcessList>::generate_integrands<unknown>
  997. 248.27 s gammaloop-nextest-integration> at <unknown source file>:<unknown line>
  998. 248.27 s gammaloop-nextest-integration> 20: <gammaloop_api[9ebf6628f97aeb57]::state::State>::generate_integrands<unknown>
  999. 248.27 s gammaloop-nextest-integration> at <unknown source file>:<unknown line>
  1000. 248.27 s gammaloop-nextest-integration> 21: <gammaloop_api[9ebf6628f97aeb57]::commands::generate::Generate>::run::<&std[bcb96dfbba0ab899]::path::PathBuf><unknown>
  1001. 248.27 s gammaloop-nextest-integration> at <unknown source file>:<unknown line>
  1002. 248.27 s gammaloop-nextest-integration> 22: <gammaloop_api[9ebf6628f97aeb57]::commands::Commands>::run<unknown>
  1003. 248.27 s gammaloop-nextest-integration> at <unknown source file>:<unknown line>
  1004. 248.27 s gammaloop-nextest-integration> 23: <gammaloop_api[9ebf6628f97aeb57]::session::CliSession>::execute_prepared<unknown>
  1005. 248.27 s gammaloop-nextest-integration> at <unknown source file>:<unknown line>
  1006. 248.27 s gammaloop-nextest-integration> 24: <gammaloop_api[9ebf6628f97aeb57]::session::CliSession>::execute_prepared_commands<unknown>
  1007. 248.27 s gammaloop-nextest-integration> at <unknown source file>:<unknown line>
  1008. 248.27 s gammaloop-nextest-integration> 25: <gammaloop_api[9ebf6628f97aeb57]::session::CliSession>::execute_prepared<unknown>
  1009. 248.27 s gammaloop-nextest-integration> at <unknown source file>:<unknown line>
  1010. 248.27 s gammaloop-nextest-integration> 26: <gammaloop_api[9ebf6628f97aeb57]::session::CliSession>::execute_command<unknown>
  1011. 248.27 s gammaloop-nextest-integration> at <unknown source file>:<unknown line>
  1012. 248.27 s gammaloop-nextest-integration> 27: <gammaloop_integration_tests[191607b70c61cd5a]::CLIState>::run_command<unknown>
  1013. 248.27 s gammaloop-nextest-integration> at <unknown source file>:<unknown line>
  1014. 248.27 s gammaloop-nextest-integration> 28: uv[3c7454ef256d6487]::run_single_integrated_uv_case<unknown>
  1015. 248.27 s gammaloop-nextest-integration> at <unknown source file>:<unknown line>
  1016. 248.27 s gammaloop-nextest-integration> 29: <uv[3c7454ef256d6487]::thermal_sunrise_uv::{closure#0} as core[940e698046960fd5]::ops::function::FnOnce<()>>::call_once<unknown>
  1017. 248.27 s gammaloop-nextest-integration> at <unknown source file>:<unknown line>
  1018. 248.27 s gammaloop-nextest-integration> 30: test[75d6903177b1d7e9]::__rust_begin_short_backtrace::<core[940e698046960fd5]::result::Result<(), alloc[2ea6bcb46fca0c42]::string::String>, fn() -> core[940e698046960fd5]::result::Result<(), alloc[2ea6bcb46fca0c42]::string::String>><unknown>
  1019. 248.27 s gammaloop-nextest-integration> at <unknown source file>:<unknown line>
  1020. 248.27 s gammaloop-nextest-integration> 31: test[75d6903177b1d7e9]::run_test::{closure#0}<unknown>
  1021. 248.27 s gammaloop-nextest-integration> at <unknown source file>:<unknown line>
  1022. 248.27 s gammaloop-nextest-integration> 32: std[bcb96dfbba0ab899]::sys::backtrace::__rust_begin_short_backtrace::<test[75d6903177b1d7e9]::run_test::{closure#1}, ()><unknown>
  1023. 248.27 s gammaloop-nextest-integration> at <unknown source file>:<unknown line>
  1024. 248.27 s gammaloop-nextest-integration> 33: <std[bcb96dfbba0ab899]::thread::lifecycle::spawn_unchecked<test[75d6903177b1d7e9]::run_test::{closure#1}, ()>::{closure#1} as core[940e698046960fd5]::ops::function::FnOnce<()>>::call_once::{shim:vtable#0}<unknown>
  1025. 248.27 s gammaloop-nextest-integration> at <unknown source file>:<unknown line>
  1026. 248.27 s gammaloop-nextest-integration> 34: <std[bcb96dfbba0ab899]::sys::thread::unix::Thread>::new::thread_start<unknown>
  1027. 248.27 s gammaloop-nextest-integration> at <unknown source file>:<unknown line>
  1028. 248.27 s gammaloop-nextest-integration> 35: start_thread<unknown>
  1029. 248.27 s gammaloop-nextest-integration> at <unknown source file>:<unknown line>
  1030. 248.27 s gammaloop-nextest-integration> 36: __clone3<unknown>
  1031. 248.27 s gammaloop-nextest-integration> at <unknown source file>:<unknown line>
  1032. 248.27 s gammaloop-nextest-integration>
  1033. 248.28 s gammaloop-nextest-integration> Run with COLORBT_SHOW_HIDDEN=1 environment variable to disable frame filtering.
  1034. 248.28 s gammaloop-nextest-integration> Run with RUST_BACKTRACE=full to include source snippets.
  1035. 248.28 s gammaloop-nextest-integration> Warning: SpanTrace capture is Unsupported.
  1036. 248.28 s gammaloop-nextest-integration> Ensure that you've setup a tracing-error ErrorLayer and the semver versions are compatible
  1037. 248.28 s gammaloop-nextest-integration> =========================================
  1038. 248.36 s [5 built (1 failed), 63 error: Cannot build '/nix/store/3f1dcfqxy8q0az6011047m7cljdkdh7f-gammaloop-nextest-integration.drv'.
  1039. 248.36 s Reason: builder failed with exit code 100.
  1040. 248.36 s Output paths:
  1041. 248.36 s /nix/store/5lq23p49k83mdbx3l9l9r84yi8448q7g-gammaloop-nextest-integration
  1042. 248.36 s Last 755 log lines:
  1043. 248.36 s > Extracting 13 binaries, 1 build script output directory, and 3 linked paths to /build/nextest-archive-yPkpRm
  1044. 248.36 s > Extracted 30 files to /build/nextest-archive-yPkpRm in 2.23s
  1045. 248.36 s > ------------
  1046. 248.36 s > Nextest run ID 36ad2938-36c6-477f-a109-8d8fb8db2f90 with nextest profile: ci_gammaloop
  1047. 248.36 s > Starting 170 tests across 13 binaries (209 tests skipped, including 208 tests via profile.ci_gammaloop.default-filter)
  1048. 248.36 s > FAIL [ 2.891s] ( 55/170) gammaloop-integration-tests::test_runs aa_aa::important::aa_aa_local_inspect_backend_consistency
  1049. 248.36 s > stdout ---
  1050. 248.36 s >
  1051. 248.36 s > running 1 test
  1052. 248.36 s > test aa_aa::important::aa_aa_local_inspect_backend_consistency ... FAILED
  1053. 248.36 s >
  1054. 248.36 s > failures:
  1055. 248.36 s >
  1056. 248.36 s > failures:
  1057. 248.36 s > aa_aa::important::aa_aa_local_inspect_backend_consistency
  1058. 248.36 s >
  1059. 248.36 s > test result: FAILED. 0 passed; 1 failed; 0 ignored; 0 measured; 274 filtered out; finished in 2.88s
  1060. 248.36 s >
  1061. 248.36 s > stderr ---
  1062. 248.36 s > [2026-09-23 20:51:50.374] @gammaloop_api::se... INFO : Running command import model sm-default.json
  1063. 248.36 s > [2026-09-23 20:51:50.374] @import::model INFO : Loading built-in JSON model sm-default
  1064. 248.36 s > [2026-09-23 20:51:50.396] @gammalooprs::model INFO : The following 15 external parameters were forced to zero by the restriction card:
  1065. 248.36 s > lamWS, AWS, rhoWS, etaWS, ymc, yme, ymm, MC, Me, MM, WTau, muQ, muLe, muLmu, muLtau
  1066. 248.36 s > [2026-09-23 20:51:50.396] @gammalooprs::model INFO : The following 34 vertex rules were removed by the restriction card:
  1067. 248.36 s > V_82 -> (c~, d, G+) | V_83 -> (t~, d, G+) | V_84 -> (c~, s, G+) | V_85 -> (t~, s, G+) | V_86 -> (u~, b, G+) | V_87 -> (c~, b, G+) | V_90 -> (c~, d, W+) | V_91 -> (t~, d, W+) | V_92 -> (u~, s, W+) | V_94 -> (t~, s, W+) | V_95 -> (u~, b, W+) | V_96 -> (c~, b, W+) | V_101 -> (e+, e-, G0) | V_102 -> (mu+, mu-, G0) | V_104 -> (e+, e-, H) | V_105 -> (mu+, mu-, H) | V_110 -> (ve~, e-, G+) | V_111 -> (vm~, mu-, G+) | V_116 -> (b~, u, G-) | V_117 -> (d~, c, G-) | V_118 -> (s~, c, G-) | V_119 -> (b~, c, G-) | V_120 -> (d~, t, G-) | V_121 -> (s~, t, G-) | V_124 -> (s~, u, W-) | V_125 -> (b~, u, W-) | V_126 -> (d~, c, W-) | V_128 -> (b~, c, W-) | V_129 -> (d~, t, W-) | V_130 -> (s~, t, W-) | V_138 -> (c~, c, G0) | V_140 -> (c~, c, H) | V_145 -> (e+, ve, G-) | V_146 -> (mu+, vm, G-)
  1068. 248.36 s > [2026-09-23 20:51:50.396] @gammalooprs::model INFO : The following 36 couplings were removed by the restriction card:
  1069. 248.36 s > GC_13, GC_14, GC_16, GC_17, GC_18, GC_19, GC_20, GC_22, GC_23, GC_24, GC_25, GC_26, GC_28, GC_29, GC_42, GC_43, GC_44, GC_46, GC_47, GC_48, GC_84, GC_85, GC_86, GC_87, GC_88, GC_89, GC_90, GC_91, GC_92, GC_93, GC_101, GC_102, GC_103, GC_105, GC_106, GC_107
  1070. 248.36 s > [2026-09-23 20:51:50.396] @gammaloop_api::se... INFO : Running command run set_model_parameters
  1071. 248.36 s > [2026-09-23 20:51:50.396] @gammaloop_api::se... INFO : Starting command block set_model_parameters
  1072. 248.36 s > [2026-09-23 20:51:50.397] @gammaloop_api::se... INFO : Running command set model MT=173.0
  1073. 248.36 s > [2026-09-23 20:51:50.401] @gammaloop_api::se... INFO : Running command set model WT=0.0
  1074. 248.36 s > [2026-09-23 20:51:50.405] @gammaloop_api::se... INFO : Running command set model ymt=173.0
  1075. 248.36 s > [2026-09-23 20:51:50.410] @gammaloop_api::se... INFO : Running command set model aS=0.118
  1076. 248.36 s > [2026-09-23 20:51:50.414] @gammaloop_api::se... INFO : Running command set model aEWM1=137.036
  1077. 248.36 s > [2026-09-23 20:51:50.419] @gammaloop_api::se... INFO : Running command set model Gf=1.166390e-05
  1078. 248.36 s > [2026-09-23 20:51:50.423] @gammaloop_api::se... INFO : Running command set model MZ=91.188
  1079. 248.36 s > [2026-09-23 20:51:50.428] @gammaloop_api::se... INFO : Running command set global string '
  1080. 248.36 s > [global.generation.compile]
  1081. 248.36 s > compilation_mode = "symjit"
  1082. 248.36 s > optimization_level = "O0"
  1083. 248.36 s > fast_math = false
  1084. 248.36 s > [...]
  1085. 248.36 s > [2026-09-23 20:51:50.428] @gammaloop_api::se... INFO : Running command import graphs ./examples/cli/aa_aa/1L/aa_aa_1L.dot -p aa_aa_all_helicities -i 1L_ppmm -o
  1086. 248.36 s > [2026-09-23 20:51:50.429] @commands::import INFO : Loading graphs from '/build/source/examples/cli/aa_aa/1L/aa_aa_1L.dot'
  1087. 248.36 s > [2026-09-23 20:51:50.437] @gammaloop_api::se... INFO : Running command generate existing -p aa_aa_all_helicities
  1088. 248.36 s > The application panicked (crashed).
  1089. 248.36 s > Message: label _func_power_ not found
  1090. 248.36 s > Location: /nix/store/n9w914kh1cm59xx3spcs831cdyb56m32-vendor-cargo-deps/c19b7c6f923b580ac259164a89f2577984ad5ab09ee9d583b888f934adbbe8d0/symjit-2.25.6/src/symjit/assembler.rs:77
  1091. 248.36 s >
  1092. 248.36 s > ━━━━━━━━━━━━━━━━━━━━━━━━━━━━━━━━━━ BACKTRACE ━━━━━━━━━━━━━━━━━━━━━━━━━━━━━━━━━━━
  1093. 248.36 s > 1: <color_eyre[51793ea62743adbd]::config::PanicHook>::panic_report<unknown>
  1094. 248.36 s > at <unknown source file>:<unknown line>
  1095. 248.36 s > 2: <color_eyre[51793ea62743adbd]::config::PanicHook>::into_panic_hook::{closure#0}<unknown>
  1096. 248.36 s > at <unknown source file>:<unknown line>
  1097. 248.36 s > 3: std[bcb96dfbba0ab899]::panicking::panic_with_hook<unknown>
  1098. 248.36 s > at <unknown source file>:<unknown line>
  1099. 248.36 s > 4: std[bcb96dfbba0ab899]::panicking::panic_handler::{closure#0}<unknown>
  1100. 248.36 s > at <unknown source file>:<unknown line>
  1101. 248.36 s > 5: std[bcb96dfbba0ab899]::sys::backtrace::__rust_end_short_backtrace::<std[bcb96dfbba0ab899]::panicking::panic_handler::{closure#0}, !><unknown>
  1102. 248.36 s > at <unknown source file>:<unknown line>
  1103. 248.36 s > 6: __rustc[6c289b9f9c454d21]::rust_begin_unwind<unknown>
  1104. 248.36 s > at <unknown source file>:<unknown line>
  1105. 248.36 s > 7: core[940e698046960fd5]::panicking::panic_fmt<unknown>
  1106. 248.36 s > at <unknown source file>:<unknown line>
  1107. 248.36 s > 8: <symjit[e408de789c333cd]::symjit::assembler::Assembler>::apply_jumps<unknown>
  1108. 248.36 s > at <unknown source file>:<unknown line>
  1109. 248.36 s > 9: <symjit[e408de789c333cd]::symjit::builder::Builder>::compile_from_mir::<symjit[e408de789c333cd]::symjit::amd::complex::AmdComplexGenerator><unknown>
  1110. 248.36 s > at <unknown source file>:<unknown line>
  1111. 248.36 s > 10: <symjit[e408de789c333cd]::symjit::runnable::Application>::compile_ty<unknown>
  1112. 248.36 s > at <unknown source file>:<unknown line>
  1113. 248.36 s > 11: <symjit[e408de789c333cd]::symjit::runnable::Application>::with_mir<unknown>
  1114. 248.36 s > at <unknown source file>:<unknown line>
  1115. 248.36 s > 12: <symjit[e408de789c333cd]::symjit::composer::DirectTranslator as symjit[e408de789c333cd]::symjit::composer::Composer>::compile<unknown>
  1116. 248.36 s > at <unknown source file>:<unknown line>
  1117. 248.36 s > 13: <symjit[e408de789c333cd]::symjit::compiler::Translator as symjit[e408de789c333cd]::symjit::composer::Composer>::compile<unknown>
  1118. 248.36 s > at <unknown source file>:<unknown line>
  1119. 248.36 s > 14: <numerica[124dab8567f4861e]::domains::float::complex::Complex<f64> as symbolica[10e259bab675d243]::evaluate::backend::JITCompiledNumber>::jit_compile<unknown>
  1120. 248.36 s > at <unknown source file>:<unknown line>
  1121. 248.36 s > 15: <gammalooprs[917cbd3df9e68f8f]::integrands::process::evaluators::GenericEvaluator>::activate_symjit<unknown>
  1122. 248.36 s > at <unknown source file>:<unknown line>
  1123. 248.36 s > 16: <gammalooprs[917cbd3df9e68f8f]::integrands::process::amplitude::AmplitudeIntegrand>::prepare_runtime_backends_after_generation_with_compile_times<unknown>
  1124. 248.36 s > at <unknown source file>:<unknown line>
  1125. 248.36 s > 17: <gammalooprs[917cbd3df9e68f8f]::processes::amplitude::Amplitude>::build_integrand<unknown>
  1126. 248.36 s > at <unknown source file>:<unknown line>
  1127. 248.36 s > 18: <gammalooprs[917cbd3df9e68f8f]::processes::process::Process>::generate_integrands<unknown>
  1128. 248.36 s > at <unknown source file>:<unknown line>
  1129. 248.36 s > 19: <gammaloop_api[9ebf6628f97aeb57]::state::State>::generate_integrand<unknown>
  1130. 248.36 s > at <unknown source file>:<unknown line>
  1131. 248.36 s > 20: <gammaloop_api[9ebf6628f97aeb57]::commands::generate::Generate>::run::<&std[bcb96dfbba0ab899]::path::PathBuf><unknown>
  1132. 248.36 s > at <unknown source file>:<unknown line>
  1133. 248.36 s > 21: <gammaloop_api[9ebf6628f97aeb57]::commands::Commands>::run<unknown>
  1134. 248.36 s > at <unknown source file>:<unknown line>
  1135. 248.36 s > 22: <gammaloop_api[9ebf6628f97aeb57]::session::CliSession>::execute_prepared<unknown>
  1136. 248.36 s > at <unknown source file>:<unknown line>
  1137. 248.36 s > 23: <gammaloop_api[9ebf6628f97aeb57]::session::CliSession>::execute_command<unknown>
  1138. 248.36 s > at <unknown source file>:<unknown line>
  1139. 248.36 s > 24: <gammaloop_integration_tests[191607b70c61cd5a]::CLIState>::run_command<unknown>
  1140. 248.36 s > at <unknown source file>:<unknown line>
  1141. 248.36 s > 25: test_runs[9b7e2dc2dc4f29b0]::aa_aa::generate_aa_aa_helicity_family<unknown>
  1142. 248.36 s > at <unknown source file>:<unknown line>
  1143. 248.36 s > 26: <test_runs[9b7e2dc2dc4f29b0]::aa_aa::important::aa_aa_local_inspect_backend_consistency::{closure#0} as core[940e698046960fd5]::ops::function::FnOnce<()>>::call_once<unknown>
  1144. 248.36 s > at <unknown source file>:<unknown line>
  1145. 248.36 s > 27: serial_test[cd99724524a2f1c0]::serial_code_lock::local_serial_core_with_return::<(), eyre[cb2fd339c0c40fca]::Report><unknown>
  1146. 248.36 s > at <unknown source file>:<unknown line>
  1147. 248.36 s > 28: <test_runs[9b7e2dc2dc4f29b0]::aa_aa::important::aa_aa_local_inspect_backend_consistency::{closure#0} as core[940e698046960fd5]::ops::function::FnOnce<()>>::call_once<unknown>
  1148. 248.36 s > at <unknown source file>:<unknown line>
  1149. 248.36 s > 29: test[75d6903177b1d7e9]::__rust_begin_short_backtrace::<core[940e698046960fd5]::result::Result<(), alloc[2ea6bcb46fca0c42]::string::String>, fn() -> core[940e698046960fd5]::result::Result<(), alloc[2ea6bcb46fca0c42]::string::String>><unknown>
  1150. 248.36 s > at <unknown source file>:<unknown line>
  1151. 248.36 s > 30: test[75d6903177b1d7e9]::run_test::{closure#0}<unknown>
  1152. 248.36 s > at <unknown source file>:<unknown line>
  1153. 248.36 s > 31: std[bcb96dfbba0ab899]::sys::backtrace::__rust_begin_short_backtrace::<test[75d6903177b1d7e9]::run_test::{closure#1}, ()><unknown>
  1154. 248.36 s > at <unknown source file>:<unknown line>
  1155. 248.36 s > 32: <std[bcb96dfbba0ab899]::thread::lifecycle::spawn_unchecked<test[75d6903177b1d7e9]::run_test::{closure#1}, ()>::{closure#1} as core[940e698046960fd5]::ops::function::FnOnce<()>>::call_once::{shim:vtable#0}<unknown>
  1156. 248.36 s > at <unknown source file>:<unknown line>
  1157. 248.36 s > 33: <std[bcb96dfbba0ab899]::sys::thread::unix::Thread>::new::thread_start<unknown>
  1158. 248.36 s > at <unknown source file>:<unknown line>
  1159. 248.36 s > 34: start_thread<unknown>
  1160. 248.36 s > at <unknown source file>:<unknown line>
  1161. 248.36 s > 35: __clone3<unknown>
  1162. 248.36 s > at <unknown source file>:<unknown line>
  1163. 248.36 s >
  1164. 248.36 s > Run with COLORBT_SHOW_HIDDEN=1 environment variable to disable frame filtering.
  1165. 248.36 s > Run with RUST_BACKTRACE=full to include source snippets.
  1166. 248.36 s > Warning: SpanTrace capture is Unsupported.
  1167. 248.36 s > Ensure that you've setup a tracing-error ErrorLayer and the semver versions are compatible
  1168. 248.36 s >
  1169. 248.36 s > FAIL [ 2.562s] (158/170) gammaloop-integration-tests::uv thermal_sunrise_uv
  1170. 248.36 s > stdout ---
  1171. 248.36 s >
  1172. 248.36 s > running 1 test
  1173. 248.36 s > test thermal_sunrise_uv ... FAILED
  1174. 248.36 s >
  1175. 248.36 s > failures:
  1176. 248.36 s >
  1177. 248.36 s > failures:
  1178. 248.36 s > thermal_sunrise_uv
  1179. 248.36 s >
  1180. 248.36 s > test result: FAILED. 0 passed; 1 failed; 0 ignored; 0 measured; 31 filtered out; finished in 2.55s
  1181. 248.36 s >
  1182. 248.36 s > stderr ---
  1183. 248.36 s > [2026-09-23 20:52:32.581] @gammaloop_api::se... INFO : Running command run generate
  1184. 248.36 s > [2026-09-23 20:52:32.581] @gammaloop_api::se... INFO : Starting command block generate
  1185. 248.36 s > [2026-09-23 20:52:32.581] @gammaloop_api::se... INFO : Running command import model sm-default.json
  1186. 248.36 s > [2026-09-23 20:52:32.581] @import::model INFO : Loading built-in JSON model sm-default
  1187. 248.36 s > [2026-09-23 20:52:32.628] @gammalooprs::model INFO : The following 15 external parameters were forced to zero by the restriction card:
  1188. 248.36 s > lamWS, AWS, rhoWS, etaWS, ymc, yme, ymm, MC, Me, MM, WTau, muQ, muLe, muLmu, muLtau
  1189. 248.36 s > [2026-09-23 20:52:32.628] @gammalooprs::model INFO : The following 34 vertex rules were removed by the restriction card:
  1190. 248.36 s > V_82 -> (c~, d, G+) | V_83 -> (t~, d, G+) | V_84 -> (c~, s, G+) | V_85 -> (t~, s, G+) | V_86 -> (u~, b, G+) | V_87 -> (c~, b, G+) | V_90 -> (c~, d, W+) | V_91 -> (t~, d, W+) | V_92 -> (u~, s, W+) | V_94 -> (t~, s, W+) | V_95 -> (u~, b, W+) | V_96 -> (c~, b, W+) | V_101 -> (e+, e-, G0) | V_102 -> (mu+, mu-, G0) | V_104 -> (e+, e-, H) | V_105 -> (mu+, mu-, H) | V_110 -> (ve~, e-, G+) | V_111 -> (vm~, mu-, G+) | V_116 -> (b~, u, G-) | V_117 -> (d~, c, G-) | V_118 -> (s~, c, G-) | V_119 -> (b~, c, G-) | V_120 -> (d~, t, G-) | V_121 -> (s~, t, G-) | V_124 -> (s~, u, W-) | V_125 -> (b~, u, W-) | V_126 -> (d~, c, W-) | V_128 -> (b~, c, W-) | V_129 -> (d~, t, W-) | V_130 -> (s~, t, W-) | V_138 -> (c~, c, G0) | V_140 -> (c~, c, H) | V_145 -> (e+, ve, G-) | V_146 -> (mu+, vm, G-)
  1191. 248.36 s > [2026-09-23 20:52:32.628] @gammalooprs::model INFO : The following 36 couplings were removed by the restriction card:
  1192. 248.36 s > GC_13, GC_14, GC_16, GC_17, GC_18, GC_19, GC_20, GC_22, GC_23, GC_24, GC_25, GC_26, GC_28, GC_29, GC_42, GC_43, GC_44, GC_46, GC_47, GC_48, GC_84, GC_85, GC_86, GC_87, GC_88, GC_89, GC_90, GC_91, GC_92, GC_93, GC_101, GC_102, GC_103, GC_105, GC_106, GC_107
  1193. 248.36 s > [2026-09-23 20:52:32.628] @gammaloop_api::se... INFO : Running command remove processes
  1194. 248.36 s > [2026-09-23 20:52:32.628] @gammaloop_api::se... INFO : Running command generate amp {} > {} [{2}] | g u
  1195. 248.36 s > --numerator-grouping group_identical_graphs_up_to_scalar_rescaling
  1196. 248.36 s > --max-n-bridges 0
  1197. 248.36 s > --number-of-factorized-loop-subtopologies 1 1
  1198. 248.36 s > --number-of-anticommutating-loops 1 1
  1199. 248.36 s > [...]
  1200. 248.36 s > [2026-09-23 20:52:32.629] @feyngen::diagram_... INFO : 0s | Δ=0s | Starting Feynman graph generation with Symbolica...
  1201. 248.36 s > [2026-09-23 20:52:32.630] @feyngen::diagram_... INFO : 0s | Δ=0s | Number of graphs resulting from Symbolica generation: 3
  1202. 248.36 s > [2026-09-23 20:52:32.630] @feyngen::diagram_... INFO : 0s | Δ=0s | Number of graphs retained after removal of vetoed topologies: 2
  1203. 248.36 s > [2026-09-23 20:52:32.630] @feyngen::diagram_... INFO : 0s | Δ=0s | Number of graphs after vertex info assignment: 2
  1204. 248.36 s > [2026-09-23 20:52:32.630] @feyngen::diagram_... INFO : 0s | Δ=0s | Number of graphs after all complete graphs filters are applied: 2
  1205. 248.36 s > [2026-09-23 20:52:32.630] @feyngen::diagram_... INFO : 0s | Δ=0s | Number of graphs after closed anticommutating chains analysis: 1
  1206. 248.36 s > [2026-09-23 20:52:32.630] @feyngen::diagram_... INFO : 0s | Δ=0s | Number of graphs after symmetrization of external states: 1
  1207. 248.36 s > [2026-09-23 20:52:32.630] @feyngen::diagram_... INFO : 0s | Δ=0s | Number of graphs after canonization of vertices, edges and flows (graph labels assigned here): 1
  1208. 248.36 s > [2026-09-23 20:52:32.642] @feyngen::diagram_... INFO : 0s | Δ=0s | Number of graphs after numerator-aware grouping with strategy 'up to a scalar rescaling': 1 (1 isomorphically unique graph, 0 color zero, 0 lorentz zero, 0 grouped and 0 cancellation)
  1209. 248.36 s > [2026-09-23 20:52:32.642] @feyngen::diagram_... INFO : ( Sum of the symmetry factors from each graph generated = -1/2 )
  1210. 248.36 s > [2026-09-23 20:52:32.642] @commands::generate INFO : Generated amplitude 1 graphs.
  1211. 248.36 s > [2026-09-23 20:52:32.642] @commands::generate INFO : Only diagram generation was requested, skipping integrand generation. You can generate integrands later using the 'generate existing <options>' command.
  1212. 248.36 s > [2026-09-23 20:52:32.642] @gammaloop_api::se... INFO : Running command generate
  1213. 248.36 s > The application panicked (crashed).
  1214. 248.36 s > Message: label _func_power_ not found
  1215. 248.36 s > Location: /nix/store/n9w914kh1cm59xx3spcs831cdyb56m32-vendor-cargo-deps/c19b7c6f923b580ac259164a89f2577984ad5ab09ee9d583b888f934adbbe8d0/symjit-2.25.6/src/symjit/assembler.rs:77
  1216. 248.36 s >
  1217. 248.36 s > ━━━━━━━━━━━━━━━━━━━━━━━━━━━━━━━━━━ BACKTRACE ━━━━━━━━━━━━━━━━━━━━━━━━━━━━━━━━━━━
  1218. 248.36 s > 1: <color_eyre[51793ea62743adbd]::config::PanicHook>::panic_report<unknown>
  1219. 248.36 s > at <unknown source file>:<unknown line>
  1220. 248.36 s > 2: <color_eyre[51793ea62743adbd]::config::PanicHook>::into_panic_hook::{closure#0}<unknown>
  1221. 248.36 s > at <unknown source file>:<unknown line>
  1222. 248.36 s > 3: std[bcb96dfbba0ab899]::panicking::panic_with_hook<unknown>
  1223. 248.36 s > at <unknown source file>:<unknown line>
  1224. 248.36 s > 4: std[bcb96dfbba0ab899]::panicking::panic_handler::{closure#0}<unknown>
  1225. 248.36 s > at <unknown source file>:<unknown line>
  1226. 248.36 s > 5: std[bcb96dfbba0ab899]::sys::backtrace::__rust_end_short_backtrace::<std[bcb96dfbba0ab899]::panicking::panic_handler::{closure#0}, !><unknown>
  1227. 248.36 s > at <unknown source file>:<unknown line>
  1228. 248.36 s > 6: __rustc[6c289b9f9c454d21]::rust_begin_unwind<unknown>
  1229. 248.36 s > at <unknown source file>:<unknown line>
  1230. 248.36 s > 7: core[940e698046960fd5]::panicking::panic_fmt<unknown>
  1231. 248.36 s > at <unknown source file>:<unknown line>
  1232. 248.36 s > 8: <symjit[e408de789c333cd]::symjit::assembler::Assembler>::apply_jumps<unknown>
  1233. 248.36 s > at <unknown source file>:<unknown line>
  1234. 248.36 s > 9: <symjit[e408de789c333cd]::symjit::builder::Builder>::compile_from_mir::<symjit[e408de789c333cd]::symjit::amd::complex::AmdComplexGenerator><unknown>
  1235. 248.36 s > at <unknown source file>:<unknown line>
  1236. 248.36 s > 10: <symjit[e408de789c333cd]::symjit::runnable::Application>::compile_ty<unknown>
  1237. 248.36 s > at <unknown source file>:<unknown line>
  1238. 248.36 s > 11: <symjit[e408de789c333cd]::symjit::runnable::Application>::with_mir<unknown>
  1239. 248.36 s > at <unknown source file>:<unknown line>
  1240. 248.36 s > 12: <symjit[e408de789c333cd]::symjit::composer::DirectTranslator as symjit[e408de789c333cd]::symjit::composer::Composer>::compile<unknown>
  1241. 248.36 s > at <unknown source file>:<unknown line>
  1242. 248.36 s > 13: <symjit[e408de789c333cd]::symjit::compiler::Translator as symjit[e408de789c333cd]::symjit::composer::Composer>::compile<unknown>
  1243. 248.36 s > at <unknown source file>:<unknown line>
  1244. 248.36 s > 14: <numerica[124dab8567f4861e]::domains::float::complex::Complex<f64> as symbolica[10e259bab675d243]::evaluate::backend::JITCompiledNumber>::jit_compile<unknown>
  1245. 248.36 s > at <unknown source file>:<unknown line>
  1246. 248.36 s > 15: <gammalooprs[917cbd3df9e68f8f]::integrands::process::evaluators::GenericEvaluator>::activate_symjit<unknown>
  1247. 248.36 s > at <unknown source file>:<unknown line>
  1248. 248.36 s > 16: <gammalooprs[917cbd3df9e68f8f]::integrands::process::amplitude::AmplitudeIntegrand>::prepare_runtime_backends_after_generation_with_compile_times<unknown>
  1249. 248.36 s > at <unknown source file>:<unknown line>
  1250. 248.36 s > 17: <gammalooprs[917cbd3df9e68f8f]::processes::amplitude::Amplitude>::build_integrand<unknown>
  1251. 248.36 s > at <unknown source file>:<unknown line>
  1252. 248.36 s > 18: <gammalooprs[917cbd3df9e68f8f]::processes::process::Process>::generate_integrands<unknown>
  1253. 248.36 s > at <unknown source file>:<unknown line>
  1254. 248.36 s > 19: <gammalooprs[917cbd3df9e68f8f]::processes::ProcessList>::generate_integrands<unknown>
  1255. 248.36 s > at <unknown source file>:<unknown line>
  1256. 248.36 s > 20: <gammaloop_api[9ebf6628f97aeb57]::state::State>::generate_integrands<unknown>
  1257. 248.36 s > at <unknown source file>:<unknown line>
  1258. 248.36 s > 21: <gammaloop_api[9ebf6628f97aeb57]::commands::generate::Generate>::run::<&std[bcb96dfbba0ab899]::path::PathBuf><unknown>
  1259. 248.36 s > at <unknown source file>:<unknown line>
  1260. 248.36 s > 22: <gammaloop_api[9ebf6628f97aeb57]::commands::Commands>::run<unknown>
  1261. 248.36 s > at <unknown source file>:<unknown line>
  1262. 248.36 s > 23: <gammaloop_api[9ebf6628f97aeb57]::session::CliSession>::execute_prepared<unknown>
  1263. 248.36 s > at <unknown source file>:<unknown line>
  1264. 248.36 s > 24: <gammaloop_api[9ebf6628f97aeb57]::session::CliSession>::execute_prepared_commands<unknown>
  1265. 248.36 s > at <unknown source file>:<unknown line>
  1266. 248.36 s > 25: <gammaloop_api[9ebf6628f97aeb57]::session::CliSession>::execute_prepared<unknown>
  1267. 248.36 s > at <unknown source file>:<unknown line>
  1268. 248.36 s > 26: <gammaloop_api[9ebf6628f97aeb57]::session::CliSession>::execute_command<unknown>
  1269. 248.36 s > at <unknown source file>:<unknown line>
  1270. 248.36 s > 27: <gammaloop_integration_tests[191607b70c61cd5a]::CLIState>::run_command<unknown>
  1271. 248.36 s > at <unknown source file>:<unknown line>
  1272. 248.36 s > 28: uv[3c7454ef256d6487]::run_single_integrated_uv_case<unknown>
  1273. 248.36 s > at <unknown source file>:<unknown line>
  1274. 248.36 s > 29: <uv[3c7454ef256d6487]::thermal_sunrise_uv::{closure#0} as core[940e698046960fd5]::ops::function::FnOnce<()>>::call_once<unknown>
  1275. 248.36 s > at <unknown source file>:<unknown line>
  1276. 248.36 s > 30: test[75d6903177b1d7e9]::__rust_begin_short_backtrace::<core[940e698046960fd5]::result::Result<(), alloc[2ea6bcb46fca0c42]::string::String>, fn() -> core[940e698046960fd5]::result::Result<(), alloc[2ea6bcb46fca0c42]::string::String>><unknown>
  1277. 248.36 s > at <unknown source file>:<unknown line>
  1278. 248.36 s > 31: test[75d6903177b1d7e9]::run_test::{closure#0}<unknown>
  1279. 248.36 s > at <unknown source file>:<unknown line>
  1280. 248.36 s > 32: std[bcb96dfbba0ab899]::sys::backtrace::__rust_begin_short_backtrace::<test[75d6903177b1d7e9]::run_test::{closure#1}, ()><unknown>
  1281. 248.36 s > at <unknown source file>:<unknown line>
  1282. 248.36 s > 33: <std[bcb96dfbba0ab899]::thread::lifecycle::spawn_unchecked<test[75d6903177b1d7e9]::run_test::{closure#1}, ()>::{closure#1} as core[940e698046960fd5]::ops::function::FnOnce<()>>::call_once::{shim:vtable#0}<unknown>
  1283. 248.36 s > at <unknown source file>:<unknown line>
  1284. 248.36 s > 34: <std[bcb96dfbba0ab899]::sys::thread::unix::Thread>::new::thread_start<unknown>
  1285. 248.36 s > at <unknown source file>:<unknown line>
  1286. 248.36 s > 35: start_thread<unknown>
  1287. 248.36 s > at <unknown source file>:<unknown line>
  1288. 248.36 s > 36: __clone3<unknown>
  1289. 248.36 s > at <unknown source file>:<unknown line>
  1290. 248.36 s >
  1291. 248.36 s > Run with COLORBT_SHOW_HIDDEN=1 environment variable to disable frame filtering.
  1292. 248.36 s > Run with RUST_BACKTRACE=full to include source snippets.
  1293. 248.36 s > Warning: SpanTrace capture is Unsupported.
  1294. 248.36 s > Ensure that you've setup a tracing-error ErrorLayer and the semver versions are compatible
  1295. 248.36 s >
  1296. 248.36 s > ------------
  1297. 248.36 s > Summary [ 184.164s] 170 tests run: 168 passed, 2 failed, 209 skipped
  1298. 248.36 s > FAIL [ 2.891s] ( 55/170) gammaloop-integration-tests::test_runs aa_aa::important::aa_aa_local_inspect_backend_consistency
  1299. 248.36 s > stdout ---
  1300. 248.36 s >
  1301. 248.36 s > running 1 test
  1302. 248.36 s > test aa_aa::important::aa_aa_local_inspect_backend_consistency ... FAILED
  1303. 248.36 s >
  1304. 248.36 s > failures:
  1305. 248.36 s >
  1306. 248.36 s > failures:
  1307. 248.36 s > aa_aa::important::aa_aa_local_inspect_backend_consistency
  1308. 248.36 s >
  1309. 248.36 s > test result: FAILED. 0 passed; 1 failed; 0 ignored; 0 measured; 274 filtered out; finished in 2.88s
  1310. 248.36 s >
  1311. 248.36 s > stderr ---
  1312. 248.36 s > [2026-09-23 20:51:50.374] @gammaloop_api::se... INFO : Running command import model sm-default.json
  1313. 248.36 s > [2026-09-23 20:51:50.374] @import::model INFO : Loading built-in JSON model sm-default
  1314. 248.36 s > [2026-09-23 20:51:50.396] @gammalooprs::model INFO : The following 15 external parameters were forced to zero by the restriction card:
  1315. 248.36 s > lamWS, AWS, rhoWS, etaWS, ymc, yme, ymm, MC, Me, MM, WTau, muQ, muLe, muLmu, muLtau
  1316. 248.36 s > [2026-09-23 20:51:50.396] @gammalooprs::model INFO : The following 34 vertex rules were removed by the restriction card:
  1317. 248.36 s > V_82 -> (c~, d, G+) | V_83 -> (t~, d, G+) | V_84 -> (c~, s, G+) | V_85 -> (t~, s, G+) | V_86 -> (u~, b, G+) | V_87 -> (c~, b, G+) | V_90 -> (c~, d, W+) | V_91 -> (t~, d, W+) | V_92 -> (u~, s, W+) | V_94 -> (t~, s, W+) | V_95 -> (u~, b, W+) | V_96 -> (c~, b, W+) | V_101 -> (e+, e-, G0) | V_102 -> (mu+, mu-, G0) | V_104 -> (e+, e-, H) | V_105 -> (mu+, mu-, H) | V_110 -> (ve~, e-, G+) | V_111 -> (vm~, mu-, G+) | V_116 -> (b~, u, G-) | V_117 -> (d~, c, G-) | V_118 -> (s~, c, G-) | V_119 -> (b~, c, G-) | V_120 -> (d~, t, G-) | V_121 -> (s~, t, G-) | V_124 -> (s~, u, W-) | V_125 -> (b~, u, W-) | V_126 -> (d~, c, W-) | V_128 -> (b~, c, W-) | V_129 -> (d~, t, W-) | V_130 -> (s~, t, W-) | V_138 -> (c~, c, G0) | V_140 -> (c~, c, H) | V_145 -> (e+, ve, G-) | V_146 -> (mu+, vm, G-)
  1318. 248.36 s > [2026-09-23 20:51:50.396] @gammalooprs::model INFO : The following 36 couplings were removed by the restriction card:
  1319. 248.36 s > GC_13, GC_14, GC_16, GC_17, GC_18, GC_19, GC_20, GC_22, GC_23, GC_24, GC_25, GC_26, GC_28, GC_29, GC_42, GC_43, GC_44, GC_46, GC_47, GC_48, GC_84, GC_85, GC_86, GC_87, GC_88, GC_89, GC_90, GC_91, GC_92, GC_93, GC_101, GC_102, GC_103, GC_105, GC_106, GC_107
  1320. 248.36 s > [2026-09-23 20:51:50.396] @gammaloop_api::se... INFO : Running command run set_model_parameters
  1321. 248.36 s > [2026-09-23 20:51:50.396] @gammaloop_api::se... INFO : Starting command block set_model_parameters
  1322. 248.36 s > [2026-09-23 20:51:50.397] @gammaloop_api::se... INFO : Running command set model MT=173.0
  1323. 248.36 s > [2026-09-23 20:51:50.401] @gammaloop_api::se... INFO : Running command set model WT=0.0
  1324. 248.36 s > [2026-09-23 20:51:50.405] @gammaloop_api::se... INFO : Running command set model ymt=173.0
  1325. 248.36 s > [2026-09-23 20:51:50.410] @gammaloop_api::se... INFO : Running command set model aS=0.118
  1326. 248.36 s > [2026-09-23 20:51:50.414] @gammaloop_api::se... INFO : Running command set model aEWM1=137.036
  1327. 248.36 s > [2026-09-23 20:51:50.419] @gammaloop_api::se... INFO : Running command set model Gf=1.166390e-05
  1328. 248.36 s > [2026-09-23 20:51:50.423] @gammaloop_api::se... INFO : Running command set model MZ=91.188
  1329. 248.36 s > [2026-09-23 20:51:50.428] @gammaloop_api::se... INFO : Running command set global string '
  1330. 248.36 s > [global.generation.compile]
  1331. 248.36 s > compilation_mode = "symjit"
  1332. 248.36 s > optimization_level = "O0"
  1333. 248.36 s > fast_math = false
  1334. 248.36 s > [...]
  1335. 248.36 s > [2026-09-23 20:51:50.428] @gammaloop_api::se... INFO : Running command import graphs ./examples/cli/aa_aa/1L/aa_aa_1L.dot -p aa_aa_all_helicities -i 1L_ppmm -o
  1336. 248.36 s > [2026-09-23 20:51:50.429] @commands::import INFO : Loading graphs from '/build/source/examples/cli/aa_aa/1L/aa_aa_1L.dot'
  1337. 248.36 s > [2026-09-23 20:51:50.437] @gammaloop_api::se... INFO : Running command generate existing -p aa_aa_all_helicities
  1338. 248.36 s > The application panicked (crashed).
  1339. 248.36 s > Message: label _func_power_ not found
  1340. 248.36 s > Location: /nix/store/n9w914kh1cm59xx3spcs831cdyb56m32-vendor-cargo-deps/c19b7c6f923b580ac259164a89f2577984ad5ab09ee9d583b888f934adbbe8d0/symjit-2.25.6/src/symjit/assembler.rs:77
  1341. 248.36 s >
  1342. 248.36 s > ━━━━━━━━━━━━━━━━━━━━━━━━━━━━━━━━━━ BACKTRACE ━━━━━━━━━━━━━━━━━━━━━━━━━━━━━━━━━━━
  1343. 248.36 s > 1: <color_eyre[51793ea62743adbd]::config::PanicHook>::panic_report<unknown>
  1344. 248.36 s > at <unknown source file>:<unknown line>
  1345. 248.36 s > 2: <color_eyre[51793ea62743adbd]::config::PanicHook>::into_panic_hook::{closure#0}<unknown>
  1346. 248.36 s > at <unknown source file>:<unknown line>
  1347. 248.36 s > 3: std[bcb96dfbba0ab899]::panicking::panic_with_hook<unknown>
  1348. 248.36 s > at <unknown source file>:<unknown line>
  1349. 248.36 s > 4: std[bcb96dfbba0ab899]::panicking::panic_handler::{closure#0}<unknown>
  1350. 248.36 s > at <unknown source file>:<unknown line>
  1351. 248.36 s > 5: std[bcb96dfbba0ab899]::sys::backtrace::__rust_end_short_backtrace::<std[bcb96dfbba0ab899]::panicking::panic_handler::{closure#0}, !><unknown>
  1352. 248.36 s > at <unknown source file>:<unknown line>
  1353. 248.36 s > 6: __rustc[6c289b9f9c454d21]::rust_begin_unwind<unknown>
  1354. 248.36 s > at <unknown source file>:<unknown line>
  1355. 248.36 s > 7: core[940e698046960fd5]::panicking::panic_fmt<unknown>
  1356. 248.36 s > at <unknown source file>:<unknown line>
  1357. 248.36 s > 8: <symjit[e408de789c333cd]::symjit::assembler::Assembler>::apply_jumps<unknown>
  1358. 248.36 s > at <unknown source file>:<unknown line>
  1359. 248.36 s > 9: <symjit[e408de789c333cd]::symjit::builder::Builder>::compile_from_mir::<symjit[e408de789c333cd]::symjit::amd::complex::AmdComplexGenerator><unknown>
  1360. 248.36 s > at <unknown source file>:<unknown line>
  1361. 248.36 s > 10: <symjit[e408de789c333cd]::symjit::runnable::Application>::compile_ty<unknown>
  1362. 248.36 s > at <unknown source file>:<unknown line>
  1363. 248.36 s > 11: <symjit[e408de789c333cd]::symjit::runnable::Application>::with_mir<unknown>
  1364. 248.36 s > at <unknown source file>:<unknown line>
  1365. 248.36 s > 12: <symjit[e408de789c333cd]::symjit::composer::DirectTranslator as symjit[e408de789c333cd]::symjit::composer::Composer>::compile<unknown>
  1366. 248.36 s > at <unknown source file>:<unknown line>
  1367. 248.36 s > 13: <symjit[e408de789c333cd]::symjit::compiler::Translator as symjit[e408de789c333cd]::symjit::composer::Composer>::compile<unknown>
  1368. 248.36 s > at <unknown source file>:<unknown line>
  1369. 248.36 s > 14: <numerica[124dab8567f4861e]::domains::float::complex::Complex<f64> as symbolica[10e259bab675d243]::evaluate::backend::JITCompiledNumber>::jit_compile<unknown>
  1370. 248.36 s > at <unknown source file>:<unknown line>
  1371. 248.36 s > 15: <gammalooprs[917cbd3df9e68f8f]::integrands::process::evaluators::GenericEvaluator>::activate_symjit<unknown>
  1372. 248.36 s > at <unknown source file>:<unknown line>
  1373. 248.36 s > 16: <gammalooprs[917cbd3df9e68f8f]::integrands::process::amplitude::AmplitudeIntegrand>::prepare_runtime_backends_after_generation_with_compile_times<unknown>
  1374. 248.36 s > at <unknown source file>:<unknown line>
  1375. 248.36 s > 17: <gammalooprs[917cbd3df9e68f8f]::processes::amplitude::Amplitude>::build_integrand<unknown>
  1376. 248.36 s > at <unknown source file>:<unknown line>
  1377. 248.36 s > 18: <gammalooprs[917cbd3df9e68f8f]::processes::process::Process>::generate_integrands<unknown>
  1378. 248.36 s > at <unknown source file>:<unknown line>
  1379. 248.36 s > 19: <gammaloop_api[9ebf6628f97aeb57]::state::State>::generate_integrand<unknown>
  1380. 248.36 s > at <unknown source file>:<unknown line>
  1381. 248.36 s > 20: <gammaloop_api[9ebf6628f97aeb57]::commands::generate::Generate>::run::<&std[bcb96dfbba0ab899]::path::PathBuf><unknown>
  1382. 248.36 s > at <unknown source file>:<unknown line>
  1383. 248.36 s > 21: <gammaloop_api[9ebf6628f97aeb57]::commands::Commands>::run<unknown>
  1384. 248.36 s > at <unknown source file>:<unknown line>
  1385. 248.36 s > 22: <gammaloop_api[9ebf6628f97aeb57]::session::CliSession>::execute_prepared<unknown>
  1386. 248.36 s > at <unknown source file>:<unknown line>
  1387. 248.36 s > 23: <gammaloop_api[9ebf6628f97aeb57]::session::CliSession>::execute_command<unknown>
  1388. 248.36 s > at <unknown source file>:<unknown line>
  1389. 248.36 s > 24: <gammaloop_integration_tests[191607b70c61cd5a]::CLIState>::run_command<unknown>
  1390. 248.36 s > at <unknown source file>:<unknown line>
  1391. 248.36 s > 25: test_runs[9b7e2dc2dc4f29b0]::aa_aa::generate_aa_aa_helicity_family<unknown>
  1392. 248.36 s > at <unknown source file>:<unknown line>
  1393. 248.36 s > 26: <test_runs[9b7e2dc2dc4f29b0]::aa_aa::important::aa_aa_local_inspect_backend_consistency::{closure#0} as core[940e698046960fd5]::ops::function::FnOnce<()>>::call_once<unknown>
  1394. 248.36 s > at <unknown source file>:<unknown line>
  1395. 248.36 s > 27: serial_test[cd99724524a2f1c0]::serial_code_lock::local_serial_core_with_return::<(), eyre[cb2fd339c0c40fca]::Report><unknown>
  1396. 248.36 s > at <unknown source file>:<unknown line>
  1397. 248.36 s > 28: <test_runs[9b7e2dc2dc4f29b0]::aa_aa::important::aa_aa_local_inspect_backend_consistency::{closure#0} as core[940e698046960fd5]::ops::function::FnOnce<()>>::call_once<unknown>
  1398. 248.36 s > at <unknown source file>:<unknown line>
  1399. 248.36 s > 29: test[75d6903177b1d7e9]::__rust_begin_short_backtrace::<core[940e698046960fd5]::result::Result<(), alloc[2ea6bcb46fca0c42]::string::String>, fn() -> core[940e698046960fd5]::result::Result<(), alloc[2ea6bcb46fca0c42]::string::String>><unknown>
  1400. 248.36 s > at <unknown source file>:<unknown line>
  1401. 248.36 s > 30: test[75d6903177b1d7e9]::run_test::{closure#0}<unknown>
  1402. 248.36 s > at <unknown source file>:<unknown line>
  1403. 248.36 s > 31: std[bcb96dfbba0ab899]::sys::backtrace::__rust_begin_short_backtrace::<test[75d6903177b1d7e9]::run_test::{closure#1}, ()><unknown>
  1404. 248.36 s > at <unknown source file>:<unknown line>
  1405. 248.36 s > 32: <std[bcb96dfbba0ab899]::thread::lifecycle::spawn_unchecked<test[75d6903177b1d7e9]::run_test::{closure#1}, ()>::{closure#1} as core[940e698046960fd5]::ops::function::FnOnce<()>>::call_once::{shim:vtable#0}<unknown>
  1406. 248.36 s > at <unknown source file>:<unknown line>
  1407. 248.36 s > 33: <std[bcb96dfbba0ab899]::sys::thread::unix::Thread>::new::thread_start<unknown>
  1408. 248.36 s > at <unknown source file>:<unknown line>
  1409. 248.36 s > 34: start_thread<unknown>
  1410. 248.36 s > at <unknown source file>:<unknown line>
  1411. 248.36 s > 35: __clone3<unknown>
  1412. 248.36 s > at <unknown source file>:<unknown line>
  1413. 248.36 s >
  1414. 248.36 s > Run with COLORBT_SHOW_HIDDEN=1 environment variable to disable frame filtering.
  1415. 248.36 s > Run with RUST_BACKTRACE=full to include source snippets.
  1416. 248.36 s > Warning: SpanTrace capture is Unsupported.
  1417. 248.36 s > Ensure that you've setup a tracing-error ErrorLayer and the semver versions are compatible
  1418. 248.36 s >
  1419. 248.36 s > FAIL [ 2.562s] (158/170) gammaloop-integration-tests::uv thermal_sunrise_uv
  1420. 248.36 s > stdout ---
  1421. 248.36 s >
  1422. 248.36 s > running 1 test
  1423. 248.36 s > test thermal_sunrise_uv ... FAILED
  1424. 248.36 s >
  1425. 248.36 s > failures:
  1426. 248.36 s >
  1427. 248.36 s > failures:
  1428. 248.36 s > thermal_sunrise_uv
  1429. 248.36 s >
  1430. 248.36 s > test result: FAILED. 0 passed; 1 failed; 0 ignored; 0 measured; 31 filtered out; finished in 2.55s
  1431. 248.36 s >
  1432. 248.36 s > stderr ---
  1433. 248.36 s > [2026-09-23 20:52:32.581] @gammaloop_api::se... INFO : Running command run generate
  1434. 248.36 s > [2026-09-23 20:52:32.581] @gammaloop_api::se... INFO : Starting command block generate
  1435. 248.36 s > [2026-09-23 20:52:32.581] @gammaloop_api::se... INFO : Running command import model sm-default.json
  1436. 248.36 s > [2026-09-23 20:52:32.581] @import::model INFO : Loading built-in JSON model sm-default
  1437. 248.36 s > [2026-09-23 20:52:32.628] @gammalooprs::model INFO : The following 15 external parameters were forced to zero by the restriction card:
  1438. 248.36 s > lamWS, AWS, rhoWS, etaWS, ymc, yme, ymm, MC, Me, MM, WTau, muQ, muLe, muLmu, muLtau
  1439. 248.36 s > [2026-09-23 20:52:32.628] @gammalooprs::model INFO : The following 34 vertex rules were removed by the restriction card:
  1440. 248.36 s > V_82 -> (c~, d, G+) | V_83 -> (t~, d, G+) | V_84 -> (c~, s, G+) | V_85 -> (t~, s, G+) | V_86 -> (u~, b, G+) | V_87 -> (c~, b, G+) | V_90 -> (c~, d, W+) | V_91 -> (t~, d, W+) | V_92 -> (u~, s, W+) | V_94 -> (t~, s, W+) | V_95 -> (u~, b, W+) | V_96 -> (c~, b, W+) | V_101 -> (e+, e-, G0) | V_102 -> (mu+, mu-, G0) | V_104 -> (e+, e-, H) | V_105 -> (mu+, mu-, H) | V_110 -> (ve~, e-, G+) | V_111 -> (vm~, mu-, G+) | V_116 -> (b~, u, G-) | V_117 -> (d~, c, G-) | V_118 -> (s~, c, G-) | V_119 -> (b~, c, G-) | V_120 -> (d~, t, G-) | V_121 -> (s~, t, G-) | V_124 -> (s~, u, W-) | V_125 -> (b~, u, W-) | V_126 -> (d~, c, W-) | V_128 -> (b~, c, W-) | V_129 -> (d~, t, W-) | V_130 -> (s~, t, W-) | V_138 -> (c~, c, G0) | V_140 -> (c~, c, H) | V_145 -> (e+, ve, G-) | V_146 -> (mu+, vm, G-)
  1441. 248.36 s > [2026-09-23 20:52:32.628] @gammalooprs::model INFO : The following 36 couplings were removed by the restriction card:
  1442. 248.37 s > GC_13, GC_14, GC_16, GC_17, GC_18, GC_19, GC_20, GC_22, GC_23, GC_24, GC_25, GC_26, GC_28, GC_29, GC_42, GC_43, GC_44, GC_46, GC_47, GC_48, GC_84, GC_85, GC_86, GC_87, GC_88, GC_89, GC_90, GC_91, GC_92, GC_93, GC_101, GC_102, GC_103, GC_105, GC_106, GC_107
  1443. 248.37 s > [2026-09-23 20:52:32.628] @gammaloop_api::se... INFO : Running command remove processes
  1444. 248.37 s > [2026-09-23 20:52:32.628] @gammaloop_api::se... INFO : Running command generate amp {} > {} [{2}] | g u
  1445. 248.37 s > --numerator-grouping group_identical_graphs_up_to_scalar_rescaling
  1446. 248.37 s > --max-n-bridges 0
  1447. 248.37 s > --number-of-factorized-loop-subtopologies 1 1
  1448. 248.37 s > --number-of-anticommutating-loops 1 1
  1449. 248.37 s > [...]
  1450. 248.37 s > [2026-09-23 20:52:32.629] @feyngen::diagram_... INFO : 0s | Δ=0s | Starting Feynman graph generation with Symbolica...
  1451. 248.37 s > [2026-09-23 20:52:32.630] @feyngen::diagram_... INFO : 0s | Δ=0s | Number of graphs resulting from Symbolica generation: 3
  1452. 248.37 s > [2026-09-23 20:52:32.630] @feyngen::diagram_... INFO : 0s | Δ=0s | Number of graphs retained after removal of vetoed topologies: 2
  1453. 248.37 s > [2026-09-23 20:52:32.630] @feyngen::diagram_... INFO : 0s | Δ=0s | Number of graphs after vertex info assignment: 2
  1454. 248.37 s > [2026-09-23 20:52:32.630] @feyngen::diagram_... INFO : 0s | Δ=0s | Number of graphs after all complete graphs filters are applied: 2
  1455. 248.37 s > [2026-09-23 20:52:32.630] @feyngen::diagram_... INFO : 0s | Δ=0s | Number of graphs after closed anticommutating chains analysis: 1
  1456. 248.37 s > [2026-09-23 20:52:32.630] @feyngen::diagram_... INFO : 0s | Δ=0s | Number of graphs after symmetrization of external states: 1
  1457. 248.37 s > [2026-09-23 20:52:32.630] @feyngen::diagram_... INFO : 0s | Δ=0s | Number of graphs after canonization of vertices, edges and flows (graph labels assigned here): 1
  1458. 248.37 s > [2026-09-23 20:52:32.642] @feyngen::diagram_... INFO : 0s | Δ=0s | Number of graphs after numerator-aware grouping with strategy 'up to a scalar rescaling': 1 (1 isomorphically unique graph, 0 color zero, 0 lorentz zero, 0 grouped and 0 cancellation)
  1459. 248.37 s > [2026-09-23 20:52:32.642] @feyngen::diagram_... INFO : ( Sum of the symmetry factors from each graph generated = -1/2 )
  1460. 248.37 s > [2026-09-23 20:52:32.642] @commands::generate INFO : Generated amplitude 1 graphs.
  1461. 248.37 s > [2026-09-23 20:52:32.642] @commands::generate INFO : Only diagram generation was requested, skipping integrand generation. You can generate integrands later using the 'generate existing <options>' command.
  1462. 248.37 s > [2026-09-23 20:52:32.642] @gammaloop_api::se... INFO : Running command generate
  1463. 248.37 s > The application panicked (crashed).
  1464. 248.37 s > Message: label _func_power_ not found
  1465. 248.37 s > Location: /nix/store/n9w914kh1cm59xx3spcs831cdyb56m32-vendor-cargo-deps/c19b7c6f923b580ac259164a89f2577984ad5ab09ee9d583b888f934adbbe8d0/symjit-2.25.6/src/symjit/assembler.rs:77
  1466. 248.37 s >
  1467. 248.37 s > ━━━━━━━━━━━━━━━━━━━━━━━━━━━━━━━━━━ BACKTRACE ━━━━━━━━━━━━━━━━━━━━━━━━━━━━━━━━━━━
  1468. 248.37 s > 1: <color_eyre[51793ea62743adbd]::config::PanicHook>::panic_report<unknown>
  1469. 248.37 s > at <unknown source file>:<unknown line>
  1470. 248.37 s > 2: <color_eyre[51793ea62743adbd]::config::PanicHook>::into_panic_hook::{closure#0}<unknown>
  1471. 248.37 s > at <unknown source file>:<unknown line>
  1472. 248.37 s > 3: std[bcb96dfbba0ab899]::panicking::panic_with_hook<unknown>
  1473. 248.37 s > at <unknown source file>:<unknown line>
  1474. 248.37 s > 4: std[bcb96dfbba0ab899]::panicking::panic_handler::{closure#0}<unknown>
  1475. 248.37 s > at <unknown source file>:<unknown line>
  1476. 248.37 s > 5: std[bcb96dfbba0ab899]::sys::backtrace::__rust_end_short_backtrace::<std[bcb96dfbba0ab899]::panicking::panic_handler::{closure#0}, !><unknown>
  1477. 248.37 s > at <unknown source file>:<unknown line>
  1478. 248.37 s > 6: __rustc[6c289b9f9c454d21]::rust_begin_unwind<unknown>
  1479. 248.37 s > at <unknown source file>:<unknown line>
  1480. 248.37 s > 7: core[940e698046960fd5]::panicking::panic_fmt<unknown>
  1481. 248.37 s > at <unknown source file>:<unknown line>
  1482. 248.37 s > 8: <symjit[e408de789c333cd]::symjit::assembler::Assembler>::apply_jumps<unknown>
  1483. 248.37 s > at <unknown source file>:<unknown line>
  1484. 248.37 s > 9: <symjit[e408de789c333cd]::symjit::builder::Builder>::compile_from_mir::<symjit[e408de789c333cd]::symjit::amd::complex::AmdComplexGenerator><unknown>
  1485. 248.37 s > at <unknown source file>:<unknown line>
  1486. 248.37 s > 10: <symjit[e408de789c333cd]::symjit::runnable::Application>::compile_ty<unknown>
  1487. 248.37 s > at <unknown source file>:<unknown line>
  1488. 248.37 s > 11: <symjit[e408de789c333cd]::symjit::runnable::Application>::with_mir<unknown>
  1489. 248.37 s > at <unknown source file>:<unknown line>
  1490. 248.37 s > 12: <symjit[e408de789c333cd]::symjit::composer::DirectTranslator as symjit[e408de789c333cd]::symjit::composer::Composer>::compile<unknown>
  1491. 248.37 s > at <unknown source file>:<unknown line>
  1492. 248.37 s > 13: <symjit[e408de789c333cd]::symjit::compiler::Translator as symjit[e408de789c333cd]::symjit::composer::Composer>::compile<unknown>
  1493. 248.37 s > at <unknown source file>:<unknown line>
  1494. 248.37 s > 14: <numerica[124dab8567f4861e]::domains::float::complex::Complex<f64> as symbolica[10e259bab675d243]::evaluate::backend::JITCompiledNumber>::jit_compile<unknown>
  1495. 248.37 s > at <unknown source file>:<unknown line>
  1496. 248.37 s > 15: <gammalooprs[917cbd3df9e68f8f]::integrands::process::evaluators::GenericEvaluator>::activate_symjit<unknown>
  1497. 248.37 s > at <unknown source file>:<unknown line>
  1498. 248.37 s > 16: <gammalooprs[917cbd3df9e68f8f]::integrands::process::amplitude::AmplitudeIntegrand>::prepare_runtime_backends_after_generation_with_compile_times<unknown>
  1499. 248.37 s > at <unknown source file>:<unknown line>
  1500. 248.37 s > 17: <gammalooprs[917cbd3df9e68f8f]::processes::amplitude::Amplitude>::build_integrand<unknown>
  1501. 248.37 s > at <unknown source file>:<unknown line>
  1502. 248.37 s > 18: <gammalooprs[917cbd3df9e68f8f]::processes::process::Process>::generate_integrands<unknown>
  1503. 248.37 s > at <unknown source file>:<unknown line>
  1504. 248.37 s > 19: <gammalooprs[917cbd3df9e68f8f]::processes::ProcessList>::generate_integrands<unknown>
  1505. 248.37 s > at <unknown source file>:<unknown line>
  1506. 248.37 s > 20: <gammaloop_api[9ebf6628f97aeb57]::state::State>::generate_integrands<unknown>
  1507. 248.37 s > at <unknown source file>:<unknown line>
  1508. 248.37 s > 21: <gammaloop_api[9ebf6628f97aeb57]::commands::generate::Generate>::run::<&std[bcb96dfbba0ab899]::path::PathBuf><unknown>
  1509. 248.37 s > at <unknown source file>:<unknown line>
  1510. 248.37 s > 22: <gammaloop_api[9ebf6628f97aeb57]::commands::Commands>::run<unknown>
  1511. 248.37 s > at <unknown source file>:<unknown line>
  1512. 248.37 s > 23: <gammaloop_api[9ebf6628f97aeb57]::session::CliSession>::execute_prepared<unknown>
  1513. 248.37 s > at <unknown source file>:<unknown line>
  1514. 248.37 s > 24: <gammaloop_api[9ebf6628f97aeb57]::session::CliSession>::execute_prepared_commands<unknown>
  1515. 248.37 s > at <unknown source file>:<unknown line>
  1516. 248.37 s > 25: <gammaloop_api[9ebf6628f97aeb57]::session::CliSession>::execute_prepared<unknown>
  1517. 248.37 s > at <unknown source file>:<unknown line>
  1518. 248.37 s > 26: <gammaloop_api[9ebf6628f97aeb57]::session::CliSession>::execute_command<unknown>
  1519. 248.37 s > at <unknown source file>:<unknown line>
  1520. 248.37 s > 27: <gammaloop_integration_tests[191607b70c61cd5a]::CLIState>::run_command<unknown>
  1521. 248.37 s > at <unknown source file>:<unknown line>
  1522. 248.37 s > 28: uv[3c7454ef256d6487]::run_single_integrated_uv_case<unknown>
  1523. 248.37 s > at <unknown source file>:<unknown line>
  1524. 248.37 s > 29: <uv[3c7454ef256d6487]::thermal_sunrise_uv::{closure#0} as core[940e698046960fd5]::ops::function::FnOnce<()>>::call_once<unknown>
  1525. 248.37 s > at <unknown source file>:<unknown line>
  1526. 248.37 s > 30: test[75d6903177b1d7e9]::__rust_begin_short_backtrace::<core[940e698046960fd5]::result::Result<(), alloc[2ea6bcb46fca0c42]::string::String>, fn() -> core[940e698046960fd5]::result::Result<(), alloc[2ea6bcb46fca0c42]::string::String>><unknown>
  1527. 248.37 s > at <unknown source file>:<unknown line>
  1528. 248.37 s > 31: test[75d6903177b1d7e9]::run_test::{closure#0}<unknown>
  1529. 248.37 s > at <unknown source file>:<unknown line>
  1530. 248.37 s > 32: std[bcb96dfbba0ab899]::sys::backtrace::__rust_begin_short_backtrace::<test[75d6903177b1d7e9]::run_test::{closure#1}, ()><unknown>
  1531. 248.37 s > at <unknown source file>:<unknown line>
  1532. 248.37 s > 33: <std[bcb96dfbba0ab899]::thread::lifecycle::spawn_unchecked<test[75d6903177b1d7e9]::run_test::{closure#1}, ()>::{closure#1} as core[940e698046960fd5]::ops::function::FnOnce<()>>::call_once::{shim:vtable#0}<unknown>
  1533. 248.37 s > at <unknown source file>:<unknown line>
  1534. 248.37 s > 34: <std[bcb96dfbba0ab899]::sys::thread::unix::Thread>::new::thread_start<unknown>
  1535. 248.37 s > at <unknown source file>:<unknown line>
  1536. 248.37 s > 35: start_thread<unknown>
  1537. 248.37 s > at <unknown source file>:<unknown line>
  1538. 248.37 s > 36: __clone3<unknown>
  1539. 248.37 s > at <unknown source file>:<unknown line>
  1540. 248.37 s >
  1541. 248.37 s > Run with COLORBT_SHOW_HIDDEN=1 environment variable to disable frame filtering.
  1542. 248.37 s > Run with RUST_BACKTRACE=full to include source snippets.
  1543. 248.37 s > Warning: SpanTrace capture is Unsupported.
  1544. 248.37 s > Ensure that you've setup a tracing-error ErrorLayer and the semver versions are compatible
  1545. 248.37 s >
  1546. 248.37 s > error: test run failed
  1547. 248.37 s >
  1548. 248.37 s > ========== nextest test summary ==========
  1549. 248.37 s > report: target/nextest/ci_gammaloop/junit.xml
  1550. 248.37 s > tests: 170, failures: 2, errors: 0
  1551. 248.37 s >
  1552. 248.37 s > 1. gammaloop-integration-tests::test_runs::aa_aa::important::aa_aa_local_inspect_backend_consistency
  1553. 248.37 s > failure: test failure with exit code 101
  1554. 248.37 s > system-out
  1555. 248.37 s > running 1 test
  1556. 248.37 s > test aa_aa::important::aa_aa_local_inspect_backend_consistency ... FAILED
  1557. 248.37 s >
  1558. 248.37 s > failures:
  1559. 248.37 s >
  1560. 248.37 s > failures:
  1561. 248.37 s > aa_aa::important::aa_aa_local_inspect_backend_consistency
  1562. 248.37 s >
  1563. 248.37 s > test result: FAILED. 0 passed; 1 failed; 0 ignored; 0 measured; 274 filtered out; finished in 2.88s
  1564. 248.37 s > system-err
  1565. 248.37 s > [2026-09-23 20:51:50.374] @gammaloop_api::se... INFO : Running command import model sm-default.json
  1566. 248.37 s > [2026-09-23 20:51:50.374] @import::model INFO : Loading built-in JSON model sm-default
  1567. 248.37 s > [2026-09-23 20:51:50.396] @gammalooprs::model INFO : The following 15 external parameters were forced to zero by the restriction card:
  1568. 248.37 s > lamWS, AWS, rhoWS, etaWS, ymc, yme, ymm, MC, Me, MM, WTau, muQ, muLe, muLmu, muLtau
  1569. 248.37 s > [2026-09-23 20:51:50.396] @gammalooprs::model INFO : The following 34 vertex rules were removed by the restriction card:
  1570. 248.37 s > V_82 -> (c~, d, G+) | V_83 -> (t~, d, G+) | V_84 -> (c~, s, G+) | V_85 -> (t~, s, G+) | V_86 -> (u~, b, G+) | V_87 -> (c~, b, G+) | V_90 -> (c~, d, W+) | V_91 -> (t~, d, W+) | V_92 -> (u~, s, W+) | V_94 -> (t~, s, W+) | V_95 -> (u~, b, W+) | V_96 -> (c~, b, W+) | V_101 -> (e+, e-, G0) | V_102 -> (mu+, mu-, G0) | V_104 -> (e+, e-, H) | V_105 -> (mu+, mu-, H) | V_110 -> (ve~, e-, G+) | V_111 -> (vm~, mu-, G+) | V_116 -> (b~, u, G-) | V_117 -> (d~, c, G-) | V_118 -> (s~, c, G-) | V_119 -> (b~, c, G-) | V_120 -> (d~, t, G-) | V_121 -> (s~, t, G-) | V_124 -> (s~, u, W-) | V_125 -> (b~, u, W-) | V_126 -> (d~, c, W-) | V_128 -> (b~, c, W-) | V_129 -> (d~, t, W-) | V_130 -> (s~, t, W-) | V_138 -> (c~, c, G0) | V_140 -> (c~, c, H) | V_145 -> (e+, ve, G-) | V_146 -> (mu+, vm, G-)
  1571. 248.37 s > [2026-09-23 20:51:50.396] @gammalooprs::model INFO : The following 36 couplings were removed by the restriction card:
  1572. 248.37 s > GC_13, GC_14, GC_16, GC_17, GC_18, GC_19, GC_20, GC_22, GC_23, GC_24, GC_25, GC_26, GC_28, GC_29, GC_42, GC_43, GC_44, GC_46, GC_47, GC_48, GC_84, GC_85, GC_86, GC_87, GC_88, GC_89, GC_90, GC_91, GC_92, GC_93, GC_101, GC_102, GC_103, GC_105, GC_106, GC_107
  1573. 248.37 s > [2026-09-23 20:51:50.396] @gammaloop_api::se... INFO : Running command run set_model_parameters
  1574. 248.37 s > [2026-09-23 20:51:50.396] @gammaloop_api::se... INFO : Starting command block set_model_parameters
  1575. 248.37 s > [2026-09-23 20:51:50.397] @gammaloop_api::se... INFO : Running command set model MT=173.0
  1576. 248.37 s > [2026-09-23 20:51:50.401] @gammaloop_api::se... INFO : Running command set model WT=0.0
  1577. 248.37 s > [2026-09-23 20:51:50.405] @gammaloop_api::se... INFO : Running command set model ymt=173.0
  1578. 248.37 s > [2026-09-23 20:51:50.410] @gammaloop_api::se... INFO : Running command set model aS=0.118
  1579. 248.37 s > [2026-09-23 20:51:50.414] @gammaloop_api::se... INFO : Running command set model aEWM1=137.036
  1580. 248.37 s > [2026-09-23 20:51:50.419] @gammaloop_api::se... INFO : Running command set model Gf=1.166390e-05
  1581. 248.37 s > [2026-09-23 20:51:50.423] @gammaloop_api::se... INFO : Running command set model MZ=91.188
  1582. 248.37 s > [2026-09-23 20:51:50.428] @gammaloop_api::se... INFO : Running command set global string '
  1583. 248.37 s > [global.generation.compile]
  1584. 248.37 s > compilation_mode = "symjit"
  1585. 248.37 s > optimization_level = "O0"
  1586. 248.37 s > fast_math = false
  1587. 248.37 s > [...]
  1588. 248.37 s > [2026-09-23 20:51:50.428] @gammaloop_api::se... INFO : Running command import graphs ./examples/cli/aa_aa/1L/aa_aa_1L.dot -p aa_aa_all_helicities -i 1L_ppmm -o
  1589. 248.37 s > [2026-09-23 20:51:50.429] @commands::import INFO : Loading graphs from '/build/source/examples/cli/aa_aa/1L/aa_aa_1L.dot'
  1590. 248.37 s > [2026-09-23 20:51:50.437] @gammaloop_api::se... INFO : Running command generate existing -p aa_aa_all_helicities
  1591. 248.37 s > The application panicked (crashed).
  1592. 248.37 s > Message: label _func_power_ not found
  1593. 248.37 s > Location: /nix/store/n9w914kh1cm59xx3spcs831cdyb56m32-vendor-cargo-deps/c19b7c6f923b580ac259164a89f2577984ad5ab09ee9d583b888f934adbbe8d0/symjit-2.25.6/src/symjit/assembler.rs:77
  1594. 248.37 s >
  1595. 248.37 s > ━━━━━━━━━━━━━━━━━━━━━━━━━━━━━━━━━━ BACKTRACE ━━━━━━━━━━━━━━━━━━━━━━━━━━━━━━━━━━━
  1596. 248.37 s > 1: <color_eyre[51793ea62743adbd]::config::PanicHook>::panic_report<unknown>
  1597. 248.37 s > at <unknown source file>:<unknown line>
  1598. 248.37 s > 2: <color_eyre[51793ea62743adbd]::config::PanicHook>::into_panic_hook::{closure#0}<unknown>
  1599. 248.37 s > at <unknown source file>:<unknown line>
  1600. 248.37 s > 3: std[bcb96dfbba0ab899]::panicking::panic_with_hook<unknown>
  1601. 248.37 s > at <unknown source file>:<unknown line>
  1602. 248.37 s > 4: std[bcb96dfbba0ab899]::panicking::panic_handler::{closure#0}<unknown>
  1603. 248.37 s > at <unknown source file>:<unknown line>
  1604. 248.37 s > 5: std[bcb96dfbba0ab899]::sys::backtrace::__rust_end_short_backtrace::<std[bcb96dfbba0ab899]::panicking::panic_handler::{closure#0}, !><unknown>
  1605. 248.37 s > at <unknown source file>:<unknown line>
  1606. 248.37 s > 6: __rustc[6c289b9f9c454d21]::rust_begin_unwind<unknown>
  1607. 248.37 s > at <unknown source file>:<unknown line>
  1608. 248.37 s > 7: core[940e698046960fd5]::panicking::panic_fmt<unknown>
  1609. 248.37 s > at <unknown source file>:<unknown line>
  1610. 248.37 s > 8: <symjit[e408de789c333cd]::symjit::assembler::Assembler>::apply_jumps<unknown>
  1611. 248.37 s > at <unknown source file>:<unknown line>
  1612. 248.37 s > 9: <symjit[e408de789c333cd]::symjit::builder::Builder>::compile_from_mir::<symjit[e408de789c333cd]::symjit::amd::complex::AmdComplexGenerator><unknown>
  1613. 248.37 s > at <unknown source file>:<unknown line>
  1614. 248.37 s > 10: <symjit[e408de789c333cd]::symjit::runnable::Application>::compile_ty<unknown>
  1615. 248.37 s > at <unknown source file>:<unknown line>
  1616. 248.37 s > 11: <symjit[e408de789c333cd]::symjit::runnable::Application>::with_mir<unknown>
  1617. 248.37 s > at <unknown source file>:<unknown line>
  1618. 248.37 s > 12: <symjit[e408de789c333cd]::symjit::composer::DirectTranslator as symjit[e408de789c333cd]::symjit::composer::Composer>::compile<unknown>
  1619. 248.37 s > at <unknown source file>:<unknown line>
  1620. 248.37 s > 13: <symjit[e408de789c333cd]::symjit::compiler::Translator as symjit[e408de789c333cd]::symjit::composer::Composer>::compile<unknown>
  1621. 248.37 s > at <unknown source file>:<unknown line>
  1622. 248.37 s > 14: <numerica[124dab8567f4861e]::domains::float::complex::Complex<f64> as symbolica[10e259bab675d243]::evaluate::backend::JITCompiledNumber>::jit_compile<unknown>
  1623. 248.37 s > at <unknown source file>:<unknown line>
  1624. 248.37 s > 15: <gammalooprs[917cbd3df9e68f8f]::integrands::process::evaluators::GenericEvaluator>::activate_symjit<unknown>
  1625. 248.37 s > at <unknown source file>:<unknown line>
  1626. 248.37 s > 16: <gammalooprs[917cbd3df9e68f8f]::integrands::process::amplitude::AmplitudeIntegrand>::prepare_runtime_backends_after_generation_with_compile_times<unknown>
  1627. 248.37 s > at <unknown source file>:<unknown line>
  1628. 248.37 s > 17: <gammalooprs[917cbd3df9e68f8f]::processes::amplitude::Amplitude>::build_integrand<unknown>
  1629. 248.37 s > at <unknown source file>:<unknown line>
  1630. 248.37 s > 18: <gammalooprs[917cbd3df9e68f8f]::processes::process::Process>::generate_integrands<unknown>
  1631. 248.37 s > at <unknown source file>:<unknown line>
  1632. 248.37 s > 19: <gammaloop_api[9ebf6628f97aeb57]::state::State>::generate_integrand<unknown>
  1633. 248.37 s > at <unknown source file>:<unknown line>
  1634. 248.37 s > 20: <gammaloop_api[9ebf6628f97aeb57]::commands::generate::Generate>::run::<&std[bcb96dfbba0ab899]::path::PathBuf><unknown>
  1635. 248.37 s > at <unknown source file>:<unknown line>
  1636. 248.37 s > 21: <gammaloop_api[9ebf6628f97aeb57]::commands::Commands>::run<unknown>
  1637. 248.37 s > at <unknown source file>:<unknown line>
  1638. 248.37 s > 22: <gammaloop_api[9ebf6628f97aeb57]::session::CliSession>::execute_prepared<unknown>
  1639. 248.37 s > at <unknown source file>:<unknown line>
  1640. 248.37 s > 23: <gammaloop_api[9ebf6628f97aeb57]::session::CliSession>::execute_command<unknown>
  1641. 248.37 s > at <unknown source file>:<unknown line>
  1642. 248.37 s > 24: <gammaloop_integration_tests[191607b70c61cd5a]::CLIState>::run_command<unknown>
  1643. 248.37 s > at <unknown source file>:<unknown line>
  1644. 248.37 s > 25: test_runs[9b7e2dc2dc4f29b0]::aa_aa::generate_aa_aa_helicity_family<unknown>
  1645. 248.37 s > at <unknown source file>:<unknown line>
  1646. 248.37 s > 26: <test_runs[9b7e2dc2dc4f29b0]::aa_aa::important::aa_aa_local_inspect_backend_consistency::{closure#0} as core[940e698046960fd5]::ops::function::FnOnce<()>>::call_once<unknown>
  1647. 248.37 s > at <unknown source file>:<unknown line>
  1648. 248.37 s > 27: serial_test[cd99724524a2f1c0]::serial_code_lock::local_serial_core_with_return::<(), eyre[cb2fd339c0c40fca]::Report><unknown>
  1649. 248.37 s > at <unknown source file>:<unknown line>
  1650. 248.37 s > 28: <test_runs[9b7e2dc2dc4f29b0]::aa_aa::important::aa_aa_local_inspect_backend_consistency::{closure#0} as core[940e698046960fd5]::ops::function::FnOnce<()>>::call_once<unknown>
  1651. 248.37 s > at <unknown source file>:<unknown line>
  1652. 248.37 s > 29: test[75d6903177b1d7e9]::__rust_begin_short_backtrace::<core[940e698046960fd5]::result::Result<(), alloc[2ea6bcb46fca0c42]::string::String>, fn() -> core[940e698046960fd5]::result::Result<(), alloc[2ea6bcb46fca0c42]::string::String>><unknown>
  1653. 248.37 s > at <unknown source file>:<unknown line>
  1654. 248.37 s > 30: test[75d6903177b1d7e9]::run_test::{closure#0}<unknown>
  1655. 248.37 s > at <unknown source file>:<unknown line>
  1656. 248.37 s > 31: std[bcb96dfbba0ab899]::sys::backtrace::__rust_begin_short_backtrace::<test[75d6903177b1d7e9]::run_test::{closure#1}, ()><unknown>
  1657. 248.37 s > at <unknown source file>:<unknown line>
  1658. 248.37 s > 32: <std[bcb96dfbba0ab899]::thread::lifecycle::spawn_unchecked<test[75d6903177b1d7e9]::run_test::{closure#1}, ()>::{closure#1} as core[940e698046960fd5]::ops::function::FnOnce<()>>::call_once::{shim:vtable#0}<unknown>
  1659. 248.37 s > at <unknown source file>:<unknown line>
  1660. 248.37 s > 33: <std[bcb96dfbba0ab899]::sys::thread::unix::Thread>::new::thread_start<unknown>
  1661. 248.37 s > at <unknown source file>:<unknown line>
  1662. 248.37 s > 34: start_thread<unknown>
  1663. 248.37 s > at <unknown source file>:<unknown line>
  1664. 248.37 s > 35: __clone3<unknown>
  1665. 248.37 s > at <unknown source file>:<unknown line>
  1666. 248.37 s >
  1667. 248.37 s > Run with COLORBT_SHOW_HIDDEN=1 environment variable to disable frame filtering.
  1668. 248.37 s > Run with RUST_BACKTRACE=full to include source snippets.
  1669. 248.37 s > Warning: SpanTrace capture is Unsupported.
  1670. 248.37 s > Ensure that you've setup a tracing-error ErrorLayer and the semver versions are compatible
  1671. 248.37 s >
  1672. 248.37 s > 2. gammaloop-integration-tests::uv::thermal_sunrise_uv
  1673. 248.37 s > failure: test failure with exit code 101
  1674. 248.37 s > system-out
  1675. 248.37 s > running 1 test
  1676. 248.37 s > test thermal_sunrise_uv ... FAILED
  1677. 248.37 s >
  1678. 248.37 s > failures:
  1679. 248.37 s >
  1680. 248.37 s > failures:
  1681. 248.37 s > thermal_sunrise_uv
  1682. 248.37 s >
  1683. 248.37 s > test result: FAILED. 0 passed; 1 failed; 0 ignored; 0 measured; 31 filtered out; finished in 2.55s
  1684. 248.37 s > system-err
  1685. 248.37 s > [2026-09-23 20:52:32.581] @gammaloop_api::se... INFO : Running command run generate
  1686. 248.37 s > [2026-09-23 20:52:32.581] @gammaloop_api::se... INFO : Starting command block generate
  1687. 248.37 s > [2026-09-23 20:52:32.581] @gammaloop_api::se... INFO : Running command import model sm-default.json
  1688. 248.37 s > [2026-09-23 20:52:32.581] @import::model INFO : Loading built-in JSON model sm-default
  1689. 248.37 s > [2026-09-23 20:52:32.628] @gammalooprs::model INFO : The following 15 external parameters were forced to zero by the restriction card:
  1690. 248.37 s > lamWS, AWS, rhoWS, etaWS, ymc, yme, ymm, MC, Me, MM, WTau, muQ, muLe, muLmu, muLtau
  1691. 248.37 s > [2026-09-23 20:52:32.628] @gammalooprs::model INFO : The following 34 vertex rules were removed by the restriction card:
  1692. 248.37 s > V_82 -> (c~, d, G+) | V_83 -> (t~, d, G+) | V_84 -> (c~, s, G+) | V_85 -> (t~, s, G+) | V_86 -> (u~, b, G+) | V_87 -> (c~, b, G+) | V_90 -> (c~, d, W+) | V_91 -> (t~, d, W+) | V_92 -> (u~, s, W+) | V_94 -> (t~, s, W+) | V_95 -> (u~, b, W+) | V_96 -> (c~, b, W+) | V_101 -> (e+, e-, G0) | V_102 -> (mu+, mu-, G0) | V_104 -> (e+, e-, H) | V_105 -> (mu+, mu-, H) | V_110 -> (ve~, e-, G+) | V_111 -> (vm~, mu-, G+) | V_116 -> (b~, u, G-) | V_117 -> (d~, c, G-) | V_118 -> (s~, c, G-) | V_119 -> (b~, c, G-) | V_120 -> (d~, t, G-) | V_121 -> (s~, t, G-) | V_124 -> (s~, u, W-) | V_125 -> (b~, u, W-) | V_126 -> (d~, c, W-) | V_128 -> (b~, c, W-) | V_129 -> (d~, t, W-) | V_130 -> (s~, t, W-) | V_138 -> (c~, c, G0) | V_140 -> (c~, c, H) | V_145 -> (e+, ve, G-) | V_146 -> (mu+, vm, G-)
  1693. 248.37 s > [2026-09-23 20:52:32.628] @gammalooprs::model INFO : The following 36 couplings were removed by the restriction card:
  1694. 248.37 s > GC_13, GC_14, GC_16, GC_17, GC_18, GC_19, GC_20, GC_22, GC_23, GC_24, GC_25, GC_26, GC_28, GC_29, GC_42, GC_43, GC_44, GC_46, GC_47, GC_48, GC_84, GC_85, GC_86, GC_87, GC_88, GC_89, GC_90, GC_91, GC_92, GC_93, GC_101, GC_102, GC_103, GC_105, GC_106, GC_107
  1695. 248.37 s > [2026-09-23 20:52:32.628] @gammaloop_api::se... INFO : Running command remove processes
  1696. 248.37 s > [2026-09-23 20:52:32.628] @gammaloop_api::se... INFO : Running command generate amp {} > {} [{2}] | g u
  1697. 248.37 s > --numerator-grouping group_identical_graphs_up_to_scalar_rescaling
  1698. 248.37 s > --max-n-bridges 0
  1699. 248.37 s > --number-of-factorized-loop-subtopologies 1 1
  1700. 248.37 s > --number-of-anticommutating-loops 1 1
  1701. 248.37 s > [...]
  1702. 248.37 s > [2026-09-23 20:52:32.629] @feyngen::diagram_... INFO : 0s | Δ=0s | Starting Feynman graph generation with Symbolica...
  1703. 248.37 s > [2026-09-23 20:52:32.630] @feyngen::diagram_... INFO : 0s | Δ=0s | Number of graphs resulting from Symbolica generation: 3
  1704. 248.37 s > [2026-09-23 20:52:32.630] @feyngen::diagram_... INFO : 0s | Δ=0s | Number of graphs retained after removal of vetoed topologies: 2
  1705. 248.37 s > [2026-09-23 20:52:32.630] @feyngen::diagram_... INFO : 0s | Δ=0s | Number of graphs after vertex info assignment: 2
  1706. 248.37 s > [2026-09-23 20:52:32.630] @feyngen::diagram_... INFO : 0s | Δ=0s | Number of graphs after all complete graphs filters are applied: 2
  1707. 248.37 s > [2026-09-23 20:52:32.630] @feyngen::diagram_... INFO : 0s | Δ=0s | Number of graphs after closed anticommutating chains analysis: 1
  1708. 248.37 s > [2026-09-23 20:52:32.630] @feyngen::diagram_... INFO : 0s | Δ=0s | Number of graphs after symmetrization of external states: 1
  1709. 248.37 s > [2026-09-23 20:52:32.630] @feyngen::diagram_... INFO : 0s | Δ=0s | Number of graphs after canonization of vertices, edges and flows (graph labels assigned here): 1
  1710. 248.37 s > [2026-09-23 20:52:32.642] @feyngen::diagram_... INFO : 0s | Δ=0s | Number of graphs after numerator-aware grouping with strategy 'up to a scalar rescaling': 1 (1 isomorphically unique graph, 0 color zero, 0 lorentz zero, 0 grouped and 0 cancellation)
  1711. 248.37 s > [2026-09-23 20:52:32.642] @feyngen::diagram_... INFO : ( Sum of the symmetry factors from each graph generated = -1/2 )
  1712. 248.37 s > [2026-09-23 20:52:32.642] @commands::generate INFO : Generated amplitude 1 graphs.
  1713. 248.37 s > [2026-09-23 20:52:32.642] @commands::generate INFO : Only diagram generation was requested, skipping integrand generation. You can generate integrands later using the 'generate existing <options>' command.
  1714. 248.37 s > [2026-09-23 20:52:32.642] @gammaloop_api::se... INFO : Running command generate
  1715. 248.37 s > The application panicked (crashed).
  1716. 248.37 s > Message: label _func_power_ not found
  1717. 248.37 s > Location: /nix/store/n9w914kh1cm59xx3spcs831cdyb56m32-vendor-cargo-deps/c19b7c6f923b580ac259164a89f2577984ad5ab09ee9d583b888f934adbbe8d0/symjit-2.25.6/src/symjit/assembler.rs:77
  1718. 248.37 s >
  1719. 248.37 s > ━━━━━━━━━━━━━━━━━━━━━━━━━━━━━━━━━━ BACKTRACE ━━━━━━━━━━━━━━━━━━━━━━━━━━━━━━━━━━━
  1720. 248.37 s > 1: <color_eyre[51793ea62743adbd]::config::PanicHook>::panic_report<unknown>
  1721. 248.37 s > at <unknown source file>:<unknown line>
  1722. 248.37 s > 2: <color_eyre[51793ea62743adbd]::config::PanicHook>::into_panic_hook::{closure#0}<unknown>
  1723. 248.37 s > at <unknown source file>:<unknown line>
  1724. 248.37 s > 3: std[bcb96dfbba0ab899]::panicking::panic_with_hook<unknown>
  1725. 248.37 s > at <unknown source file>:<unknown line>
  1726. 248.37 s > 4: std[bcb96dfbba0ab899]::panicking::panic_handler::{closure#0}<unknown>
  1727. 248.37 s > at <unknown source file>:<unknown line>
  1728. 248.37 s > 5: std[bcb96dfbba0ab899]::sys::backtrace::__rust_end_short_backtrace::<std[bcb96dfbba0ab899]::panicking::panic_handler::{closure#0}, !><unknown>
  1729. 248.37 s > at <unknown source file>:<unknown line>
  1730. 248.37 s > 6: __rustc[6c289b9f9c454d21]::rust_begin_unwind<unknown>
  1731. 248.37 s > at <unknown source file>:<unknown line>
  1732. 248.37 s > 7: core[940e698046960fd5]::panicking::panic_fmt<unknown>
  1733. 248.37 s > at <unknown source file>:<unknown line>
  1734. 248.37 s > 8: <symjit[e408de789c333cd]::symjit::assembler::Assembler>::apply_jumps<unknown>
  1735. 248.37 s > at <unknown source file>:<unknown line>
  1736. 248.37 s > 9: <symjit[e408de789c333cd]::symjit::builder::Builder>::compile_from_mir::<symjit[e408de789c333cd]::symjit::amd::complex::AmdComplexGenerator><unknown>
  1737. 248.37 s > at <unknown source file>:<unknown line>
  1738. 248.37 s > 10: <symjit[e408de789c333cd]::symjit::runnable::Application>::compile_ty<unknown>
  1739. 248.37 s > at <unknown source file>:<unknown line>
  1740. 248.37 s > 11: <symjit[e408de789c333cd]::symjit::runnable::Application>::with_mir<unknown>
  1741. 248.37 s > at <unknown source file>:<unknown line>
  1742. 248.37 s > 12: <symjit[e408de789c333cd]::symjit::composer::DirectTranslator as symjit[e408de789c333cd]::symjit::composer::Composer>::compile<unknown>
  1743. 248.37 s > at <unknown source file>:<unknown line>
  1744. 248.37 s > 13: <symjit[e408de789c333cd]::symjit::compiler::Translator as symjit[e408de789c333cd]::symjit::composer::Composer>::compile<unknown>
  1745. 248.37 s > at <unknown source file>:<unknown line>
  1746. 248.37 s > 14: <numerica[124dab8567f4861e]::domains::float::complex::Complex<f64> as symbolica[10e259bab675d243]::evaluate::backend::JITCompiledNumber>::jit_compile<unknown>
  1747. 248.37 s > at <unknown source file>:<unknown line>
  1748. 248.37 s > 15: <gammalooprs[917cbd3df9e68f8f]::integrands::process::evaluators::GenericEvaluator>::activate_symjit<unknown>
  1749. 248.37 s > at <unknown source file>:<unknown line>
  1750. 248.37 s > 16: <gammalooprs[917cbd3df9e68f8f]::integrands::process::amplitude::AmplitudeIntegrand>::prepare_runtime_backends_after_generation_with_compile_times<unknown>
  1751. 248.37 s > at <unknown source file>:<unknown line>
  1752. 248.37 s > 17: <gammalooprs[917cbd3df9e68f8f]::processes::amplitude::Amplitude>::build_integrand<unknown>
  1753. 248.37 s > at <unknown source file>:<unknown line>
  1754. 248.37 s > 18: <gammalooprs[917cbd3df9e68f8f]::processes::process::Process>::generate_integrands<unknown>
  1755. 248.37 s > at <unknown source file>:<unknown line>
  1756. 248.37 s > 19: <gammalooprs[917cbd3df9e68f8f]::processes::ProcessList>::generate_integrands<unknown>
  1757. 248.37 s > at <unknown source file>:<unknown line>
  1758. 248.37 s > 20: <gammaloop_api[9ebf6628f97aeb57]::state::State>::generate_integrands<unknown>
  1759. 248.37 s > at <unknown source file>:<unknown line>
  1760. 248.37 s > 21: <gammaloop_api[9ebf6628f97aeb57]::commands::generate::Generate>::run::<&std[bcb96dfbba0ab899]::path::PathBuf><unknown>
  1761. 248.37 s > at <unknown source file>:<unknown line>
  1762. 248.37 s > 22: <gammaloop_api[9ebf6628f97aeb57]::commands::Commands>::run<unknown>
  1763. 248.37 s > at <unknown source file>:<unknown line>
  1764. 248.37 s > 23: <gammaloop_api[9ebf6628f97aeb57]::session::CliSession>::execute_prepared<unknown>
  1765. 248.37 s > at <unknown source file>:<unknown line>
  1766. 248.37 s > 24: <gammaloop_api[9ebf6628f97aeb57]::session::CliSession>::execute_prepared_commands<unknown>
  1767. 248.37 s > at <unknown source file>:<unknown line>
  1768. 248.37 s > 25: <gammaloop_api[9ebf6628f97aeb57]::session::CliSession>::execute_prepared<unknown>
  1769. 248.37 s > at <unknown source file>:<unknown line>
  1770. 248.37 s > 26: <gammaloop_api[9ebf6628f97aeb57]::session::CliSession>::execute_command<unknown>
  1771. 248.37 s > at <unknown source file>:<unknown line>
  1772. 248.37 s > 27: <gammaloop_integration_tests[191607b70c61cd5a]::CLIState>::run_command<unknown>
  1773. 248.37 s > at <unknown source file>:<unknown line>
  1774. 248.37 s > 28: uv[3c7454ef256d6487]::run_single_integrated_uv_case<unknown>
  1775. 248.37 s > at <unknown source file>:<unknown line>
  1776. 248.37 s > 29: <uv[3c7454ef256d6487]::thermal_sunrise_uv::{closure#0} as core[940e698046960fd5]::ops::function::FnOnce<()>>::call_once<unknown>
  1777. 248.37 s > at <unknown source file>:<unknown line>
  1778. 248.37 s > 30: test[75d6903177b1d7e9]::__rust_begin_short_backtrace::<core[940e698046960fd5]::result::Result<(), alloc[2ea6bcb46fca0c42]::string::String>, fn() -> core[940e698046960fd5]::result::Result<(), alloc[2ea6bcb46fca0c42]::string::String>><unknown>
  1779. 248.37 s > at <unknown source file>:<unknown line>
  1780. 248.37 s > 31: test[75d6903177b1d7e9]::run_test::{closure#0}<unknown>
  1781. 248.37 s > at <unknown source file>:<unknown line>
  1782. 248.37 s > 32: std[bcb96dfbba0ab899]::sys::backtrace::__rust_begin_short_backtrace::<test[75d6903177b1d7e9]::run_test::{closure#1}, ()><unknown>
  1783. 248.37 s > at <unknown source file>:<unknown line>
  1784. 248.37 s > 33: <std[bcb96dfbba0ab899]::thread::lifecycle::spawn_unchecked<test[75d6903177b1d7e9]::run_test::{closure#1}, ()>::{closure#1} as core[940e698046960fd5]::ops::function::FnOnce<()>>::call_once::{shim:vtable#0}<unknown>
  1785. 248.37 s > at <unknown source file>:<unknown line>
  1786. 248.37 s > 34: <std[bcb96dfbba0ab899]::sys::thread::unix::Thread>::new::thread_start<unknown>
  1787. 248.37 s > at <unknown source file>:<unknown line>
  1788. 248.37 s > 35: start_thread<unknown>
  1789. 248.37 s > at <unknown source file>:<unknown line>
  1790. 248.37 s > 36: __clone3<unknown>
  1791. 248.37 s > at <unknown source file>:<unknown line>
  1792. 248.37 s >
  1793. 248.37 s > Run with COLORBT_SHOW_HIDDEN=1 environment variable to disable frame filtering.
  1794. 248.37 s > Run with RUST_BACKTRACE=full to include source snippets.
  1795. 248.37 s > Warning: SpanTrace capture is Unsupported.
  1796. 248.37 s > Ensure that you've setup a tracing-error ErrorLayer and the semver versions are compatible
  1797. 248.37 s > =========================================
  1798. 248.37 s For full logs, run:
  1799. 248.37 s nix log /nix/store/3f1dcfqxy8q0az6011047m7cljdkdh7f-gammaloop-nextest-integration.drv
  1800. 248.50 s Run failed.