1. 0.00 s $ /nix/store/61685rbaxmpigwi3z23i33sv3jyfl70q-coreutils-9.11/bin/timeout --kill-after=15s 7200s /nix/store/wknkybkzrc16r11vk5vrykh4wmw7a353-nix-2.34.8/bin/nix --extra-experimental-features nix-command --extra-experimental-features flakes flake clone git+https://github.com/alphal00p/gammaloop --dest /tmp/nix-ci-worker/stable-pwd/repo/
  2. 0.10 s Cloning into '/tmp/nix-ci-worker/stable-pwd/repo'...
  3. 0.86 s remote: Enumerating objects: 108237, done.
  4. 0.98 s remote: Counting objects: 0% (1/11633) remote: Counting objects: 1% (117/11633) remote: Counting objects: 2% (233/11633) remote: Counting objects: 3% (349/11633) remote: Counting objects: 4% (466/11633) remote: Counting objects: 5% (582/11633) remote: Counting objects: 6% (698/11633) remote: Counting objects: 7% (815/11633) remote: Counting objects: 8% (931/11633) remote: Counting objects: 9% (1047/11633) remote: Counting objects: 10% (1164/11633) remote: Counting objects: 11% (1280/11633) remote: Counting objects: 12% (1396/11633) remote: Counting objects: 13% (1513/11633) remote: Counting objects: 14% (1629/11633) remote: Counting objects: 15% (1745/11633) remote: Counting objects: 16% (1862/11633) remote: Counting objects: 17% (1978/11633) remote: Counting objects: 18% (2094/11633) remote: Counting objects: 19% (2211/11633) remote: Counting objects: 20% (2327/11633) remote: Counting objects: 21% (2443/11633) remote: Counting objects: 22% (2560/11633) remote: Counting objects: 23% (2676/11633) remote: Counting objects: 24% (2792/11633) remote: Counting objects: 25% (2909/11633) remote: Counting objects: 26% (3025/11633) remote: Counting objects: 27% (3141/11633) remote: Counting objects: 28% (3258/11633) remote: Counting objects: 29% (3374/11633) remote: Counting objects: 30% (3490/11633) remote: Counting objects: 31% (3607/11633) remote: Counting objects: 32% (3723/11633) remote: Counting objects: 33% (3839/11633) remote: Counting objects: 34% (3956/11633) remote: Counting objects: 35% (4072/11633) remote: Counting objects: 36% (4188/11633) remote: Counting objects: 37% (4305/11633) remote: Counting objects: 38% (4421/11633) remote: Counting objects: 39% (4537/11633) remote: Counting objects: 40% (4654/11633) remote: Counting objects: 41% (4770/11633) remote: Counting objects: 42% (4886/11633) remote: Counting objects: 43% (5003/11633) remote: Counting objects: 44% (5119/11633) remote: Counting objects: 45% (5235/11633) remote: Counting objects: 46% (5352/11633) remote: Counting objects: 47% (5468/11633) remote: Counting objects: 48% (5584/11633) remote: Counting objects: 49% (5701/11633) remote: Counting objects: 50% (5817/11633) remote: Counting objects: 51% (5933/11633) remote: Counting objects: 52% (6050/11633) remote: Counting objects: 53% (6166/11633) remote: Counting objects: 54% (6282/11633) remote: Counting objects: 55% (6399/11633) remote: Counting objects: 56% (6515/11633) remote: Counting objects: 57% (6631/11633) remote: Counting objects: 58% (6748/11633) remote: Counting objects: 59% (6864/11633) remote: Counting objects: 60% (6980/11633) remote: Counting objects: 61% (7097/11633) remote: Counting objects: 62% (7213/11633) remote: Counting objects: 63% (7329/11633) remote: Counting objects: 64% (7446/11633) remote: Counting objects: 65% (7562/11633) remote: Counting objects: 66% (7678/11633) remote: Counting objects: 67% (7795/11633) remote: Counting objects: 68% (7911/11633) remote: Counting objects: 69% (8027/11633) remote: Counting objects: 70% (8144/11633) remote: Counting objects: 71% (8260/11633) remote: Counting objects: 72% (8376/11633) remote: Counting objects: 73% (8493/11633) remote: Counting objects: 74% (8609/11633) remote: Counting objects: 75% (8725/11633) remote: Counting objects: 76% (8842/11633) remote: Counting objects: 77% (8958/11633) remote: Counting objects: 78% (9074/11633) remote: Counting objects: 79% (9191/11633) remote: Counting objects: 80% (9307/11633) remote: Counting objects: 81% (9423/11633) remote: Counting objects: 82% (9540/11633) remote: Counting objects: 83% (9656/11633) remote: Counting objects: 84% (9772/11633) remote: Counting objects: 85% (9889/11633) remote: Counting objects: 86% (10005/11633) remote: Counting objects: 87% (10121/11633) remote: Counting objects: 88% (10238/11633) remote: Counting objects: 89% (10354/11633) remote: Counting objects: 90% (10470/11633) remote: Counting objects: 91% (10587/11633) remote: Counting objects: 92% (10703/11633) remote: Counting objects: 93% (10819/11633) remote: Counting objects: 94% (10936/11633) remote: Counting objects: 95% (11052/11633) remote: Counting objects: 96% (11168/11633) remote: Counting objects: 97% (11285/11633) remote: Counting objects: 98% (11401/11633) remote: Counting objects: 99% (11517/11633) remote: Counting objects: 100% (11633/11633) remote: Counting objects: 100% (11633/11633), done.
  5. 3.59 s remote: Compressing objects: 0% (1/2152) remote: Compressing objects: 1% (22/2152) remote: Compressing objects: 2% (44/2152) remote: Compressing objects: 3% (65/2152) remote: Compressing objects: 4% (87/2152) remote: Compressing objects: 5% (108/2152) remote: Compressing objects: 6% (130/2152) remote: Compressing objects: 6% (132/2152) remote: Compressing objects: 7% (151/2152) remote: Compressing objects: 8% (173/2152) remote: Compressing objects: 9% (194/2152) remote: Compressing objects: 10% (216/2152) remote: Compressing objects: 11% (237/2152) remote: Compressing objects: 12% (259/2152) remote: Compressing objects: 13% (280/2152) remote: Compressing objects: 14% (302/2152) remote: Compressing objects: 14% (309/2152) remote: Compressing objects: 15% (323/2152) remote: Compressing objects: 16% (345/2152) remote: Compressing objects: 17% (366/2152) remote: Compressing objects: 18% (388/2152) remote: Compressing objects: 19% (409/2152) remote: Compressing objects: 20% (431/2152) remote: Compressing objects: 21% (452/2152) remote: Compressing objects: 22% (474/2152) remote: Compressing objects: 23% (495/2152) remote: Compressing objects: 24% (517/2152) remote: Compressing objects: 25% (538/2152) remote: Compressing objects: 26% (560/2152) remote: Compressing objects: 27% (582/2152) remote: Compressing objects: 28% (603/2152) remote: Compressing objects: 29% (625/2152) remote: Compressing objects: 30% (646/2152) remote: Compressing objects: 31% (668/2152) remote: Compressing objects: 32% (689/2152) remote: Compressing objects: 33% (711/2152) remote: Compressing objects: 34% (732/2152) remote: Compressing objects: 35% (754/2152) remote: Compressing objects: 36% (775/2152) remote: Compressing objects: 37% (797/2152) remote: Compressing objects: 38% (818/2152) remote: Compressing objects: 39% (840/2152) remote: Compressing objects: 40% (861/2152) remote: Compressing objects: 41% (883/2152) remote: Compressing objects: 42% (904/2152) remote: Compressing objects: 43% (926/2152) remote: Compressing objects: 44% (947/2152) remote: Compressing objects: 45% (969/2152) remote: Compressing objects: 46% (990/2152) remote: Compressing objects: 47% (1012/2152) remote: Compressing objects: 48% (1033/2152) remote: Compressing objects: 49% (1055/2152) remote: Compressing objects: 50% (1076/2152) remote: Compressing objects: 51% (1098/2152) remote: Compressing objects: 52% (1120/2152) remote: Compressing objects: 53% (1141/2152) remote: Compressing objects: 54% (1163/2152) remote: Compressing objects: 55% (1184/2152) remote: Compressing objects: 56% (1206/2152) remote: Compressing objects: 57% (1227/2152) remote: Compressing objects: 58% (1249/2152) remote: Compressing objects: 59% (1270/2152) remote: Compressing objects: 60% (1292/2152) remote: Compressing objects: 61% (1313/2152) remote: Compressing objects: 62% (1335/2152) remote: Compressing objects: 63% (1356/2152) remote: Compressing objects: 64% (1378/2152) remote: Compressing objects: 65% (1399/2152) remote: Compressing objects: 66% (1421/2152) remote: Compressing objects: 67% (1442/2152) remote: Compressing objects: 68% (1464/2152) remote: Compressing objects: 69% (1485/2152) remote: Compressing objects: 70% (1507/2152) remote: Compressing objects: 71% (1528/2152) remote: Compressing objects: 72% (1550/2152) remote: Compressing objects: 73% (1571/2152) remote: Compressing objects: 74% (1593/2152) remote: Compressing objects: 75% (1614/2152) remote: Compressing objects: 76% (1636/2152) remote: Compressing objects: 77% (1658/2152) remote: Compressing objects: 78% (1679/2152) remote: Compressing objects: 79% (1701/2152) remote: Compressing objects: 80% (1722/2152) remote: Compressing objects: 81% (1744/2152) remote: Compressing objects: 82% (1765/2152) remote: Compressing objects: 83% (1787/2152) remote: Compressing objects: 84% (1808/2152) remote: Compressing objects: 85% (1830/2152) remote: Compressing objects: 86% (1851/2152) remote: Compressing objects: 87% (1873/2152) remote: Compressing objects: 88% (1894/2152) remote: Compressing objects: 89% (1916/2152) remote: Compressing objects: 90% (1937/2152) remote: Compressing objects: 91% (1959/2152) remote: Compressing objects: 92% (1980/2152) remote: Compressing objects: 93% (2002/2152) remote: Compressing objects: 94% (2023/2152) remote: Compressing objects: 95% (2045/2152) remote: Compressing objects: 96% (2066/2152) remote: Compressing objects: 97% (2088/2152) remote: Compressing objects: 98% (2109/2152) remote: Compressing objects: 99% (2131/2152) remote: Compressing objects: 100% (2152/2152) remote: Compressing objects: 100% (2152/2152), done.
  6. 15.79 s Receiving objects: 0% (1/108237) Receiving objects: 1% (1083/108237) Receiving objects: 2% (2165/108237) Receiving objects: 3% (3248/108237) Receiving objects: 4% (4330/108237), 16.02 MiB | 32.02 MiB/s Receiving objects: 5% (5412/108237), 16.02 MiB | 32.02 MiB/s Receiving objects: 6% (6495/108237), 16.02 MiB | 32.02 MiB/s Receiving objects: 7% (7577/108237), 16.02 MiB | 32.02 MiB/s Receiving objects: 8% (8659/108237), 16.02 MiB | 32.02 MiB/s Receiving objects: 9% (9742/108237), 16.02 MiB | 32.02 MiB/s Receiving objects: 9% (10655/108237), 32.11 MiB | 32.11 MiB/s Receiving objects: 10% (10824/108237), 32.11 MiB | 32.11 MiB/s Receiving objects: 11% (11907/108237), 32.11 MiB | 32.11 MiB/s Receiving objects: 12% (12989/108237), 32.11 MiB | 32.11 MiB/s Receiving objects: 13% (14071/108237), 32.11 MiB | 32.11 MiB/s Receiving objects: 14% (15154/108237), 32.11 MiB | 32.11 MiB/s Receiving objects: 15% (16236/108237), 32.11 MiB | 32.11 MiB/s Receiving objects: 16% (17318/108237), 32.11 MiB | 32.11 MiB/s Receiving objects: 17% (18401/108237), 32.11 MiB | 32.11 MiB/s Receiving objects: 18% (19483/108237), 32.11 MiB | 32.11 MiB/s Receiving objects: 19% (20566/108237), 32.11 MiB | 32.11 MiB/s Receiving objects: 20% (21648/108237), 32.11 MiB | 32.11 MiB/s Receiving objects: 21% (22730/108237), 44.27 MiB | 29.50 MiB/s Receiving objects: 22% (23813/108237), 44.27 MiB | 29.50 MiB/s Receiving objects: 23% (24895/108237), 44.27 MiB | 29.50 MiB/s Receiving objects: 24% (25977/108237), 44.27 MiB | 29.50 MiB/s Receiving objects: 25% (27060/108237), 44.27 MiB | 29.50 MiB/s Receiving objects: 26% (28142/108237), 44.27 MiB | 29.50 MiB/s Receiving objects: 27% (29224/108237), 44.27 MiB | 29.50 MiB/s Receiving objects: 28% (30307/108237), 44.27 MiB | 29.50 MiB/s Receiving objects: 29% (31389/108237), 44.27 MiB | 29.50 MiB/s Receiving objects: 30% (32472/108237), 44.27 MiB | 29.50 MiB/s Receiving objects: 31% (33554/108237), 44.27 MiB | 29.50 MiB/s Receiving objects: 32% (34636/108237), 44.27 MiB | 29.50 MiB/s Receiving objects: 33% (35719/108237), 44.27 MiB | 29.50 MiB/s Receiving objects: 34% (36801/108237), 44.27 MiB | 29.50 MiB/s Receiving objects: 35% (37883/108237), 44.27 MiB | 29.50 MiB/s Receiving objects: 36% (38966/108237), 44.27 MiB | 29.50 MiB/s Receiving objects: 37% (40048/108237), 44.27 MiB | 29.50 MiB/s Receiving objects: 38% (41131/108237), 44.27 MiB | 29.50 MiB/s Receiving objects: 39% (42213/108237), 44.27 MiB | 29.50 MiB/s Receiving objects: 40% (43295/108237), 44.27 MiB | 29.50 MiB/s Receiving objects: 40% (43625/108237), 44.27 MiB | 29.50 MiB/s Receiving objects: 41% (44378/108237), 65.98 MiB | 32.98 MiB/s Receiving objects: 42% (45460/108237), 65.98 MiB | 32.98 MiB/s Receiving objects: 43% (46542/108237), 65.98 MiB | 32.98 MiB/s Receiving objects: 44% (47625/108237), 65.98 MiB | 32.98 MiB/s Receiving objects: 45% (48707/108237), 65.98 MiB | 32.98 MiB/s Receiving objects: 46% (49790/108237), 65.98 MiB | 32.98 MiB/s Receiving objects: 47% (50872/108237), 65.98 MiB | 32.98 MiB/s Receiving objects: 48% (51954/108237), 65.98 MiB | 32.98 MiB/s Receiving objects: 49% (53037/108237), 65.98 MiB | 32.98 MiB/s Receiving objects: 50% (54119/108237), 82.84 MiB | 33.13 MiB/s Receiving objects: 51% (55201/108237), 82.84 MiB | 33.13 MiB/s Receiving objects: 52% (56284/108237), 82.84 MiB | 33.13 MiB/s Receiving objects: 53% (57366/108237), 82.84 MiB | 33.13 MiB/s Receiving objects: 53% (58027/108237), 82.84 MiB | 33.13 MiB/s Receiving objects: 54% (58448/108237), 98.38 MiB | 32.79 MiB/s Receiving objects: 55% (59531/108237), 98.38 MiB | 32.79 MiB/s Receiving objects: 56% (60613/108237), 98.38 MiB | 32.79 MiB/s Receiving objects: 57% (61696/108237), 98.38 MiB | 32.79 MiB/s Receiving objects: 58% (62778/108237), 98.38 MiB | 32.79 MiB/s Receiving objects: 59% (63860/108237), 98.38 MiB | 32.79 MiB/s Receiving objects: 60% (64943/108237), 98.38 MiB | 32.79 MiB/s Receiving objects: 61% (66025/108237), 116.13 MiB | 33.18 MiB/s Receiving objects: 62% (67107/108237), 116.13 MiB | 33.18 MiB/s Receiving objects: 62% (68037/108237), 132.51 MiB | 33.13 MiB/s Receiving objects: 63% (68190/108237), 132.51 MiB | 33.13 MiB/s Receiving objects: 63% (68563/108237), 148.36 MiB | 32.97 MiB/s Receiving objects: 64% (69272/108237), 165.73 MiB | 33.28 MiB/s Receiving objects: 64% (70321/108237), 197.87 MiB | 34.14 MiB/s Receiving objects: 65% (70355/108237), 197.87 MiB | 34.14 MiB/s Receiving objects: 65% (70459/108237), 215.83 MiB | 33.31 MiB/s Receiving objects: 65% (70654/108237), 265.61 MiB | 33.23 MiB/s Receiving objects: 66% (71437/108237), 265.61 MiB | 33.23 MiB/s Receiving objects: 67% (72519/108237), 265.61 MiB | 33.23 MiB/s Receiving objects: 68% (73602/108237), 265.61 MiB | 33.23 MiB/s Receiving objects: 69% (74684/108237), 265.61 MiB | 33.23 MiB/s Receiving objects: 70% (75766/108237), 265.61 MiB | 33.23 MiB/s Receiving objects: 71% (76849/108237), 265.61 MiB | 33.23 MiB/s Receiving objects: 72% (77931/108237), 281.88 MiB | 33.22 MiB/s Receiving objects: 73% (79014/108237), 281.88 MiB | 33.22 MiB/s Receiving objects: 74% (80096/108237), 281.88 MiB | 33.22 MiB/s Receiving objects: 75% (81178/108237), 281.88 MiB | 33.22 MiB/s Receiving objects: 76% (82261/108237), 281.88 MiB | 33.22 MiB/s Receiving objects: 77% (83343/108237), 281.88 MiB | 33.22 MiB/s Receiving objects: 78% (84425/108237), 281.88 MiB | 33.22 MiB/s Receiving objects: 79% (85508/108237), 281.88 MiB | 33.22 MiB/s Receiving objects: 80% (86590/108237), 281.88 MiB | 33.22 MiB/s Receiving objects: 80% (86666/108237), 281.88 MiB | 33.22 MiB/s Receiving objects: 81% (87672/108237), 297.63 MiB | 33.19 MiB/s Receiving objects: 82% (88755/108237), 297.63 MiB | 33.19 MiB/s Receiving objects: 83% (89837/108237), 315.59 MiB | 33.32 MiB/s Receiving objects: 84% (90920/108237), 315.59 MiB | 33.32 MiB/s Receiving objects: 84% (91677/108237), 332.20 MiB | 33.41 MiB/s Receiving objects: 85% (92002/108237), 332.20 MiB | 33.41 MiB/s Receiving objects: 86% (93084/108237), 332.20 MiB | 33.41 MiB/s Receiving objects: 87% (94167/108237), 332.20 MiB | 33.41 MiB/s Receiving objects: 88% (95249/108237), 332.20 MiB | 33.41 MiB/s Receiving objects: 88% (95687/108237), 365.23 MiB | 33.21 MiB/s Receiving objects: 89% (96331/108237), 382.00 MiB | 33.37 MiB/s Receiving objects: 90% (97414/108237), 382.00 MiB | 33.37 MiB/s Receiving objects: 91% (98496/108237), 382.00 MiB | 33.37 MiB/s Receiving objects: 92% (99579/108237), 382.00 MiB | 33.37 MiB/s Receiving objects: 93% (100661/108237), 382.00 MiB | 33.37 MiB/s Receiving objects: 94% (101743/108237), 382.00 MiB | 33.37 MiB/s Receiving objects: 94% (102008/108237), 382.00 MiB | 33.37 MiB/s Receiving objects: 95% (102826/108237), 397.84 MiB | 33.38 MiB/s Receiving objects: 96% (103908/108237), 397.84 MiB | 33.38 MiB/s Receiving objects: 97% (104990/108237), 397.84 MiB | 33.38 MiB/s Receiving objects: 98% (106073/108237), 397.84 MiB | 33.38 MiB/s Receiving objects: 99% (107155/108237), 397.84 MiB | 33.38 MiB/s remote: Total 108237 (delta 10287), reused 9528 (delta 9476), pack-reused 96604 (from 1)
  7. 15.79 s Receiving objects: 100% (108237/108237), 397.84 MiB | 33.38 MiB/s Receiving objects: 100% (108237/108237), 404.46 MiB | 33.16 MiB/s, done.
  8. 18.62 s Resolving deltas: 0% (0/72030) Resolving deltas: 1% (721/72030) Resolving deltas: 2% (1441/72030) Resolving deltas: 3% (2161/72030) Resolving deltas: 4% (2882/72030) Resolving deltas: 5% (3602/72030) Resolving deltas: 6% (4323/72030) Resolving deltas: 7% (5043/72030) Resolving deltas: 8% (5764/72030) Resolving deltas: 9% (6483/72030) Resolving deltas: 10% (7203/72030) Resolving deltas: 11% (7924/72030) Resolving deltas: 12% (8644/72030) Resolving deltas: 13% (9364/72030) Resolving deltas: 14% (10085/72030) Resolving deltas: 15% (10805/72030) Resolving deltas: 16% (11525/72030) Resolving deltas: 17% (12246/72030) Resolving deltas: 18% (12966/72030) Resolving deltas: 19% (13686/72030) Resolving deltas: 20% (14406/72030) Resolving deltas: 21% (15127/72030) Resolving deltas: 22% (15847/72030) Resolving deltas: 23% (16567/72030) Resolving deltas: 24% (17288/72030) Resolving deltas: 25% (18008/72030) Resolving deltas: 26% (18728/72030) Resolving deltas: 27% (19449/72030) Resolving deltas: 28% (20170/72030) Resolving deltas: 29% (20889/72030) Resolving deltas: 29% (21160/72030) Resolving deltas: 30% (21609/72030) Resolving deltas: 31% (22331/72030) Resolving deltas: 32% (23050/72030) Resolving deltas: 33% (23770/72030) Resolving deltas: 34% (24491/72030) Resolving deltas: 35% (25211/72030) Resolving deltas: 36% (25931/72030) Resolving deltas: 37% (26652/72030) Resolving deltas: 38% (27372/72030) Resolving deltas: 39% (28092/72030) Resolving deltas: 40% (28814/72030) Resolving deltas: 41% (29533/72030) Resolving deltas: 42% (30253/72030) Resolving deltas: 43% (30974/72030) Resolving deltas: 44% (31694/72030) Resolving deltas: 45% (32414/72030) Resolving deltas: 46% (33134/72030) Resolving deltas: 47% (33855/72030) Resolving deltas: 48% (34575/72030) Resolving deltas: 49% (35295/72030) Resolving deltas: 50% (36016/72030) Resolving deltas: 51% (36737/72030) Resolving deltas: 52% (37456/72030) Resolving deltas: 53% (38176/72030) Resolving deltas: 54% (38897/72030) Resolving deltas: 55% (39617/72030) Resolving deltas: 56% (40338/72030) Resolving deltas: 57% (41058/72030) Resolving deltas: 58% (41778/72030) Resolving deltas: 59% (42498/72030) Resolving deltas: 60% (43218/72030) Resolving deltas: 61% (43940/72030) Resolving deltas: 62% (44659/72030) Resolving deltas: 63% (45379/72030) Resolving deltas: 64% (46100/72030) Resolving deltas: 65% (46820/72030) Resolving deltas: 66% (47540/72030) Resolving deltas: 67% (48261/72030) Resolving deltas: 67% (48335/72030) Resolving deltas: 68% (48981/72030) Resolving deltas: 69% (49701/72030) Resolving deltas: 70% (50423/72030) Resolving deltas: 71% (51142/72030) Resolving deltas: 72% (51862/72030) Resolving deltas: 73% (52582/72030) Resolving deltas: 74% (53303/72030) Resolving deltas: 75% (54023/72030) Resolving deltas: 76% (54743/72030) Resolving deltas: 77% (55465/72030) Resolving deltas: 78% (56184/72030) Resolving deltas: 79% (56904/72030) Resolving deltas: 80% (57624/72030) Resolving deltas: 81% (58345/72030) Resolving deltas: 82% (59065/72030) Resolving deltas: 83% (59785/72030) Resolving deltas: 84% (60506/72030) Resolving deltas: 85% (61226/72030) Resolving deltas: 86% (61946/72030) Resolving deltas: 87% (62667/72030) Resolving deltas: 88% (63387/72030) Resolving deltas: 89% (64107/72030) Resolving deltas: 90% (64827/72030) Resolving deltas: 91% (65548/72030) Resolving deltas: 92% (66268/72030) Resolving deltas: 93% (66989/72030) Resolving deltas: 94% (67712/72030) Resolving deltas: 95% (68429/72030) Resolving deltas: 96% (69151/72030) Resolving deltas: 97% (69870/72030) Resolving deltas: 98% (70590/72030) Resolving deltas: 99% (71310/72030) Resolving deltas: 100% (72030/72030) Resolving deltas: 100% (72030/72030), done.
  9. 19.79 s Fetching commit e5f4155eb4ff28199578e0ea25acdf24da8f4aed for codex/backup-finite_T_and_mu-before-rebase-20260923 ...
  10. 19.79 s $ /nix/store/5vpcfsdx1lcnlb2y4k7xyc74shp5qwbh-git-2.54.0/bin/git fetch origin e5f4155eb4ff28199578e0ea25acdf24da8f4aed
  11. 20.33 s From https://github.com/alphal00p/gammaloop
  12. 20.33 s * branch e5f4155eb4ff28199578e0ea25acdf24da8f4aed -> FETCH_HEAD
  13. 20.35 s $ /nix/store/61685rbaxmpigwi3z23i33sv3jyfl70q-coreutils-9.11/bin/timeout --kill-after=15s 7200s /nix/store/5vpcfsdx1lcnlb2y4k7xyc74shp5qwbh-git-2.54.0/bin/git -c advice.detachedHead=false checkout e5f4155eb4ff28199578e0ea25acdf24da8f4aed
  14. 20.79 s HEAD is now at e5f4155eb unify scalar CFF sector generation across medium modes
  15. 20.80 s $ /nix/store/61685rbaxmpigwi3z23i33sv3jyfl70q-coreutils-9.11/bin/timeout --kill-after=15s 7200s /nix/store/wknkybkzrc16r11vk5vrykh4wmw7a353-nix-2.34.8/bin/nix --extra-experimental-features nix-command --extra-experimental-features flakes --log-format internal-json run .#packages.x86_64-linux.nix-ci-check-gammaloop-nextest-integration --print-build-logs
  16. 21.04 s error (ignored): SQLite database '/var/cache/nix-ci-worker/eval-cache-v6/0e53f14d393b25ec6706efbb77575fddb0366106f8958da6c53e96dfc9fd63fe.sqlite' is busy
  17. 27.47 s
  18. 34.16 s evaluating derivation 'g copying '/nix/store/srmp evaluating derivation 'g copying '/nix/store/srmp evaluating derivation 'g copying '/nix/store/srmp evaluating derivation 'g copying '/nix/store/srmp evaluating derivation 'g copying '/nix/store/srmp evaluating derivation 'g copying '/nix/store/srmp evaluating derivation 'g copying '/nix/store/srmp evaluating derivation 'g copying '/nix/store/srmp evaluating derivation 'g copying '/nix/store/srmp evaluating derivation 'g querying gammaloop-nexte [0/1 built, 0.0 KiB DL] [1/0/1 built, 0.0 KiB DLgammaloop-nextest-integration> Extracting 13 binaries, 1 build script output directory, and 3 linked paths to /build/nextest-archive-4ARkN7
  19. 36.98 s gammaloop-nextest-integration> Extracted 30 files to /build/nextest-archive-4ARkN7 in 2.82s
  20. 37.02 s gammaloop-nextest-integration> ------------
  21. 37.02 s gammaloop-nextest-integration> Nextest run ID c13ea1df-eec4-40f0-a015-9d651c53724b with nextest profile: ci_gammaloop
  22. 37.02 s gammaloop-nextest-integration> Starting 170 tests across 13 binaries (209 tests skipped, including 208 tests via profile.ci_gammaloop.default-filter)
  23. 164.79 s gammaloop-nextest-integration> FAIL [ 3.444s] ( 55/170) gammaloop-integration-tests::test_runs aa_aa::important::aa_aa_local_inspect_backend_consistency
  24. 164.79 s gammaloop-nextest-integration> stdout ---
  25. 164.79 s gammaloop-nextest-integration>
  26. 164.79 s gammaloop-nextest-integration> running 1 test
  27. 164.79 s gammaloop-nextest-integration> test aa_aa::important::aa_aa_local_inspect_backend_consistency ... FAILED
  28. 164.79 s gammaloop-nextest-integration>
  29. 164.79 s gammaloop-nextest-integration> failures:
  30. 164.79 s gammaloop-nextest-integration>
  31. 164.79 s gammaloop-nextest-integration> failures:
  32. 164.79 s gammaloop-nextest-integration> aa_aa::important::aa_aa_local_inspect_backend_consistency
  33. 164.79 s gammaloop-nextest-integration>
  34. 164.79 s gammaloop-nextest-integration> test result: FAILED. 0 passed; 1 failed; 0 ignored; 0 measured; 274 filtered out; finished in 3.42s
  35. 164.79 s gammaloop-nextest-integration>
  36. 164.79 s gammaloop-nextest-integration> stderr ---
  37. 164.79 s gammaloop-nextest-integration> [2026-09-23 20:46:47.181] @gammaloop_api::se... INFO : Running command import model sm-default.json
  38. 164.79 s gammaloop-nextest-integration> [2026-09-23 20:46:47.181] @import::model INFO : Loading built-in JSON model sm-default
  39. 164.79 s gammaloop-nextest-integration> [2026-09-23 20:46:47.208] @gammalooprs::model INFO : The following 15 external parameters were forced to zero by the restriction card:
  40. 164.79 s gammaloop-nextest-integration> lamWS, AWS, rhoWS, etaWS, ymc, yme, ymm, MC, Me, MM, WTau, muQ, muLe, muLmu, muLtau
  41. 164.79 s gammaloop-nextest-integration> [2026-09-23 20:46:47.209] @gammalooprs::model INFO : The following 34 vertex rules were removed by the restriction card:
  42. 164.79 s gammaloop-nextest-integration> V_82 -> (c~, d, G+) | V_83 -> (t~, d, G+) | V_84 -> (c~, s, G+) | V_85 -> (t~, s, G+) | V_86 -> (u~, b, G+) | V_87 -> (c~, b, G+) | V_90 -> (c~, d, W+) | V_91 -> (t~, d, W+) | V_92 -> (u~, s, W+) | V_94 -> (t~, s, W+) | V_95 -> (u~, b, W+) | V_96 -> (c~, b, W+) | V_101 -> (e+, e-, G0) | V_102 -> (mu+, mu-, G0) | V_104 -> (e+, e-, H) | V_105 -> (mu+, mu-, H) | V_110 -> (ve~, e-, G+) | V_111 -> (vm~, mu-, G+) | V_116 -> (b~, u, G-) | V_117 -> (d~, c, G-) | V_118 -> (s~, c, G-) | V_119 -> (b~, c, G-) | V_120 -> (d~, t, G-) | V_121 -> (s~, t, G-) | V_124 -> (s~, u, W-) | V_125 -> (b~, u, W-) | V_126 -> (d~, c, W-) | V_128 -> (b~, c, W-) | V_129 -> (d~, t, W-) | V_130 -> (s~, t, W-) | V_138 -> (c~, c, G0) | V_140 -> (c~, c, H) | V_145 -> (e+, ve, G-) | V_146 -> (mu+, vm, G-)
  43. 164.79 s gammaloop-nextest-integration> [2026-09-23 20:46:47.209] @gammalooprs::model INFO : The following 36 couplings were removed by the restriction card:
  44. 164.79 s gammaloop-nextest-integration> GC_13, GC_14, GC_16, GC_17, GC_18, GC_19, GC_20, GC_22, GC_23, GC_24, GC_25, GC_26, GC_28, GC_29, GC_42, GC_43, GC_44, GC_46, GC_47, GC_48, GC_84, GC_85, GC_86, GC_87, GC_88, GC_89, GC_90, GC_91, GC_92, GC_93, GC_101, GC_102, GC_103, GC_105, GC_106, GC_107
  45. 164.79 s gammaloop-nextest-integration> [2026-09-23 20:46:47.209] @gammaloop_api::se... INFO : Running command run set_model_parameters
  46. 164.79 s gammaloop-nextest-integration> [2026-09-23 20:46:47.209] @gammaloop_api::se... INFO : Starting command block set_model_parameters
  47. 164.79 s gammaloop-nextest-integration> [2026-09-23 20:46:47.210] @gammaloop_api::se... INFO : Running command set model MT=173.0
  48. 164.79 s gammaloop-nextest-integration> [2026-09-23 20:46:47.215] @gammaloop_api::se... INFO : Running command set model WT=0.0
  49. 164.79 s gammaloop-nextest-integration> [2026-09-23 20:46:47.220] @gammaloop_api::se... INFO : Running command set model ymt=173.0
  50. 164.79 s gammaloop-nextest-integration> [2026-09-23 20:46:47.224] @gammaloop_api::se... INFO : Running command set model aS=0.118
  51. 164.79 s gammaloop-nextest-integration> [2026-09-23 20:46:47.229] @gammaloop_api::se... INFO : Running command set model aEWM1=137.036
  52. 164.79 s gammaloop-nextest-integration> [2026-09-23 20:46:47.233] @gammaloop_api::se... INFO : Running command set model Gf=1.166390e-05
  53. 164.79 s gammaloop-nextest-integration> [2026-09-23 20:46:47.238] @gammaloop_api::se... INFO : Running command set model MZ=91.188
  54. 164.79 s gammaloop-nextest-integration> [2026-09-23 20:46:47.244] @gammaloop_api::se... INFO : Running command set global string '
  55. 164.79 s gammaloop-nextest-integration> [global.generation.compile]
  56. 164.79 s gammaloop-nextest-integration> compilation_mode = "symjit"
  57. 164.79 s gammaloop-nextest-integration> optimization_level = "O0"
  58. 164.79 s gammaloop-nextest-integration> fast_math = false
  59. 164.79 s gammaloop-nextest-integration> [...]
  60. 164.79 s gammaloop-nextest-integration> [2026-09-23 20:46:47.245] @gammaloop_api::se... INFO : Running command import graphs ./examples/cli/aa_aa/1L/aa_aa_1L.dot -p aa_aa_all_helicities -i 1L_ppmm -o
  61. 164.79 s gammaloop-nextest-integration> [2026-09-23 20:46:47.245] @commands::import INFO : Loading graphs from '/build/source/examples/cli/aa_aa/1L/aa_aa_1L.dot'
  62. 164.79 s gammaloop-nextest-integration> [2026-09-23 20:46:47.256] @gammaloop_api::se... INFO : Running command generate existing -p aa_aa_all_helicities
  63. 164.79 s gammaloop-nextest-integration> The application panicked (crashed).
  64. 164.79 s gammaloop-nextest-integration> Message: label _func_power_ not found
  65. 164.79 s gammaloop-nextest-integration> Location: /nix/store/n9w914kh1cm59xx3spcs831cdyb56m32-vendor-cargo-deps/c19b7c6f923b580ac259164a89f2577984ad5ab09ee9d583b888f934adbbe8d0/symjit-2.25.6/src/symjit/assembler.rs:77
  66. 164.79 s gammaloop-nextest-integration>
  67. 164.79 s gammaloop-nextest-integration> ━━━━━━━━━━━━━━━━━━━━━━━━━━━━━━━━━━ BACKTRACE ━━━━━━━━━━━━━━━━━━━━━━━━━━━━━━━━━━━
  68. 164.79 s gammaloop-nextest-integration> 1: <color_eyre[51793ea62743adbd]::config::PanicHook>::panic_report<unknown>
  69. 164.79 s gammaloop-nextest-integration> at <unknown source file>:<unknown line>
  70. 164.79 s gammaloop-nextest-integration> 2: <color_eyre[51793ea62743adbd]::config::PanicHook>::into_panic_hook::{closure#0}<unknown>
  71. 164.79 s gammaloop-nextest-integration> at <unknown source file>:<unknown line>
  72. 164.79 s gammaloop-nextest-integration> 3: std[bcb96dfbba0ab899]::panicking::panic_with_hook<unknown>
  73. 164.79 s gammaloop-nextest-integration> at <unknown source file>:<unknown line>
  74. 164.79 s gammaloop-nextest-integration> 4: std[bcb96dfbba0ab899]::panicking::panic_handler::{closure#0}<unknown>
  75. 164.79 s gammaloop-nextest-integration> at <unknown source file>:<unknown line>
  76. 164.79 s gammaloop-nextest-integration> 5: std[bcb96dfbba0ab899]::sys::backtrace::__rust_end_short_backtrace::<std[bcb96dfbba0ab899]::panicking::panic_handler::{closure#0}, !><unknown>
  77. 164.79 s gammaloop-nextest-integration> at <unknown source file>:<unknown line>
  78. 164.79 s gammaloop-nextest-integration> 6: __rustc[6c289b9f9c454d21]::rust_begin_unwind<unknown>
  79. 164.79 s gammaloop-nextest-integration> at <unknown source file>:<unknown line>
  80. 164.79 s gammaloop-nextest-integration> 7: core[940e698046960fd5]::panicking::panic_fmt<unknown>
  81. 164.79 s gammaloop-nextest-integration> at <unknown source file>:<unknown line>
  82. 164.79 s gammaloop-nextest-integration> 8: <symjit[e408de789c333cd]::symjit::assembler::Assembler>::apply_jumps<unknown>
  83. 164.79 s gammaloop-nextest-integration> at <unknown source file>:<unknown line>
  84. 164.79 s gammaloop-nextest-integration> 9: <symjit[e408de789c333cd]::symjit::builder::Builder>::compile_from_mir::<symjit[e408de789c333cd]::symjit::amd::complex::AmdComplexGenerator><unknown>
  85. 164.79 s gammaloop-nextest-integration> at <unknown source file>:<unknown line>
  86. 164.79 s gammaloop-nextest-integration> 10: <symjit[e408de789c333cd]::symjit::runnable::Application>::compile_ty<unknown>
  87. 164.79 s gammaloop-nextest-integration> at <unknown source file>:<unknown line>
  88. 164.79 s gammaloop-nextest-integration> 11: <symjit[e408de789c333cd]::symjit::runnable::Application>::with_mir<unknown>
  89. 164.79 s gammaloop-nextest-integration> at <unknown source file>:<unknown line>
  90. 164.79 s gammaloop-nextest-integration> 12: <symjit[e408de789c333cd]::symjit::composer::DirectTranslator as symjit[e408de789c333cd]::symjit::composer::Composer>::compile<unknown>
  91. 164.79 s gammaloop-nextest-integration> at <unknown source file>:<unknown line>
  92. 164.79 s gammaloop-nextest-integration> 13: <symjit[e408de789c333cd]::symjit::compiler::Translator as symjit[e408de789c333cd]::symjit::composer::Composer>::compile<unknown>
  93. 164.79 s gammaloop-nextest-integration> at <unknown source file>:<unknown line>
  94. 164.79 s gammaloop-nextest-integration> 14: <numerica[124dab8567f4861e]::domains::float::complex::Complex<f64> as symbolica[10e259bab675d243]::evaluate::backend::JITCompiledNumber>::jit_compile<unknown>
  95. 164.79 s gammaloop-nextest-integration> at <unknown source file>:<unknown line>
  96. 164.79 s gammaloop-nextest-integration> 15: <gammalooprs[917cbd3df9e68f8f]::integrands::process::evaluators::GenericEvaluator>::activate_symjit<unknown>
  97. 164.79 s gammaloop-nextest-integration> at <unknown source file>:<unknown line>
  98. 164.79 s gammaloop-nextest-integration> 16: <gammalooprs[917cbd3df9e68f8f]::integrands::process::amplitude::AmplitudeIntegrand>::prepare_runtime_backends_after_generation_with_compile_times<unknown>
  99. 164.79 s gammaloop-nextest-integration> at <unknown source file>:<unknown line>
  100. 164.79 s gammaloop-nextest-integration> 17: <gammalooprs[917cbd3df9e68f8f]::processes::amplitude::Amplitude>::build_integrand<unknown>
  101. 164.79 s gammaloop-nextest-integration> at <unknown source file>:<unknown line>
  102. 164.79 s gammaloop-nextest-integration> 18: <gammalooprs[917cbd3df9e68f8f]::processes::process::Process>::generate_integrands<unknown>
  103. 164.79 s gammaloop-nextest-integration> at <unknown source file>:<unknown line>
  104. 164.79 s gammaloop-nextest-integration> 19: <gammaloop_api[9ebf6628f97aeb57]::state::State>::generate_integrand<unknown>
  105. 164.79 s gammaloop-nextest-integration> at <unknown source file>:<unknown line>
  106. 164.79 s gammaloop-nextest-integration> 20: <gammaloop_api[9ebf6628f97aeb57]::commands::generate::Generate>::run::<&std[bcb96dfbba0ab899]::path::PathBuf><unknown>
  107. 164.79 s gammaloop-nextest-integration> at <unknown source file>:<unknown line>
  108. 164.79 s gammaloop-nextest-integration> 21: <gammaloop_api[9ebf6628f97aeb57]::commands::Commands>::run<unknown>
  109. 164.79 s gammaloop-nextest-integration> at <unknown source file>:<unknown line>
  110. 164.79 s gammaloop-nextest-integration> 22: <gammaloop_api[9ebf6628f97aeb57]::session::CliSession>::execute_prepared<unknown>
  111. 164.79 s gammaloop-nextest-integration> at <unknown source file>:<unknown line>
  112. 164.79 s gammaloop-nextest-integration> 23: <gammaloop_api[9ebf6628f97aeb57]::session::CliSession>::execute_command<unknown>
  113. 164.79 s gammaloop-nextest-integration> at <unknown source file>:<unknown line>
  114. 164.79 s gammaloop-nextest-integration> 24: <gammaloop_integration_tests[191607b70c61cd5a]::CLIState>::run_command<unknown>
  115. 164.79 s gammaloop-nextest-integration> at <unknown source file>:<unknown line>
  116. 164.79 s gammaloop-nextest-integration> 25: test_runs[9b7e2dc2dc4f29b0]::aa_aa::generate_aa_aa_helicity_family<unknown>
  117. 164.79 s gammaloop-nextest-integration> at <unknown source file>:<unknown line>
  118. 164.79 s gammaloop-nextest-integration> 26: <test_runs[9b7e2dc2dc4f29b0]::aa_aa::important::aa_aa_local_inspect_backend_consistency::{closure#0} as core[940e698046960fd5]::ops::function::FnOnce<()>>::call_once<unknown>
  119. 164.79 s gammaloop-nextest-integration> at <unknown source file>:<unknown line>
  120. 164.79 s gammaloop-nextest-integration> 27: serial_test[cd99724524a2f1c0]::serial_code_lock::local_serial_core_with_return::<(), eyre[cb2fd339c0c40fca]::Report><unknown>
  121. 164.79 s gammaloop-nextest-integration> at <unknown source file>:<unknown line>
  122. 164.79 s gammaloop-nextest-integration> 28: <test_runs[9b7e2dc2dc4f29b0]::aa_aa::important::aa_aa_local_inspect_backend_consistency::{closure#0} as core[940e698046960fd5]::ops::function::FnOnce<()>>::call_once<unknown>
  123. 164.79 s gammaloop-nextest-integration> at <unknown source file>:<unknown line>
  124. 164.79 s gammaloop-nextest-integration> 29: test[75d6903177b1d7e9]::__rust_begin_short_backtrace::<core[940e698046960fd5]::result::Result<(), alloc[2ea6bcb46fca0c42]::string::String>, fn() -> core[940e698046960fd5]::result::Result<(), alloc[2ea6bcb46fca0c42]::string::String>><unknown>
  125. 164.79 s gammaloop-nextest-integration> at <unknown source file>:<unknown line>
  126. 164.79 s gammaloop-nextest-integration> 30: test[75d6903177b1d7e9]::run_test::{closure#0}<unknown>
  127. 164.79 s gammaloop-nextest-integration> at <unknown source file>:<unknown line>
  128. 164.79 s gammaloop-nextest-integration> 31: std[bcb96dfbba0ab899]::sys::backtrace::__rust_begin_short_backtrace::<test[75d6903177b1d7e9]::run_test::{closure#1}, ()><unknown>
  129. 164.79 s gammaloop-nextest-integration> at <unknown source file>:<unknown line>
  130. 164.79 s gammaloop-nextest-integration> 32: <std[bcb96dfbba0ab899]::thread::lifecycle::spawn_unchecked<test[75d6903177b1d7e9]::run_test::{closure#1}, ()>::{closure#1} as core[940e698046960fd5]::ops::function::FnOnce<()>>::call_once::{shim:vtable#0}<unknown>
  131. 164.79 s gammaloop-nextest-integration> at <unknown source file>:<unknown line>
  132. 164.79 s gammaloop-nextest-integration> 33: <std[bcb96dfbba0ab899]::sys::thread::unix::Thread>::new::thread_start<unknown>
  133. 164.79 s gammaloop-nextest-integration> at <unknown source file>:<unknown line>
  134. 164.79 s gammaloop-nextest-integration> 34: start_thread<unknown>
  135. 164.79 s gammaloop-nextest-integration> at <unknown source file>:<unknown line>
  136. 164.79 s gammaloop-nextest-integration> 35: __clone3<unknown>
  137. 164.79 s gammaloop-nextest-integration> at <unknown source file>:<unknown line>
  138. 164.79 s gammaloop-nextest-integration>
  139. 164.79 s gammaloop-nextest-integration> Run with COLORBT_SHOW_HIDDEN=1 environment variable to disable frame filtering.
  140. 164.79 s gammaloop-nextest-integration> Run with RUST_BACKTRACE=full to include source snippets.
  141. 164.79 s gammaloop-nextest-integration> Warning: SpanTrace capture is Unsupported.
  142. 164.79 s gammaloop-nextest-integration> Ensure that you've setup a tracing-error ErrorLayer and the semver versions are compatible
  143. 164.79 s gammaloop-nextest-integration>
  144. 222.94 s gammaloop-nextest-integration> FAIL [ 3.759s] (157/170) gammaloop-integration-tests::uv thermal_sunrise_uv
  145. 222.94 s gammaloop-nextest-integration> stdout ---
  146. 222.94 s gammaloop-nextest-integration>
  147. 222.94 s gammaloop-nextest-integration> running 1 test
  148. 222.94 s gammaloop-nextest-integration> test thermal_sunrise_uv ... FAILED
  149. 222.94 s gammaloop-nextest-integration>
  150. 222.94 s gammaloop-nextest-integration> failures:
  151. 222.94 s gammaloop-nextest-integration>
  152. 222.94 s gammaloop-nextest-integration> failures:
  153. 222.94 s gammaloop-nextest-integration> thermal_sunrise_uv
  154. 222.94 s gammaloop-nextest-integration>
  155. 222.94 s gammaloop-nextest-integration> test result: FAILED. 0 passed; 1 failed; 0 ignored; 0 measured; 31 filtered out; finished in 3.75s
  156. 222.94 s gammaloop-nextest-integration>
  157. 222.94 s gammaloop-nextest-integration> stderr ---
  158. 222.94 s gammaloop-nextest-integration> [2026-09-23 20:47:45.035] @gammaloop_api::se... INFO : Running command run generate
  159. 222.94 s gammaloop-nextest-integration> [2026-09-23 20:47:45.035] @gammaloop_api::se... INFO : Starting command block generate
  160. 222.94 s gammaloop-nextest-integration> [2026-09-23 20:47:45.036] @gammaloop_api::se... INFO : Running command import model sm-default.json
  161. 222.94 s gammaloop-nextest-integration> [2026-09-23 20:47:45.036] @import::model INFO : Loading built-in JSON model sm-default
  162. 222.94 s gammaloop-nextest-integration> [2026-09-23 20:47:45.070] @gammalooprs::model INFO : The following 15 external parameters were forced to zero by the restriction card:
  163. 222.94 s gammaloop-nextest-integration> lamWS, AWS, rhoWS, etaWS, ymc, yme, ymm, MC, Me, MM, WTau, muQ, muLe, muLmu, muLtau
  164. 222.94 s gammaloop-nextest-integration> [2026-09-23 20:47:45.071] @gammalooprs::model INFO : The following 34 vertex rules were removed by the restriction card:
  165. 222.94 s gammaloop-nextest-integration> V_82 -> (c~, d, G+) | V_83 -> (t~, d, G+) | V_84 -> (c~, s, G+) | V_85 -> (t~, s, G+) | V_86 -> (u~, b, G+) | V_87 -> (c~, b, G+) | V_90 -> (c~, d, W+) | V_91 -> (t~, d, W+) | V_92 -> (u~, s, W+) | V_94 -> (t~, s, W+) | V_95 -> (u~, b, W+) | V_96 -> (c~, b, W+) | V_101 -> (e+, e-, G0) | V_102 -> (mu+, mu-, G0) | V_104 -> (e+, e-, H) | V_105 -> (mu+, mu-, H) | V_110 -> (ve~, e-, G+) | V_111 -> (vm~, mu-, G+) | V_116 -> (b~, u, G-) | V_117 -> (d~, c, G-) | V_118 -> (s~, c, G-) | V_119 -> (b~, c, G-) | V_120 -> (d~, t, G-) | V_121 -> (s~, t, G-) | V_124 -> (s~, u, W-) | V_125 -> (b~, u, W-) | V_126 -> (d~, c, W-) | V_128 -> (b~, c, W-) | V_129 -> (d~, t, W-) | V_130 -> (s~, t, W-) | V_138 -> (c~, c, G0) | V_140 -> (c~, c, H) | V_145 -> (e+, ve, G-) | V_146 -> (mu+, vm, G-)
  166. 222.94 s gammaloop-nextest-integration> [2026-09-23 20:47:45.071] @gammalooprs::model INFO : The following 36 couplings were removed by the restriction card:
  167. 222.94 s gammaloop-nextest-integration> GC_13, GC_14, GC_16, GC_17, GC_18, GC_19, GC_20, GC_22, GC_23, GC_24, GC_25, GC_26, GC_28, GC_29, GC_42, GC_43, GC_44, GC_46, GC_47, GC_48, GC_84, GC_85, GC_86, GC_87, GC_88, GC_89, GC_90, GC_91, GC_92, GC_93, GC_101, GC_102, GC_103, GC_105, GC_106, GC_107
  168. 222.94 s gammaloop-nextest-integration> [2026-09-23 20:47:45.071] @gammaloop_api::se... INFO : Running command remove processes
  169. 222.94 s gammaloop-nextest-integration> [2026-09-23 20:47:45.071] @gammaloop_api::se... INFO : Running command generate amp {} > {} [{2}] | g u
  170. 222.94 s gammaloop-nextest-integration> --numerator-grouping group_identical_graphs_up_to_scalar_rescaling
  171. 222.94 s gammaloop-nextest-integration> --max-n-bridges 0
  172. 222.94 s gammaloop-nextest-integration> --number-of-factorized-loop-subtopologies 1 1
  173. 222.94 s gammaloop-nextest-integration> --number-of-anticommutating-loops 1 1
  174. 222.94 s gammaloop-nextest-integration> [...]
  175. 222.94 s gammaloop-nextest-integration> [2026-09-23 20:47:45.073] @feyngen::diagram_... INFO : 0s | Δ=0s | Starting Feynman graph generation with Symbolica...
  176. 222.94 s gammaloop-nextest-integration> [2026-09-23 20:47:45.073] @feyngen::diagram_... INFO : 0s | Δ=0s | Number of graphs resulting from Symbolica generation: 3
  177. 222.94 s gammaloop-nextest-integration> [2026-09-23 20:47:45.073] @feyngen::diagram_... INFO : 0s | Δ=0s | Number of graphs retained after removal of vetoed topologies: 2
  178. 222.94 s gammaloop-nextest-integration> [2026-09-23 20:47:45.073] @feyngen::diagram_... INFO : 0s | Δ=0s | Number of graphs after vertex info assignment: 2
  179. 222.94 s gammaloop-nextest-integration> [2026-09-23 20:47:45.073] @feyngen::diagram_... INFO : 0s | Δ=0s | Number of graphs after all complete graphs filters are applied: 2
  180. 222.94 s gammaloop-nextest-integration> [2026-09-23 20:47:45.073] @feyngen::diagram_... INFO : 0s | Δ=0s | Number of graphs after closed anticommutating chains analysis: 1
  181. 222.94 s gammaloop-nextest-integration> [2026-09-23 20:47:45.073] @feyngen::diagram_... INFO : 0s | Δ=0s | Number of graphs after symmetrization of external states: 1
  182. 222.94 s gammaloop-nextest-integration> [2026-09-23 20:47:45.073] @feyngen::diagram_... INFO : 0s | Δ=0s | Number of graphs after canonization of vertices, edges and flows (graph labels assigned here): 1
  183. 222.94 s gammaloop-nextest-integration> [2026-09-23 20:47:45.089] @feyngen::diagram_... INFO : 0s | Δ=0s | Number of graphs after numerator-aware grouping with strategy 'up to a scalar rescaling': 1 (1 isomorphically unique graph, 0 color zero, 0 lorentz zero, 0 grouped and 0 cancellation)
  184. 222.94 s gammaloop-nextest-integration> [2026-09-23 20:47:45.089] @feyngen::diagram_... INFO : ( Sum of the symmetry factors from each graph generated = -1/2 )
  185. 222.94 s gammaloop-nextest-integration> [2026-09-23 20:47:45.089] @commands::generate INFO : Generated amplitude 1 graphs.
  186. 222.94 s gammaloop-nextest-integration> [2026-09-23 20:47:45.089] @commands::generate INFO : Only diagram generation was requested, skipping integrand generation. You can generate integrands later using the 'generate existing <options>' command.
  187. 222.94 s gammaloop-nextest-integration> [2026-09-23 20:47:45.089] @gammaloop_api::se... INFO : Running command generate
  188. 222.94 s gammaloop-nextest-integration> The application panicked (crashed).
  189. 222.94 s gammaloop-nextest-integration> Message: label _func_power_ not found
  190. 222.94 s gammaloop-nextest-integration> Location: /nix/store/n9w914kh1cm59xx3spcs831cdyb56m32-vendor-cargo-deps/c19b7c6f923b580ac259164a89f2577984ad5ab09ee9d583b888f934adbbe8d0/symjit-2.25.6/src/symjit/assembler.rs:77
  191. 222.94 s gammaloop-nextest-integration>
  192. 222.94 s gammaloop-nextest-integration> ━━━━━━━━━━━━━━━━━━━━━━━━━━━━━━━━━━ BACKTRACE ━━━━━━━━━━━━━━━━━━━━━━━━━━━━━━━━━━━
  193. 222.94 s gammaloop-nextest-integration> 1: <color_eyre[51793ea62743adbd]::config::PanicHook>::panic_report<unknown>
  194. 222.94 s gammaloop-nextest-integration> at <unknown source file>:<unknown line>
  195. 222.94 s gammaloop-nextest-integration> 2: <color_eyre[51793ea62743adbd]::config::PanicHook>::into_panic_hook::{closure#0}<unknown>
  196. 222.94 s gammaloop-nextest-integration> at <unknown source file>:<unknown line>
  197. 222.94 s gammaloop-nextest-integration> 3: std[bcb96dfbba0ab899]::panicking::panic_with_hook<unknown>
  198. 222.94 s gammaloop-nextest-integration> at <unknown source file>:<unknown line>
  199. 222.94 s gammaloop-nextest-integration> 4: std[bcb96dfbba0ab899]::panicking::panic_handler::{closure#0}<unknown>
  200. 222.94 s gammaloop-nextest-integration> at <unknown source file>:<unknown line>
  201. 222.94 s gammaloop-nextest-integration> 5: std[bcb96dfbba0ab899]::sys::backtrace::__rust_end_short_backtrace::<std[bcb96dfbba0ab899]::panicking::panic_handler::{closure#0}, !><unknown>
  202. 222.94 s gammaloop-nextest-integration> at <unknown source file>:<unknown line>
  203. 222.94 s gammaloop-nextest-integration> 6: __rustc[6c289b9f9c454d21]::rust_begin_unwind<unknown>
  204. 222.94 s gammaloop-nextest-integration> at <unknown source file>:<unknown line>
  205. 222.94 s gammaloop-nextest-integration> 7: core[940e698046960fd5]::panicking::panic_fmt<unknown>
  206. 222.94 s gammaloop-nextest-integration> at <unknown source file>:<unknown line>
  207. 222.94 s gammaloop-nextest-integration> 8: <symjit[e408de789c333cd]::symjit::assembler::Assembler>::apply_jumps<unknown>
  208. 222.94 s gammaloop-nextest-integration> at <unknown source file>:<unknown line>
  209. 222.94 s gammaloop-nextest-integration> 9: <symjit[e408de789c333cd]::symjit::builder::Builder>::compile_from_mir::<symjit[e408de789c333cd]::symjit::amd::complex::AmdComplexGenerator><unknown>
  210. 222.94 s gammaloop-nextest-integration> at <unknown source file>:<unknown line>
  211. 222.94 s gammaloop-nextest-integration> 10: <symjit[e408de789c333cd]::symjit::runnable::Application>::compile_ty<unknown>
  212. 222.94 s gammaloop-nextest-integration> at <unknown source file>:<unknown line>
  213. 222.94 s gammaloop-nextest-integration> 11: <symjit[e408de789c333cd]::symjit::runnable::Application>::with_mir<unknown>
  214. 222.94 s gammaloop-nextest-integration> at <unknown source file>:<unknown line>
  215. 222.94 s gammaloop-nextest-integration> 12: <symjit[e408de789c333cd]::symjit::composer::DirectTranslator as symjit[e408de789c333cd]::symjit::composer::Composer>::compile<unknown>
  216. 222.94 s gammaloop-nextest-integration> at <unknown source file>:<unknown line>
  217. 222.94 s gammaloop-nextest-integration> 13: <symjit[e408de789c333cd]::symjit::compiler::Translator as symjit[e408de789c333cd]::symjit::composer::Composer>::compile<unknown>
  218. 222.94 s gammaloop-nextest-integration> at <unknown source file>:<unknown line>
  219. 222.94 s gammaloop-nextest-integration> 14: <numerica[124dab8567f4861e]::domains::float::complex::Complex<f64> as symbolica[10e259bab675d243]::evaluate::backend::JITCompiledNumber>::jit_compile<unknown>
  220. 222.94 s gammaloop-nextest-integration> at <unknown source file>:<unknown line>
  221. 222.94 s gammaloop-nextest-integration> 15: <gammalooprs[917cbd3df9e68f8f]::integrands::process::evaluators::GenericEvaluator>::activate_symjit<unknown>
  222. 222.94 s gammaloop-nextest-integration> at <unknown source file>:<unknown line>
  223. 222.94 s gammaloop-nextest-integration> 16: <gammalooprs[917cbd3df9e68f8f]::integrands::process::amplitude::AmplitudeIntegrand>::prepare_runtime_backends_after_generation_with_compile_times<unknown>
  224. 222.94 s gammaloop-nextest-integration> at <unknown source file>:<unknown line>
  225. 222.94 s gammaloop-nextest-integration> 17: <gammalooprs[917cbd3df9e68f8f]::processes::amplitude::Amplitude>::build_integrand<unknown>
  226. 222.94 s gammaloop-nextest-integration> at <unknown source file>:<unknown line>
  227. 222.94 s gammaloop-nextest-integration> 18: <gammalooprs[917cbd3df9e68f8f]::processes::process::Process>::generate_integrands<unknown>
  228. 222.94 s gammaloop-nextest-integration> at <unknown source file>:<unknown line>
  229. 222.94 s gammaloop-nextest-integration> 19: <gammalooprs[917cbd3df9e68f8f]::processes::ProcessList>::generate_integrands<unknown>
  230. 222.94 s gammaloop-nextest-integration> at <unknown source file>:<unknown line>
  231. 222.94 s gammaloop-nextest-integration> 20: <gammaloop_api[9ebf6628f97aeb57]::state::State>::generate_integrands<unknown>
  232. 222.94 s gammaloop-nextest-integration> at <unknown source file>:<unknown line>
  233. 222.94 s gammaloop-nextest-integration> 21: <gammaloop_api[9ebf6628f97aeb57]::commands::generate::Generate>::run::<&std[bcb96dfbba0ab899]::path::PathBuf><unknown>
  234. 222.94 s gammaloop-nextest-integration> at <unknown source file>:<unknown line>
  235. 222.94 s gammaloop-nextest-integration> 22: <gammaloop_api[9ebf6628f97aeb57]::commands::Commands>::run<unknown>
  236. 222.94 s gammaloop-nextest-integration> at <unknown source file>:<unknown line>
  237. 222.94 s gammaloop-nextest-integration> 23: <gammaloop_api[9ebf6628f97aeb57]::session::CliSession>::execute_prepared<unknown>
  238. 222.94 s gammaloop-nextest-integration> at <unknown source file>:<unknown line>
  239. 222.95 s gammaloop-nextest-integration> 24: <gammaloop_api[9ebf6628f97aeb57]::session::CliSession>::execute_prepared_commands<unknown>
  240. 222.95 s gammaloop-nextest-integration> at <unknown source file>:<unknown line>
  241. 222.95 s gammaloop-nextest-integration> 25: <gammaloop_api[9ebf6628f97aeb57]::session::CliSession>::execute_prepared<unknown>
  242. 222.95 s gammaloop-nextest-integration> at <unknown source file>:<unknown line>
  243. 222.95 s gammaloop-nextest-integration> 26: <gammaloop_api[9ebf6628f97aeb57]::session::CliSession>::execute_command<unknown>
  244. 222.95 s gammaloop-nextest-integration> at <unknown source file>:<unknown line>
  245. 222.95 s gammaloop-nextest-integration> 27: <gammaloop_integration_tests[191607b70c61cd5a]::CLIState>::run_command<unknown>
  246. 222.95 s gammaloop-nextest-integration> at <unknown source file>:<unknown line>
  247. 222.95 s gammaloop-nextest-integration> 28: uv[3c7454ef256d6487]::run_single_integrated_uv_case<unknown>
  248. 222.95 s gammaloop-nextest-integration> at <unknown source file>:<unknown line>
  249. 222.95 s gammaloop-nextest-integration> 29: <uv[3c7454ef256d6487]::thermal_sunrise_uv::{closure#0} as core[940e698046960fd5]::ops::function::FnOnce<()>>::call_once<unknown>
  250. 222.95 s gammaloop-nextest-integration> at <unknown source file>:<unknown line>
  251. 222.95 s gammaloop-nextest-integration> 30: test[75d6903177b1d7e9]::__rust_begin_short_backtrace::<core[940e698046960fd5]::result::Result<(), alloc[2ea6bcb46fca0c42]::string::String>, fn() -> core[940e698046960fd5]::result::Result<(), alloc[2ea6bcb46fca0c42]::string::String>><unknown>
  252. 222.95 s gammaloop-nextest-integration> at <unknown source file>:<unknown line>
  253. 222.95 s gammaloop-nextest-integration> 31: test[75d6903177b1d7e9]::run_test::{closure#0}<unknown>
  254. 222.95 s gammaloop-nextest-integration> at <unknown source file>:<unknown line>
  255. 222.95 s gammaloop-nextest-integration> 32: std[bcb96dfbba0ab899]::sys::backtrace::__rust_begin_short_backtrace::<test[75d6903177b1d7e9]::run_test::{closure#1}, ()><unknown>
  256. 222.95 s gammaloop-nextest-integration> at <unknown source file>:<unknown line>
  257. 222.95 s gammaloop-nextest-integration> 33: <std[bcb96dfbba0ab899]::thread::lifecycle::spawn_unchecked<test[75d6903177b1d7e9]::run_test::{closure#1}, ()>::{closure#1} as core[940e698046960fd5]::ops::function::FnOnce<()>>::call_once::{shim:vtable#0}<unknown>
  258. 222.95 s gammaloop-nextest-integration> at <unknown source file>:<unknown line>
  259. 222.95 s gammaloop-nextest-integration> 34: <std[bcb96dfbba0ab899]::sys::thread::unix::Thread>::new::thread_start<unknown>
  260. 222.95 s gammaloop-nextest-integration> at <unknown source file>:<unknown line>
  261. 222.95 s gammaloop-nextest-integration> 35: start_thread<unknown>
  262. 222.95 s gammaloop-nextest-integration> at <unknown source file>:<unknown line>
  263. 222.95 s gammaloop-nextest-integration> 36: __clone3<unknown>
  264. 222.95 s gammaloop-nextest-integration> at <unknown source file>:<unknown line>
  265. 222.95 s gammaloop-nextest-integration>
  266. 222.95 s gammaloop-nextest-integration> Run with COLORBT_SHOW_HIDDEN=1 environment variable to disable frame filtering.
  267. 222.95 s gammaloop-nextest-integration> Run with RUST_BACKTRACE=full to include source snippets.
  268. 222.95 s gammaloop-nextest-integration> Warning: SpanTrace capture is Unsupported.
  269. 222.95 s gammaloop-nextest-integration> Ensure that you've setup a tracing-error ErrorLayer and the semver versions are compatible
  270. 222.95 s gammaloop-nextest-integration>
  271. 289.46 s gammaloop-nextest-integration> ------------
  272. 289.46 s gammaloop-nextest-integration> Summary [ 252.442s] 170 tests run: 168 passed, 2 failed, 209 skipped
  273. 289.46 s gammaloop-nextest-integration> FAIL [ 3.444s] ( 55/170) gammaloop-integration-tests::test_runs aa_aa::important::aa_aa_local_inspect_backend_consistency
  274. 289.46 s gammaloop-nextest-integration> stdout ---
  275. 289.46 s gammaloop-nextest-integration>
  276. 289.46 s gammaloop-nextest-integration> running 1 test
  277. 289.46 s gammaloop-nextest-integration> test aa_aa::important::aa_aa_local_inspect_backend_consistency ... FAILED
  278. 289.46 s gammaloop-nextest-integration>
  279. 289.46 s gammaloop-nextest-integration> failures:
  280. 289.46 s gammaloop-nextest-integration>
  281. 289.46 s gammaloop-nextest-integration> failures:
  282. 289.46 s gammaloop-nextest-integration> aa_aa::important::aa_aa_local_inspect_backend_consistency
  283. 289.46 s gammaloop-nextest-integration>
  284. 289.46 s gammaloop-nextest-integration> test result: FAILED. 0 passed; 1 failed; 0 ignored; 0 measured; 274 filtered out; finished in 3.42s
  285. 289.46 s gammaloop-nextest-integration>
  286. 289.46 s gammaloop-nextest-integration> stderr ---
  287. 289.46 s gammaloop-nextest-integration> [2026-09-23 20:46:47.181] @gammaloop_api::se... INFO : Running command import model sm-default.json
  288. 289.46 s gammaloop-nextest-integration> [2026-09-23 20:46:47.181] @import::model INFO : Loading built-in JSON model sm-default
  289. 289.46 s gammaloop-nextest-integration> [2026-09-23 20:46:47.208] @gammalooprs::model INFO : The following 15 external parameters were forced to zero by the restriction card:
  290. 289.46 s gammaloop-nextest-integration> lamWS, AWS, rhoWS, etaWS, ymc, yme, ymm, MC, Me, MM, WTau, muQ, muLe, muLmu, muLtau
  291. 289.46 s gammaloop-nextest-integration> [2026-09-23 20:46:47.209] @gammalooprs::model INFO : The following 34 vertex rules were removed by the restriction card:
  292. 289.46 s gammaloop-nextest-integration> V_82 -> (c~, d, G+) | V_83 -> (t~, d, G+) | V_84 -> (c~, s, G+) | V_85 -> (t~, s, G+) | V_86 -> (u~, b, G+) | V_87 -> (c~, b, G+) | V_90 -> (c~, d, W+) | V_91 -> (t~, d, W+) | V_92 -> (u~, s, W+) | V_94 -> (t~, s, W+) | V_95 -> (u~, b, W+) | V_96 -> (c~, b, W+) | V_101 -> (e+, e-, G0) | V_102 -> (mu+, mu-, G0) | V_104 -> (e+, e-, H) | V_105 -> (mu+, mu-, H) | V_110 -> (ve~, e-, G+) | V_111 -> (vm~, mu-, G+) | V_116 -> (b~, u, G-) | V_117 -> (d~, c, G-) | V_118 -> (s~, c, G-) | V_119 -> (b~, c, G-) | V_120 -> (d~, t, G-) | V_121 -> (s~, t, G-) | V_124 -> (s~, u, W-) | V_125 -> (b~, u, W-) | V_126 -> (d~, c, W-) | V_128 -> (b~, c, W-) | V_129 -> (d~, t, W-) | V_130 -> (s~, t, W-) | V_138 -> (c~, c, G0) | V_140 -> (c~, c, H) | V_145 -> (e+, ve, G-) | V_146 -> (mu+, vm, G-)
  293. 289.46 s gammaloop-nextest-integration> [2026-09-23 20:46:47.209] @gammalooprs::model INFO : The following 36 couplings were removed by the restriction card:
  294. 289.46 s gammaloop-nextest-integration> GC_13, GC_14, GC_16, GC_17, GC_18, GC_19, GC_20, GC_22, GC_23, GC_24, GC_25, GC_26, GC_28, GC_29, GC_42, GC_43, GC_44, GC_46, GC_47, GC_48, GC_84, GC_85, GC_86, GC_87, GC_88, GC_89, GC_90, GC_91, GC_92, GC_93, GC_101, GC_102, GC_103, GC_105, GC_106, GC_107
  295. 289.46 s gammaloop-nextest-integration> [2026-09-23 20:46:47.209] @gammaloop_api::se... INFO : Running command run set_model_parameters
  296. 289.46 s gammaloop-nextest-integration> [2026-09-23 20:46:47.209] @gammaloop_api::se... INFO : Starting command block set_model_parameters
  297. 289.46 s gammaloop-nextest-integration> [2026-09-23 20:46:47.210] @gammaloop_api::se... INFO : Running command set model MT=173.0
  298. 289.46 s gammaloop-nextest-integration> [2026-09-23 20:46:47.215] @gammaloop_api::se... INFO : Running command set model WT=0.0
  299. 289.46 s gammaloop-nextest-integration> [2026-09-23 20:46:47.220] @gammaloop_api::se... INFO : Running command set model ymt=173.0
  300. 289.46 s gammaloop-nextest-integration> [2026-09-23 20:46:47.224] @gammaloop_api::se... INFO : Running command set model aS=0.118
  301. 289.46 s gammaloop-nextest-integration> [2026-09-23 20:46:47.229] @gammaloop_api::se... INFO : Running command set model aEWM1=137.036
  302. 289.46 s gammaloop-nextest-integration> [2026-09-23 20:46:47.233] @gammaloop_api::se... INFO : Running command set model Gf=1.166390e-05
  303. 289.46 s gammaloop-nextest-integration> [2026-09-23 20:46:47.238] @gammaloop_api::se... INFO : Running command set model MZ=91.188
  304. 289.46 s gammaloop-nextest-integration> [2026-09-23 20:46:47.244] @gammaloop_api::se... INFO : Running command set global string '
  305. 289.46 s gammaloop-nextest-integration> [global.generation.compile]
  306. 289.46 s gammaloop-nextest-integration> compilation_mode = "symjit"
  307. 289.46 s gammaloop-nextest-integration> optimization_level = "O0"
  308. 289.46 s gammaloop-nextest-integration> fast_math = false
  309. 289.46 s gammaloop-nextest-integration> [...]
  310. 289.46 s gammaloop-nextest-integration> [2026-09-23 20:46:47.245] @gammaloop_api::se... INFO : Running command import graphs ./examples/cli/aa_aa/1L/aa_aa_1L.dot -p aa_aa_all_helicities -i 1L_ppmm -o
  311. 289.46 s gammaloop-nextest-integration> [2026-09-23 20:46:47.245] @commands::import INFO : Loading graphs from '/build/source/examples/cli/aa_aa/1L/aa_aa_1L.dot'
  312. 289.46 s gammaloop-nextest-integration> [2026-09-23 20:46:47.256] @gammaloop_api::se... INFO : Running command generate existing -p aa_aa_all_helicities
  313. 289.46 s gammaloop-nextest-integration> The application panicked (crashed).
  314. 289.46 s gammaloop-nextest-integration> Message: label _func_power_ not found
  315. 289.46 s gammaloop-nextest-integration> Location: /nix/store/n9w914kh1cm59xx3spcs831cdyb56m32-vendor-cargo-deps/c19b7c6f923b580ac259164a89f2577984ad5ab09ee9d583b888f934adbbe8d0/symjit-2.25.6/src/symjit/assembler.rs:77
  316. 289.46 s gammaloop-nextest-integration>
  317. 289.46 s gammaloop-nextest-integration> ━━━━━━━━━━━━━━━━━━━━━━━━━━━━━━━━━━ BACKTRACE ━━━━━━━━━━━━━━━━━━━━━━━━━━━━━━━━━━━
  318. 289.46 s gammaloop-nextest-integration> 1: <color_eyre[51793ea62743adbd]::config::PanicHook>::panic_report<unknown>
  319. 289.46 s gammaloop-nextest-integration> at <unknown source file>:<unknown line>
  320. 289.46 s gammaloop-nextest-integration> 2: <color_eyre[51793ea62743adbd]::config::PanicHook>::into_panic_hook::{closure#0}<unknown>
  321. 289.46 s gammaloop-nextest-integration> at <unknown source file>:<unknown line>
  322. 289.46 s gammaloop-nextest-integration> 3: std[bcb96dfbba0ab899]::panicking::panic_with_hook<unknown>
  323. 289.46 s gammaloop-nextest-integration> at <unknown source file>:<unknown line>
  324. 289.46 s gammaloop-nextest-integration> 4: std[bcb96dfbba0ab899]::panicking::panic_handler::{closure#0}<unknown>
  325. 289.46 s gammaloop-nextest-integration> at <unknown source file>:<unknown line>
  326. 289.46 s gammaloop-nextest-integration> 5: std[bcb96dfbba0ab899]::sys::backtrace::__rust_end_short_backtrace::<std[bcb96dfbba0ab899]::panicking::panic_handler::{closure#0}, !><unknown>
  327. 289.46 s gammaloop-nextest-integration> at <unknown source file>:<unknown line>
  328. 289.46 s gammaloop-nextest-integration> 6: __rustc[6c289b9f9c454d21]::rust_begin_unwind<unknown>
  329. 289.46 s gammaloop-nextest-integration> at <unknown source file>:<unknown line>
  330. 289.46 s gammaloop-nextest-integration> 7: core[940e698046960fd5]::panicking::panic_fmt<unknown>
  331. 289.46 s gammaloop-nextest-integration> at <unknown source file>:<unknown line>
  332. 289.46 s gammaloop-nextest-integration> 8: <symjit[e408de789c333cd]::symjit::assembler::Assembler>::apply_jumps<unknown>
  333. 289.46 s gammaloop-nextest-integration> at <unknown source file>:<unknown line>
  334. 289.46 s gammaloop-nextest-integration> 9: <symjit[e408de789c333cd]::symjit::builder::Builder>::compile_from_mir::<symjit[e408de789c333cd]::symjit::amd::complex::AmdComplexGenerator><unknown>
  335. 289.46 s gammaloop-nextest-integration> at <unknown source file>:<unknown line>
  336. 289.46 s gammaloop-nextest-integration> 10: <symjit[e408de789c333cd]::symjit::runnable::Application>::compile_ty<unknown>
  337. 289.46 s gammaloop-nextest-integration> at <unknown source file>:<unknown line>
  338. 289.46 s gammaloop-nextest-integration> 11: <symjit[e408de789c333cd]::symjit::runnable::Application>::with_mir<unknown>
  339. 289.46 s gammaloop-nextest-integration> at <unknown source file>:<unknown line>
  340. 289.46 s gammaloop-nextest-integration> 12: <symjit[e408de789c333cd]::symjit::composer::DirectTranslator as symjit[e408de789c333cd]::symjit::composer::Composer>::compile<unknown>
  341. 289.46 s gammaloop-nextest-integration> at <unknown source file>:<unknown line>
  342. 289.46 s gammaloop-nextest-integration> 13: <symjit[e408de789c333cd]::symjit::compiler::Translator as symjit[e408de789c333cd]::symjit::composer::Composer>::compile<unknown>
  343. 289.46 s gammaloop-nextest-integration> at <unknown source file>:<unknown line>
  344. 289.46 s gammaloop-nextest-integration> 14: <numerica[124dab8567f4861e]::domains::float::complex::Complex<f64> as symbolica[10e259bab675d243]::evaluate::backend::JITCompiledNumber>::jit_compile<unknown>
  345. 289.46 s gammaloop-nextest-integration> at <unknown source file>:<unknown line>
  346. 289.46 s gammaloop-nextest-integration> 15: <gammalooprs[917cbd3df9e68f8f]::integrands::process::evaluators::GenericEvaluator>::activate_symjit<unknown>
  347. 289.46 s gammaloop-nextest-integration> at <unknown source file>:<unknown line>
  348. 289.46 s gammaloop-nextest-integration> 16: <gammalooprs[917cbd3df9e68f8f]::integrands::process::amplitude::AmplitudeIntegrand>::prepare_runtime_backends_after_generation_with_compile_times<unknown>
  349. 289.46 s gammaloop-nextest-integration> at <unknown source file>:<unknown line>
  350. 289.46 s gammaloop-nextest-integration> 17: <gammalooprs[917cbd3df9e68f8f]::processes::amplitude::Amplitude>::build_integrand<unknown>
  351. 289.46 s gammaloop-nextest-integration> at <unknown source file>:<unknown line>
  352. 289.46 s gammaloop-nextest-integration> 18: <gammalooprs[917cbd3df9e68f8f]::processes::process::Process>::generate_integrands<unknown>
  353. 289.46 s gammaloop-nextest-integration> at <unknown source file>:<unknown line>
  354. 289.46 s gammaloop-nextest-integration> 19: <gammaloop_api[9ebf6628f97aeb57]::state::State>::generate_integrand<unknown>
  355. 289.46 s gammaloop-nextest-integration> at <unknown source file>:<unknown line>
  356. 289.46 s gammaloop-nextest-integration> 20: <gammaloop_api[9ebf6628f97aeb57]::commands::generate::Generate>::run::<&std[bcb96dfbba0ab899]::path::PathBuf><unknown>
  357. 289.46 s gammaloop-nextest-integration> at <unknown source file>:<unknown line>
  358. 289.46 s gammaloop-nextest-integration> 21: <gammaloop_api[9ebf6628f97aeb57]::commands::Commands>::run<unknown>
  359. 289.46 s gammaloop-nextest-integration> at <unknown source file>:<unknown line>
  360. 289.46 s gammaloop-nextest-integration> 22: <gammaloop_api[9ebf6628f97aeb57]::session::CliSession>::execute_prepared<unknown>
  361. 289.46 s gammaloop-nextest-integration> at <unknown source file>:<unknown line>
  362. 289.46 s gammaloop-nextest-integration> 23: <gammaloop_api[9ebf6628f97aeb57]::session::CliSession>::execute_command<unknown>
  363. 289.46 s gammaloop-nextest-integration> at <unknown source file>:<unknown line>
  364. 289.46 s gammaloop-nextest-integration> 24: <gammaloop_integration_tests[191607b70c61cd5a]::CLIState>::run_command<unknown>
  365. 289.46 s gammaloop-nextest-integration> at <unknown source file>:<unknown line>
  366. 289.46 s gammaloop-nextest-integration> 25: test_runs[9b7e2dc2dc4f29b0]::aa_aa::generate_aa_aa_helicity_family<unknown>
  367. 289.46 s gammaloop-nextest-integration> at <unknown source file>:<unknown line>
  368. 289.46 s gammaloop-nextest-integration> 26: <test_runs[9b7e2dc2dc4f29b0]::aa_aa::important::aa_aa_local_inspect_backend_consistency::{closure#0} as core[940e698046960fd5]::ops::function::FnOnce<()>>::call_once<unknown>
  369. 289.46 s gammaloop-nextest-integration> at <unknown source file>:<unknown line>
  370. 289.46 s gammaloop-nextest-integration> 27: serial_test[cd99724524a2f1c0]::serial_code_lock::local_serial_core_with_return::<(), eyre[cb2fd339c0c40fca]::Report><unknown>
  371. 289.46 s gammaloop-nextest-integration> at <unknown source file>:<unknown line>
  372. 289.46 s gammaloop-nextest-integration> 28: <test_runs[9b7e2dc2dc4f29b0]::aa_aa::important::aa_aa_local_inspect_backend_consistency::{closure#0} as core[940e698046960fd5]::ops::function::FnOnce<()>>::call_once<unknown>
  373. 289.46 s gammaloop-nextest-integration> at <unknown source file>:<unknown line>
  374. 289.46 s gammaloop-nextest-integration> 29: test[75d6903177b1d7e9]::__rust_begin_short_backtrace::<core[940e698046960fd5]::result::Result<(), alloc[2ea6bcb46fca0c42]::string::String>, fn() -> core[940e698046960fd5]::result::Result<(), alloc[2ea6bcb46fca0c42]::string::String>><unknown>
  375. 289.46 s gammaloop-nextest-integration> at <unknown source file>:<unknown line>
  376. 289.46 s gammaloop-nextest-integration> 30: test[75d6903177b1d7e9]::run_test::{closure#0}<unknown>
  377. 289.46 s gammaloop-nextest-integration> at <unknown source file>:<unknown line>
  378. 289.46 s gammaloop-nextest-integration> 31: std[bcb96dfbba0ab899]::sys::backtrace::__rust_begin_short_backtrace::<test[75d6903177b1d7e9]::run_test::{closure#1}, ()><unknown>
  379. 289.46 s gammaloop-nextest-integration> at <unknown source file>:<unknown line>
  380. 289.46 s gammaloop-nextest-integration> 32: <std[bcb96dfbba0ab899]::thread::lifecycle::spawn_unchecked<test[75d6903177b1d7e9]::run_test::{closure#1}, ()>::{closure#1} as core[940e698046960fd5]::ops::function::FnOnce<()>>::call_once::{shim:vtable#0}<unknown>
  381. 289.46 s gammaloop-nextest-integration> at <unknown source file>:<unknown line>
  382. 289.46 s gammaloop-nextest-integration> 33: <std[bcb96dfbba0ab899]::sys::thread::unix::Thread>::new::thread_start<unknown>
  383. 289.46 s gammaloop-nextest-integration> at <unknown source file>:<unknown line>
  384. 289.46 s gammaloop-nextest-integration> 34: start_thread<unknown>
  385. 289.46 s gammaloop-nextest-integration> at <unknown source file>:<unknown line>
  386. 289.46 s gammaloop-nextest-integration> 35: __clone3<unknown>
  387. 289.46 s gammaloop-nextest-integration> at <unknown source file>:<unknown line>
  388. 289.46 s gammaloop-nextest-integration>
  389. 289.46 s gammaloop-nextest-integration> Run with COLORBT_SHOW_HIDDEN=1 environment variable to disable frame filtering.
  390. 289.46 s gammaloop-nextest-integration> Run with RUST_BACKTRACE=full to include source snippets.
  391. 289.46 s gammaloop-nextest-integration> Warning: SpanTrace capture is Unsupported.
  392. 289.46 s gammaloop-nextest-integration> Ensure that you've setup a tracing-error ErrorLayer and the semver versions are compatible
  393. 289.46 s gammaloop-nextest-integration>
  394. 289.46 s gammaloop-nextest-integration> FAIL [ 3.759s] (157/170) gammaloop-integration-tests::uv thermal_sunrise_uv
  395. 289.47 s gammaloop-nextest-integration> stdout ---
  396. 289.47 s gammaloop-nextest-integration>
  397. 289.47 s gammaloop-nextest-integration> running 1 test
  398. 289.47 s gammaloop-nextest-integration> test thermal_sunrise_uv ... FAILED
  399. 289.47 s gammaloop-nextest-integration>
  400. 289.47 s gammaloop-nextest-integration> failures:
  401. 289.47 s gammaloop-nextest-integration>
  402. 289.47 s gammaloop-nextest-integration> failures:
  403. 289.47 s gammaloop-nextest-integration> thermal_sunrise_uv
  404. 289.47 s gammaloop-nextest-integration>
  405. 289.47 s gammaloop-nextest-integration> test result: FAILED. 0 passed; 1 failed; 0 ignored; 0 measured; 31 filtered out; finished in 3.75s
  406. 289.47 s gammaloop-nextest-integration>
  407. 289.47 s gammaloop-nextest-integration> stderr ---
  408. 289.47 s gammaloop-nextest-integration> [2026-09-23 20:47:45.035] @gammaloop_api::se... INFO : Running command run generate
  409. 289.47 s gammaloop-nextest-integration> [2026-09-23 20:47:45.035] @gammaloop_api::se... INFO : Starting command block generate
  410. 289.47 s gammaloop-nextest-integration> [2026-09-23 20:47:45.036] @gammaloop_api::se... INFO : Running command import model sm-default.json
  411. 289.47 s gammaloop-nextest-integration> [2026-09-23 20:47:45.036] @import::model INFO : Loading built-in JSON model sm-default
  412. 289.47 s gammaloop-nextest-integration> [2026-09-23 20:47:45.070] @gammalooprs::model INFO : The following 15 external parameters were forced to zero by the restriction card:
  413. 289.47 s gammaloop-nextest-integration> lamWS, AWS, rhoWS, etaWS, ymc, yme, ymm, MC, Me, MM, WTau, muQ, muLe, muLmu, muLtau
  414. 289.47 s gammaloop-nextest-integration> [2026-09-23 20:47:45.071] @gammalooprs::model INFO : The following 34 vertex rules were removed by the restriction card:
  415. 289.47 s gammaloop-nextest-integration> V_82 -> (c~, d, G+) | V_83 -> (t~, d, G+) | V_84 -> (c~, s, G+) | V_85 -> (t~, s, G+) | V_86 -> (u~, b, G+) | V_87 -> (c~, b, G+) | V_90 -> (c~, d, W+) | V_91 -> (t~, d, W+) | V_92 -> (u~, s, W+) | V_94 -> (t~, s, W+) | V_95 -> (u~, b, W+) | V_96 -> (c~, b, W+) | V_101 -> (e+, e-, G0) | V_102 -> (mu+, mu-, G0) | V_104 -> (e+, e-, H) | V_105 -> (mu+, mu-, H) | V_110 -> (ve~, e-, G+) | V_111 -> (vm~, mu-, G+) | V_116 -> (b~, u, G-) | V_117 -> (d~, c, G-) | V_118 -> (s~, c, G-) | V_119 -> (b~, c, G-) | V_120 -> (d~, t, G-) | V_121 -> (s~, t, G-) | V_124 -> (s~, u, W-) | V_125 -> (b~, u, W-) | V_126 -> (d~, c, W-) | V_128 -> (b~, c, W-) | V_129 -> (d~, t, W-) | V_130 -> (s~, t, W-) | V_138 -> (c~, c, G0) | V_140 -> (c~, c, H) | V_145 -> (e+, ve, G-) | V_146 -> (mu+, vm, G-)
  416. 289.47 s gammaloop-nextest-integration> [2026-09-23 20:47:45.071] @gammalooprs::model INFO : The following 36 couplings were removed by the restriction card:
  417. 289.47 s gammaloop-nextest-integration> GC_13, GC_14, GC_16, GC_17, GC_18, GC_19, GC_20, GC_22, GC_23, GC_24, GC_25, GC_26, GC_28, GC_29, GC_42, GC_43, GC_44, GC_46, GC_47, GC_48, GC_84, GC_85, GC_86, GC_87, GC_88, GC_89, GC_90, GC_91, GC_92, GC_93, GC_101, GC_102, GC_103, GC_105, GC_106, GC_107
  418. 289.47 s gammaloop-nextest-integration> [2026-09-23 20:47:45.071] @gammaloop_api::se... INFO : Running command remove processes
  419. 289.47 s gammaloop-nextest-integration> [2026-09-23 20:47:45.071] @gammaloop_api::se... INFO : Running command generate amp {} > {} [{2}] | g u
  420. 289.47 s gammaloop-nextest-integration> --numerator-grouping group_identical_graphs_up_to_scalar_rescaling
  421. 289.47 s gammaloop-nextest-integration> --max-n-bridges 0
  422. 289.47 s gammaloop-nextest-integration> --number-of-factorized-loop-subtopologies 1 1
  423. 289.47 s gammaloop-nextest-integration> --number-of-anticommutating-loops 1 1
  424. 289.47 s gammaloop-nextest-integration> [...]
  425. 289.47 s gammaloop-nextest-integration> [2026-09-23 20:47:45.073] @feyngen::diagram_... INFO : 0s | Δ=0s | Starting Feynman graph generation with Symbolica...
  426. 289.47 s gammaloop-nextest-integration> [2026-09-23 20:47:45.073] @feyngen::diagram_... INFO : 0s | Δ=0s | Number of graphs resulting from Symbolica generation: 3
  427. 289.47 s gammaloop-nextest-integration> [2026-09-23 20:47:45.073] @feyngen::diagram_... INFO : 0s | Δ=0s | Number of graphs retained after removal of vetoed topologies: 2
  428. 289.47 s gammaloop-nextest-integration> [2026-09-23 20:47:45.073] @feyngen::diagram_... INFO : 0s | Δ=0s | Number of graphs after vertex info assignment: 2
  429. 289.47 s gammaloop-nextest-integration> [2026-09-23 20:47:45.073] @feyngen::diagram_... INFO : 0s | Δ=0s | Number of graphs after all complete graphs filters are applied: 2
  430. 289.47 s gammaloop-nextest-integration> [2026-09-23 20:47:45.073] @feyngen::diagram_... INFO : 0s | Δ=0s | Number of graphs after closed anticommutating chains analysis: 1
  431. 289.47 s gammaloop-nextest-integration> [2026-09-23 20:47:45.073] @feyngen::diagram_... INFO : 0s | Δ=0s | Number of graphs after symmetrization of external states: 1
  432. 289.47 s gammaloop-nextest-integration> [2026-09-23 20:47:45.073] @feyngen::diagram_... INFO : 0s | Δ=0s | Number of graphs after canonization of vertices, edges and flows (graph labels assigned here): 1
  433. 289.47 s gammaloop-nextest-integration> [2026-09-23 20:47:45.089] @feyngen::diagram_... INFO : 0s | Δ=0s | Number of graphs after numerator-aware grouping with strategy 'up to a scalar rescaling': 1 (1 isomorphically unique graph, 0 color zero, 0 lorentz zero, 0 grouped and 0 cancellation)
  434. 289.47 s gammaloop-nextest-integration> [2026-09-23 20:47:45.089] @feyngen::diagram_... INFO : ( Sum of the symmetry factors from each graph generated = -1/2 )
  435. 289.47 s gammaloop-nextest-integration> [2026-09-23 20:47:45.089] @commands::generate INFO : Generated amplitude 1 graphs.
  436. 289.47 s gammaloop-nextest-integration> [2026-09-23 20:47:45.089] @commands::generate INFO : Only diagram generation was requested, skipping integrand generation. You can generate integrands later using the 'generate existing <options>' command.
  437. 289.47 s gammaloop-nextest-integration> [2026-09-23 20:47:45.089] @gammaloop_api::se... INFO : Running command generate
  438. 289.47 s gammaloop-nextest-integration> The application panicked (crashed).
  439. 289.47 s gammaloop-nextest-integration> Message: label _func_power_ not found
  440. 289.47 s gammaloop-nextest-integration> Location: /nix/store/n9w914kh1cm59xx3spcs831cdyb56m32-vendor-cargo-deps/c19b7c6f923b580ac259164a89f2577984ad5ab09ee9d583b888f934adbbe8d0/symjit-2.25.6/src/symjit/assembler.rs:77
  441. 289.47 s gammaloop-nextest-integration>
  442. 289.47 s gammaloop-nextest-integration> ━━━━━━━━━━━━━━━━━━━━━━━━━━━━━━━━━━ BACKTRACE ━━━━━━━━━━━━━━━━━━━━━━━━━━━━━━━━━━━
  443. 289.47 s gammaloop-nextest-integration> 1: <color_eyre[51793ea62743adbd]::config::PanicHook>::panic_report<unknown>
  444. 289.47 s gammaloop-nextest-integration> at <unknown source file>:<unknown line>
  445. 289.47 s gammaloop-nextest-integration> 2: <color_eyre[51793ea62743adbd]::config::PanicHook>::into_panic_hook::{closure#0}<unknown>
  446. 289.47 s gammaloop-nextest-integration> at <unknown source file>:<unknown line>
  447. 289.47 s gammaloop-nextest-integration> 3: std[bcb96dfbba0ab899]::panicking::panic_with_hook<unknown>
  448. 289.47 s gammaloop-nextest-integration> at <unknown source file>:<unknown line>
  449. 289.47 s gammaloop-nextest-integration> 4: std[bcb96dfbba0ab899]::panicking::panic_handler::{closure#0}<unknown>
  450. 289.47 s gammaloop-nextest-integration> at <unknown source file>:<unknown line>
  451. 289.47 s gammaloop-nextest-integration> 5: std[bcb96dfbba0ab899]::sys::backtrace::__rust_end_short_backtrace::<std[bcb96dfbba0ab899]::panicking::panic_handler::{closure#0}, !><unknown>
  452. 289.47 s gammaloop-nextest-integration> at <unknown source file>:<unknown line>
  453. 289.47 s gammaloop-nextest-integration> 6: __rustc[6c289b9f9c454d21]::rust_begin_unwind<unknown>
  454. 289.47 s gammaloop-nextest-integration> at <unknown source file>:<unknown line>
  455. 289.47 s gammaloop-nextest-integration> 7: core[940e698046960fd5]::panicking::panic_fmt<unknown>
  456. 289.47 s gammaloop-nextest-integration> at <unknown source file>:<unknown line>
  457. 289.47 s gammaloop-nextest-integration> 8: <symjit[e408de789c333cd]::symjit::assembler::Assembler>::apply_jumps<unknown>
  458. 289.47 s gammaloop-nextest-integration> at <unknown source file>:<unknown line>
  459. 289.47 s gammaloop-nextest-integration> 9: <symjit[e408de789c333cd]::symjit::builder::Builder>::compile_from_mir::<symjit[e408de789c333cd]::symjit::amd::complex::AmdComplexGenerator><unknown>
  460. 289.47 s gammaloop-nextest-integration> at <unknown source file>:<unknown line>
  461. 289.47 s gammaloop-nextest-integration> 10: <symjit[e408de789c333cd]::symjit::runnable::Application>::compile_ty<unknown>
  462. 289.47 s gammaloop-nextest-integration> at <unknown source file>:<unknown line>
  463. 289.47 s gammaloop-nextest-integration> 11: <symjit[e408de789c333cd]::symjit::runnable::Application>::with_mir<unknown>
  464. 289.47 s gammaloop-nextest-integration> at <unknown source file>:<unknown line>
  465. 289.47 s gammaloop-nextest-integration> 12: <symjit[e408de789c333cd]::symjit::composer::DirectTranslator as symjit[e408de789c333cd]::symjit::composer::Composer>::compile<unknown>
  466. 289.47 s gammaloop-nextest-integration> at <unknown source file>:<unknown line>
  467. 289.47 s gammaloop-nextest-integration> 13: <symjit[e408de789c333cd]::symjit::compiler::Translator as symjit[e408de789c333cd]::symjit::composer::Composer>::compile<unknown>
  468. 289.47 s gammaloop-nextest-integration> at <unknown source file>:<unknown line>
  469. 289.47 s gammaloop-nextest-integration> 14: <numerica[124dab8567f4861e]::domains::float::complex::Complex<f64> as symbolica[10e259bab675d243]::evaluate::backend::JITCompiledNumber>::jit_compile<unknown>
  470. 289.47 s gammaloop-nextest-integration> at <unknown source file>:<unknown line>
  471. 289.47 s gammaloop-nextest-integration> 15: <gammalooprs[917cbd3df9e68f8f]::integrands::process::evaluators::GenericEvaluator>::activate_symjit<unknown>
  472. 289.47 s gammaloop-nextest-integration> at <unknown source file>:<unknown line>
  473. 289.47 s gammaloop-nextest-integration> 16: <gammalooprs[917cbd3df9e68f8f]::integrands::process::amplitude::AmplitudeIntegrand>::prepare_runtime_backends_after_generation_with_compile_times<unknown>
  474. 289.47 s gammaloop-nextest-integration> at <unknown source file>:<unknown line>
  475. 289.47 s gammaloop-nextest-integration> 17: <gammalooprs[917cbd3df9e68f8f]::processes::amplitude::Amplitude>::build_integrand<unknown>
  476. 289.47 s gammaloop-nextest-integration> at <unknown source file>:<unknown line>
  477. 289.47 s gammaloop-nextest-integration> 18: <gammalooprs[917cbd3df9e68f8f]::processes::process::Process>::generate_integrands<unknown>
  478. 289.47 s gammaloop-nextest-integration> at <unknown source file>:<unknown line>
  479. 289.47 s gammaloop-nextest-integration> 19: <gammalooprs[917cbd3df9e68f8f]::processes::ProcessList>::generate_integrands<unknown>
  480. 289.47 s gammaloop-nextest-integration> at <unknown source file>:<unknown line>
  481. 289.47 s gammaloop-nextest-integration> 20: <gammaloop_api[9ebf6628f97aeb57]::state::State>::generate_integrands<unknown>
  482. 289.47 s gammaloop-nextest-integration> at <unknown source file>:<unknown line>
  483. 289.47 s gammaloop-nextest-integration> 21: <gammaloop_api[9ebf6628f97aeb57]::commands::generate::Generate>::run::<&std[bcb96dfbba0ab899]::path::PathBuf><unknown>
  484. 289.47 s gammaloop-nextest-integration> at <unknown source file>:<unknown line>
  485. 289.47 s gammaloop-nextest-integration> 22: <gammaloop_api[9ebf6628f97aeb57]::commands::Commands>::run<unknown>
  486. 289.47 s gammaloop-nextest-integration> at <unknown source file>:<unknown line>
  487. 289.47 s gammaloop-nextest-integration> 23: <gammaloop_api[9ebf6628f97aeb57]::session::CliSession>::execute_prepared<unknown>
  488. 289.47 s gammaloop-nextest-integration> at <unknown source file>:<unknown line>
  489. 289.47 s gammaloop-nextest-integration> 24: <gammaloop_api[9ebf6628f97aeb57]::session::CliSession>::execute_prepared_commands<unknown>
  490. 289.47 s gammaloop-nextest-integration> at <unknown source file>:<unknown line>
  491. 289.47 s gammaloop-nextest-integration> 25: <gammaloop_api[9ebf6628f97aeb57]::session::CliSession>::execute_prepared<unknown>
  492. 289.47 s gammaloop-nextest-integration> at <unknown source file>:<unknown line>
  493. 289.47 s gammaloop-nextest-integration> 26: <gammaloop_api[9ebf6628f97aeb57]::session::CliSession>::execute_command<unknown>
  494. 289.47 s gammaloop-nextest-integration> at <unknown source file>:<unknown line>
  495. 289.47 s gammaloop-nextest-integration> 27: <gammaloop_integration_tests[191607b70c61cd5a]::CLIState>::run_command<unknown>
  496. 289.47 s gammaloop-nextest-integration> at <unknown source file>:<unknown line>
  497. 289.47 s gammaloop-nextest-integration> 28: uv[3c7454ef256d6487]::run_single_integrated_uv_case<unknown>
  498. 289.47 s gammaloop-nextest-integration> at <unknown source file>:<unknown line>
  499. 289.47 s gammaloop-nextest-integration> 29: <uv[3c7454ef256d6487]::thermal_sunrise_uv::{closure#0} as core[940e698046960fd5]::ops::function::FnOnce<()>>::call_once<unknown>
  500. 289.47 s gammaloop-nextest-integration> at <unknown source file>:<unknown line>
  501. 289.47 s gammaloop-nextest-integration> 30: test[75d6903177b1d7e9]::__rust_begin_short_backtrace::<core[940e698046960fd5]::result::Result<(), alloc[2ea6bcb46fca0c42]::string::String>, fn() -> core[940e698046960fd5]::result::Result<(), alloc[2ea6bcb46fca0c42]::string::String>><unknown>
  502. 289.47 s gammaloop-nextest-integration> at <unknown source file>:<unknown line>
  503. 289.47 s gammaloop-nextest-integration> 31: test[75d6903177b1d7e9]::run_test::{closure#0}<unknown>
  504. 289.47 s gammaloop-nextest-integration> at <unknown source file>:<unknown line>
  505. 289.47 s gammaloop-nextest-integration> 32: std[bcb96dfbba0ab899]::sys::backtrace::__rust_begin_short_backtrace::<test[75d6903177b1d7e9]::run_test::{closure#1}, ()><unknown>
  506. 289.47 s gammaloop-nextest-integration> at <unknown source file>:<unknown line>
  507. 289.47 s gammaloop-nextest-integration> 33: <std[bcb96dfbba0ab899]::thread::lifecycle::spawn_unchecked<test[75d6903177b1d7e9]::run_test::{closure#1}, ()>::{closure#1} as core[940e698046960fd5]::ops::function::FnOnce<()>>::call_once::{shim:vtable#0}<unknown>
  508. 289.47 s gammaloop-nextest-integration> at <unknown source file>:<unknown line>
  509. 289.47 s gammaloop-nextest-integration> 34: <std[bcb96dfbba0ab899]::sys::thread::unix::Thread>::new::thread_start<unknown>
  510. 289.47 s gammaloop-nextest-integration> at <unknown source file>:<unknown line>
  511. 289.47 s gammaloop-nextest-integration> 35: start_thread<unknown>
  512. 289.47 s gammaloop-nextest-integration> at <unknown source file>:<unknown line>
  513. 289.47 s gammaloop-nextest-integration> 36: __clone3<unknown>
  514. 289.47 s gammaloop-nextest-integration> at <unknown source file>:<unknown line>
  515. 289.47 s gammaloop-nextest-integration>
  516. 289.47 s gammaloop-nextest-integration> Run with COLORBT_SHOW_HIDDEN=1 environment variable to disable frame filtering.
  517. 289.47 s gammaloop-nextest-integration> Run with RUST_BACKTRACE=full to include source snippets.
  518. 289.47 s gammaloop-nextest-integration> Warning: SpanTrace capture is Unsupported.
  519. 289.47 s gammaloop-nextest-integration> Ensure that you've setup a tracing-error ErrorLayer and the semver versions are compatible
  520. 289.47 s gammaloop-nextest-integration>
  521. 289.69 s gammaloop-nextest-integration> error: test run failed
  522. 289.71 s gammaloop-nextest-integration>
  523. 289.71 s gammaloop-nextest-integration> ========== nextest test summary ==========
  524. 289.71 s gammaloop-nextest-integration> report: target/nextest/ci_gammaloop/junit.xml
  525. 289.71 s gammaloop-nextest-integration> tests: 170, failures: 2, errors: 0
  526. 289.71 s gammaloop-nextest-integration>
  527. 289.71 s gammaloop-nextest-integration> 1. gammaloop-integration-tests::test_runs::aa_aa::important::aa_aa_local_inspect_backend_consistency
  528. 289.71 s gammaloop-nextest-integration> failure: test failure with exit code 101
  529. 289.71 s gammaloop-nextest-integration> system-out
  530. 289.71 s gammaloop-nextest-integration> running 1 test
  531. 289.71 s gammaloop-nextest-integration> test aa_aa::important::aa_aa_local_inspect_backend_consistency ... FAILED
  532. 289.71 s gammaloop-nextest-integration>
  533. 289.71 s gammaloop-nextest-integration> failures:
  534. 289.71 s gammaloop-nextest-integration>
  535. 289.71 s gammaloop-nextest-integration> failures:
  536. 289.71 s gammaloop-nextest-integration> aa_aa::important::aa_aa_local_inspect_backend_consistency
  537. 289.71 s gammaloop-nextest-integration>
  538. 289.71 s gammaloop-nextest-integration> test result: FAILED. 0 passed; 1 failed; 0 ignored; 0 measured; 274 filtered out; finished in 3.42s
  539. 289.71 s gammaloop-nextest-integration> system-err
  540. 289.71 s gammaloop-nextest-integration> [2026-09-23 20:46:47.181] @gammaloop_api::se... INFO : Running command import model sm-default.json
  541. 289.71 s gammaloop-nextest-integration> [2026-09-23 20:46:47.181] @import::model INFO : Loading built-in JSON model sm-default
  542. 289.72 s gammaloop-nextest-integration> [2026-09-23 20:46:47.208] @gammalooprs::model INFO : The following 15 external parameters were forced to zero by the restriction card:
  543. 289.72 s gammaloop-nextest-integration> lamWS, AWS, rhoWS, etaWS, ymc, yme, ymm, MC, Me, MM, WTau, muQ, muLe, muLmu, muLtau
  544. 289.72 s gammaloop-nextest-integration> [2026-09-23 20:46:47.209] @gammalooprs::model INFO : The following 34 vertex rules were removed by the restriction card:
  545. 289.72 s gammaloop-nextest-integration> V_82 -> (c~, d, G+) | V_83 -> (t~, d, G+) | V_84 -> (c~, s, G+) | V_85 -> (t~, s, G+) | V_86 -> (u~, b, G+) | V_87 -> (c~, b, G+) | V_90 -> (c~, d, W+) | V_91 -> (t~, d, W+) | V_92 -> (u~, s, W+) | V_94 -> (t~, s, W+) | V_95 -> (u~, b, W+) | V_96 -> (c~, b, W+) | V_101 -> (e+, e-, G0) | V_102 -> (mu+, mu-, G0) | V_104 -> (e+, e-, H) | V_105 -> (mu+, mu-, H) | V_110 -> (ve~, e-, G+) | V_111 -> (vm~, mu-, G+) | V_116 -> (b~, u, G-) | V_117 -> (d~, c, G-) | V_118 -> (s~, c, G-) | V_119 -> (b~, c, G-) | V_120 -> (d~, t, G-) | V_121 -> (s~, t, G-) | V_124 -> (s~, u, W-) | V_125 -> (b~, u, W-) | V_126 -> (d~, c, W-) | V_128 -> (b~, c, W-) | V_129 -> (d~, t, W-) | V_130 -> (s~, t, W-) | V_138 -> (c~, c, G0) | V_140 -> (c~, c, H) | V_145 -> (e+, ve, G-) | V_146 -> (mu+, vm, G-)
  546. 289.72 s gammaloop-nextest-integration> [2026-09-23 20:46:47.209] @gammalooprs::model INFO : The following 36 couplings were removed by the restriction card:
  547. 289.72 s gammaloop-nextest-integration> GC_13, GC_14, GC_16, GC_17, GC_18, GC_19, GC_20, GC_22, GC_23, GC_24, GC_25, GC_26, GC_28, GC_29, GC_42, GC_43, GC_44, GC_46, GC_47, GC_48, GC_84, GC_85, GC_86, GC_87, GC_88, GC_89, GC_90, GC_91, GC_92, GC_93, GC_101, GC_102, GC_103, GC_105, GC_106, GC_107
  548. 289.72 s gammaloop-nextest-integration> [2026-09-23 20:46:47.209] @gammaloop_api::se... INFO : Running command run set_model_parameters
  549. 289.72 s gammaloop-nextest-integration> [2026-09-23 20:46:47.209] @gammaloop_api::se... INFO : Starting command block set_model_parameters
  550. 289.72 s gammaloop-nextest-integration> [2026-09-23 20:46:47.210] @gammaloop_api::se... INFO : Running command set model MT=173.0
  551. 289.72 s gammaloop-nextest-integration> [2026-09-23 20:46:47.215] @gammaloop_api::se... INFO : Running command set model WT=0.0
  552. 289.72 s gammaloop-nextest-integration> [2026-09-23 20:46:47.220] @gammaloop_api::se... INFO : Running command set model ymt=173.0
  553. 289.72 s gammaloop-nextest-integration> [2026-09-23 20:46:47.224] @gammaloop_api::se... INFO : Running command set model aS=0.118
  554. 289.72 s gammaloop-nextest-integration> [2026-09-23 20:46:47.229] @gammaloop_api::se... INFO : Running command set model aEWM1=137.036
  555. 289.72 s gammaloop-nextest-integration> [2026-09-23 20:46:47.233] @gammaloop_api::se... INFO : Running command set model Gf=1.166390e-05
  556. 289.72 s gammaloop-nextest-integration> [2026-09-23 20:46:47.238] @gammaloop_api::se... INFO : Running command set model MZ=91.188
  557. 289.72 s gammaloop-nextest-integration> [2026-09-23 20:46:47.244] @gammaloop_api::se... INFO : Running command set global string '
  558. 289.72 s gammaloop-nextest-integration> [global.generation.compile]
  559. 289.72 s gammaloop-nextest-integration> compilation_mode = "symjit"
  560. 289.72 s gammaloop-nextest-integration> optimization_level = "O0"
  561. 289.72 s gammaloop-nextest-integration> fast_math = false
  562. 289.72 s gammaloop-nextest-integration> [...]
  563. 289.72 s gammaloop-nextest-integration> [2026-09-23 20:46:47.245] @gammaloop_api::se... INFO : Running command import graphs ./examples/cli/aa_aa/1L/aa_aa_1L.dot -p aa_aa_all_helicities -i 1L_ppmm -o
  564. 289.72 s gammaloop-nextest-integration> [2026-09-23 20:46:47.245] @commands::import INFO : Loading graphs from '/build/source/examples/cli/aa_aa/1L/aa_aa_1L.dot'
  565. 289.72 s gammaloop-nextest-integration> [2026-09-23 20:46:47.256] @gammaloop_api::se... INFO : Running command generate existing -p aa_aa_all_helicities
  566. 289.72 s gammaloop-nextest-integration> The application panicked (crashed).
  567. 289.72 s gammaloop-nextest-integration> Message: label _func_power_ not found
  568. 289.72 s gammaloop-nextest-integration> Location: /nix/store/n9w914kh1cm59xx3spcs831cdyb56m32-vendor-cargo-deps/c19b7c6f923b580ac259164a89f2577984ad5ab09ee9d583b888f934adbbe8d0/symjit-2.25.6/src/symjit/assembler.rs:77
  569. 289.72 s gammaloop-nextest-integration>
  570. 289.72 s gammaloop-nextest-integration> ━━━━━━━━━━━━━━━━━━━━━━━━━━━━━━━━━━ BACKTRACE ━━━━━━━━━━━━━━━━━━━━━━━━━━━━━━━━━━━
  571. 289.72 s gammaloop-nextest-integration> 1: <color_eyre[51793ea62743adbd]::config::PanicHook>::panic_report<unknown>
  572. 289.72 s gammaloop-nextest-integration> at <unknown source file>:<unknown line>
  573. 289.72 s gammaloop-nextest-integration> 2: <color_eyre[51793ea62743adbd]::config::PanicHook>::into_panic_hook::{closure#0}<unknown>
  574. 289.72 s gammaloop-nextest-integration> at <unknown source file>:<unknown line>
  575. 289.72 s gammaloop-nextest-integration> 3: std[bcb96dfbba0ab899]::panicking::panic_with_hook<unknown>
  576. 289.72 s gammaloop-nextest-integration> at <unknown source file>:<unknown line>
  577. 289.72 s gammaloop-nextest-integration> 4: std[bcb96dfbba0ab899]::panicking::panic_handler::{closure#0}<unknown>
  578. 289.72 s gammaloop-nextest-integration> at <unknown source file>:<unknown line>
  579. 289.72 s gammaloop-nextest-integration> 5: std[bcb96dfbba0ab899]::sys::backtrace::__rust_end_short_backtrace::<std[bcb96dfbba0ab899]::panicking::panic_handler::{closure#0}, !><unknown>
  580. 289.72 s gammaloop-nextest-integration> at <unknown source file>:<unknown line>
  581. 289.72 s gammaloop-nextest-integration> 6: __rustc[6c289b9f9c454d21]::rust_begin_unwind<unknown>
  582. 289.72 s gammaloop-nextest-integration> at <unknown source file>:<unknown line>
  583. 289.72 s gammaloop-nextest-integration> 7: core[940e698046960fd5]::panicking::panic_fmt<unknown>
  584. 289.72 s gammaloop-nextest-integration> at <unknown source file>:<unknown line>
  585. 289.72 s gammaloop-nextest-integration> 8: <symjit[e408de789c333cd]::symjit::assembler::Assembler>::apply_jumps<unknown>
  586. 289.72 s gammaloop-nextest-integration> at <unknown source file>:<unknown line>
  587. 289.72 s gammaloop-nextest-integration> 9: <symjit[e408de789c333cd]::symjit::builder::Builder>::compile_from_mir::<symjit[e408de789c333cd]::symjit::amd::complex::AmdComplexGenerator><unknown>
  588. 289.72 s gammaloop-nextest-integration> at <unknown source file>:<unknown line>
  589. 289.72 s gammaloop-nextest-integration> 10: <symjit[e408de789c333cd]::symjit::runnable::Application>::compile_ty<unknown>
  590. 289.72 s gammaloop-nextest-integration> at <unknown source file>:<unknown line>
  591. 289.72 s gammaloop-nextest-integration> 11: <symjit[e408de789c333cd]::symjit::runnable::Application>::with_mir<unknown>
  592. 289.72 s gammaloop-nextest-integration> at <unknown source file>:<unknown line>
  593. 289.72 s gammaloop-nextest-integration> 12: <symjit[e408de789c333cd]::symjit::composer::DirectTranslator as symjit[e408de789c333cd]::symjit::composer::Composer>::compile<unknown>
  594. 289.72 s gammaloop-nextest-integration> at <unknown source file>:<unknown line>
  595. 289.72 s gammaloop-nextest-integration> 13: <symjit[e408de789c333cd]::symjit::compiler::Translator as symjit[e408de789c333cd]::symjit::composer::Composer>::compile<unknown>
  596. 289.72 s gammaloop-nextest-integration> at <unknown source file>:<unknown line>
  597. 289.72 s gammaloop-nextest-integration> 14: <numerica[124dab8567f4861e]::domains::float::complex::Complex<f64> as symbolica[10e259bab675d243]::evaluate::backend::JITCompiledNumber>::jit_compile<unknown>
  598. 289.72 s gammaloop-nextest-integration> at <unknown source file>:<unknown line>
  599. 289.72 s gammaloop-nextest-integration> 15: <gammalooprs[917cbd3df9e68f8f]::integrands::process::evaluators::GenericEvaluator>::activate_symjit<unknown>
  600. 289.72 s gammaloop-nextest-integration> at <unknown source file>:<unknown line>
  601. 289.72 s gammaloop-nextest-integration> 16: <gammalooprs[917cbd3df9e68f8f]::integrands::process::amplitude::AmplitudeIntegrand>::prepare_runtime_backends_after_generation_with_compile_times<unknown>
  602. 289.72 s gammaloop-nextest-integration> at <unknown source file>:<unknown line>
  603. 289.72 s gammaloop-nextest-integration> 17: <gammalooprs[917cbd3df9e68f8f]::processes::amplitude::Amplitude>::build_integrand<unknown>
  604. 289.72 s gammaloop-nextest-integration> at <unknown source file>:<unknown line>
  605. 289.72 s gammaloop-nextest-integration> 18: <gammalooprs[917cbd3df9e68f8f]::processes::process::Process>::generate_integrands<unknown>
  606. 289.72 s gammaloop-nextest-integration> at <unknown source file>:<unknown line>
  607. 289.72 s gammaloop-nextest-integration> 19: <gammaloop_api[9ebf6628f97aeb57]::state::State>::generate_integrand<unknown>
  608. 289.72 s gammaloop-nextest-integration> at <unknown source file>:<unknown line>
  609. 289.72 s gammaloop-nextest-integration> 20: <gammaloop_api[9ebf6628f97aeb57]::commands::generate::Generate>::run::<&std[bcb96dfbba0ab899]::path::PathBuf><unknown>
  610. 289.72 s gammaloop-nextest-integration> at <unknown source file>:<unknown line>
  611. 289.72 s gammaloop-nextest-integration> 21: <gammaloop_api[9ebf6628f97aeb57]::commands::Commands>::run<unknown>
  612. 289.72 s gammaloop-nextest-integration> at <unknown source file>:<unknown line>
  613. 289.72 s gammaloop-nextest-integration> 22: <gammaloop_api[9ebf6628f97aeb57]::session::CliSession>::execute_prepared<unknown>
  614. 289.72 s gammaloop-nextest-integration> at <unknown source file>:<unknown line>
  615. 289.72 s gammaloop-nextest-integration> 23: <gammaloop_api[9ebf6628f97aeb57]::session::CliSession>::execute_command<unknown>
  616. 289.72 s gammaloop-nextest-integration> at <unknown source file>:<unknown line>
  617. 289.72 s gammaloop-nextest-integration> 24: <gammaloop_integration_tests[191607b70c61cd5a]::CLIState>::run_command<unknown>
  618. 289.72 s gammaloop-nextest-integration> at <unknown source file>:<unknown line>
  619. 289.72 s gammaloop-nextest-integration> 25: test_runs[9b7e2dc2dc4f29b0]::aa_aa::generate_aa_aa_helicity_family<unknown>
  620. 289.72 s gammaloop-nextest-integration> at <unknown source file>:<unknown line>
  621. 289.72 s gammaloop-nextest-integration> 26: <test_runs[9b7e2dc2dc4f29b0]::aa_aa::important::aa_aa_local_inspect_backend_consistency::{closure#0} as core[940e698046960fd5]::ops::function::FnOnce<()>>::call_once<unknown>
  622. 289.72 s gammaloop-nextest-integration> at <unknown source file>:<unknown line>
  623. 289.72 s gammaloop-nextest-integration> 27: serial_test[cd99724524a2f1c0]::serial_code_lock::local_serial_core_with_return::<(), eyre[cb2fd339c0c40fca]::Report><unknown>
  624. 289.72 s gammaloop-nextest-integration> at <unknown source file>:<unknown line>
  625. 289.72 s gammaloop-nextest-integration> 28: <test_runs[9b7e2dc2dc4f29b0]::aa_aa::important::aa_aa_local_inspect_backend_consistency::{closure#0} as core[940e698046960fd5]::ops::function::FnOnce<()>>::call_once<unknown>
  626. 289.72 s gammaloop-nextest-integration> at <unknown source file>:<unknown line>
  627. 289.72 s gammaloop-nextest-integration> 29: test[75d6903177b1d7e9]::__rust_begin_short_backtrace::<core[940e698046960fd5]::result::Result<(), alloc[2ea6bcb46fca0c42]::string::String>, fn() -> core[940e698046960fd5]::result::Result<(), alloc[2ea6bcb46fca0c42]::string::String>><unknown>
  628. 289.72 s gammaloop-nextest-integration> at <unknown source file>:<unknown line>
  629. 289.72 s gammaloop-nextest-integration> 30: test[75d6903177b1d7e9]::run_test::{closure#0}<unknown>
  630. 289.72 s gammaloop-nextest-integration> at <unknown source file>:<unknown line>
  631. 289.72 s gammaloop-nextest-integration> 31: std[bcb96dfbba0ab899]::sys::backtrace::__rust_begin_short_backtrace::<test[75d6903177b1d7e9]::run_test::{closure#1}, ()><unknown>
  632. 289.72 s gammaloop-nextest-integration> at <unknown source file>:<unknown line>
  633. 289.72 s gammaloop-nextest-integration> 32: <std[bcb96dfbba0ab899]::thread::lifecycle::spawn_unchecked<test[75d6903177b1d7e9]::run_test::{closure#1}, ()>::{closure#1} as core[940e698046960fd5]::ops::function::FnOnce<()>>::call_once::{shim:vtable#0}<unknown>
  634. 289.72 s gammaloop-nextest-integration> at <unknown source file>:<unknown line>
  635. 289.72 s gammaloop-nextest-integration> 33: <std[bcb96dfbba0ab899]::sys::thread::unix::Thread>::new::thread_start<unknown>
  636. 289.72 s gammaloop-nextest-integration> at <unknown source file>:<unknown line>
  637. 289.72 s gammaloop-nextest-integration> 34: start_thread<unknown>
  638. 289.72 s gammaloop-nextest-integration> at <unknown source file>:<unknown line>
  639. 289.72 s gammaloop-nextest-integration> 35: __clone3<unknown>
  640. 289.72 s gammaloop-nextest-integration> at <unknown source file>:<unknown line>
  641. 289.72 s gammaloop-nextest-integration>
  642. 289.72 s gammaloop-nextest-integration> Run with COLORBT_SHOW_HIDDEN=1 environment variable to disable frame filtering.
  643. 289.72 s gammaloop-nextest-integration> Run with RUST_BACKTRACE=full to include source snippets.
  644. 289.72 s gammaloop-nextest-integration> Warning: SpanTrace capture is Unsupported.
  645. 289.72 s gammaloop-nextest-integration> Ensure that you've setup a tracing-error ErrorLayer and the semver versions are compatible
  646. 289.72 s gammaloop-nextest-integration>
  647. 289.72 s gammaloop-nextest-integration> 2. gammaloop-integration-tests::uv::thermal_sunrise_uv
  648. 289.72 s gammaloop-nextest-integration> failure: test failure with exit code 101
  649. 289.72 s gammaloop-nextest-integration> system-out
  650. 289.72 s gammaloop-nextest-integration> running 1 test
  651. 289.72 s gammaloop-nextest-integration> test thermal_sunrise_uv ... FAILED
  652. 289.72 s gammaloop-nextest-integration>
  653. 289.72 s gammaloop-nextest-integration> failures:
  654. 289.72 s gammaloop-nextest-integration>
  655. 289.72 s gammaloop-nextest-integration> failures:
  656. 289.72 s gammaloop-nextest-integration> thermal_sunrise_uv
  657. 289.72 s gammaloop-nextest-integration>
  658. 289.72 s gammaloop-nextest-integration> test result: FAILED. 0 passed; 1 failed; 0 ignored; 0 measured; 31 filtered out; finished in 3.75s
  659. 289.72 s gammaloop-nextest-integration> system-err
  660. 289.72 s gammaloop-nextest-integration> [2026-09-23 20:47:45.035] @gammaloop_api::se... INFO : Running command run generate
  661. 289.72 s gammaloop-nextest-integration> [2026-09-23 20:47:45.035] @gammaloop_api::se... INFO : Starting command block generate
  662. 289.72 s gammaloop-nextest-integration> [2026-09-23 20:47:45.036] @gammaloop_api::se... INFO : Running command import model sm-default.json
  663. 289.72 s gammaloop-nextest-integration> [2026-09-23 20:47:45.036] @import::model INFO : Loading built-in JSON model sm-default
  664. 289.72 s gammaloop-nextest-integration> [2026-09-23 20:47:45.070] @gammalooprs::model INFO : The following 15 external parameters were forced to zero by the restriction card:
  665. 289.72 s gammaloop-nextest-integration> lamWS, AWS, rhoWS, etaWS, ymc, yme, ymm, MC, Me, MM, WTau, muQ, muLe, muLmu, muLtau
  666. 289.72 s gammaloop-nextest-integration> [2026-09-23 20:47:45.071] @gammalooprs::model INFO : The following 34 vertex rules were removed by the restriction card:
  667. 289.72 s gammaloop-nextest-integration> V_82 -> (c~, d, G+) | V_83 -> (t~, d, G+) | V_84 -> (c~, s, G+) | V_85 -> (t~, s, G+) | V_86 -> (u~, b, G+) | V_87 -> (c~, b, G+) | V_90 -> (c~, d, W+) | V_91 -> (t~, d, W+) | V_92 -> (u~, s, W+) | V_94 -> (t~, s, W+) | V_95 -> (u~, b, W+) | V_96 -> (c~, b, W+) | V_101 -> (e+, e-, G0) | V_102 -> (mu+, mu-, G0) | V_104 -> (e+, e-, H) | V_105 -> (mu+, mu-, H) | V_110 -> (ve~, e-, G+) | V_111 -> (vm~, mu-, G+) | V_116 -> (b~, u, G-) | V_117 -> (d~, c, G-) | V_118 -> (s~, c, G-) | V_119 -> (b~, c, G-) | V_120 -> (d~, t, G-) | V_121 -> (s~, t, G-) | V_124 -> (s~, u, W-) | V_125 -> (b~, u, W-) | V_126 -> (d~, c, W-) | V_128 -> (b~, c, W-) | V_129 -> (d~, t, W-) | V_130 -> (s~, t, W-) | V_138 -> (c~, c, G0) | V_140 -> (c~, c, H) | V_145 -> (e+, ve, G-) | V_146 -> (mu+, vm, G-)
  668. 289.72 s gammaloop-nextest-integration> [2026-09-23 20:47:45.071] @gammalooprs::model INFO : The following 36 couplings were removed by the restriction card:
  669. 289.72 s gammaloop-nextest-integration> GC_13, GC_14, GC_16, GC_17, GC_18, GC_19, GC_20, GC_22, GC_23, GC_24, GC_25, GC_26, GC_28, GC_29, GC_42, GC_43, GC_44, GC_46, GC_47, GC_48, GC_84, GC_85, GC_86, GC_87, GC_88, GC_89, GC_90, GC_91, GC_92, GC_93, GC_101, GC_102, GC_103, GC_105, GC_106, GC_107
  670. 289.72 s gammaloop-nextest-integration> [2026-09-23 20:47:45.071] @gammaloop_api::se... INFO : Running command remove processes
  671. 289.72 s gammaloop-nextest-integration> [2026-09-23 20:47:45.071] @gammaloop_api::se... INFO : Running command generate amp {} > {} [{2}] | g u
  672. 289.72 s gammaloop-nextest-integration> --numerator-grouping group_identical_graphs_up_to_scalar_rescaling
  673. 289.72 s gammaloop-nextest-integration> --max-n-bridges 0
  674. 289.72 s gammaloop-nextest-integration> --number-of-factorized-loop-subtopologies 1 1
  675. 289.72 s gammaloop-nextest-integration> --number-of-anticommutating-loops 1 1
  676. 289.72 s gammaloop-nextest-integration> [...]
  677. 289.72 s gammaloop-nextest-integration> [2026-09-23 20:47:45.073] @feyngen::diagram_... INFO : 0s | Δ=0s | Starting Feynman graph generation with Symbolica...
  678. 289.72 s gammaloop-nextest-integration> [2026-09-23 20:47:45.073] @feyngen::diagram_... INFO : 0s | Δ=0s | Number of graphs resulting from Symbolica generation: 3
  679. 289.72 s gammaloop-nextest-integration> [2026-09-23 20:47:45.073] @feyngen::diagram_... INFO : 0s | Δ=0s | Number of graphs retained after removal of vetoed topologies: 2
  680. 289.72 s gammaloop-nextest-integration> [2026-09-23 20:47:45.073] @feyngen::diagram_... INFO : 0s | Δ=0s | Number of graphs after vertex info assignment: 2
  681. 289.72 s gammaloop-nextest-integration> [2026-09-23 20:47:45.073] @feyngen::diagram_... INFO : 0s | Δ=0s | Number of graphs after all complete graphs filters are applied: 2
  682. 289.72 s gammaloop-nextest-integration> [2026-09-23 20:47:45.073] @feyngen::diagram_... INFO : 0s | Δ=0s | Number of graphs after closed anticommutating chains analysis: 1
  683. 289.72 s gammaloop-nextest-integration> [2026-09-23 20:47:45.073] @feyngen::diagram_... INFO : 0s | Δ=0s | Number of graphs after symmetrization of external states: 1
  684. 289.72 s gammaloop-nextest-integration> [2026-09-23 20:47:45.073] @feyngen::diagram_... INFO : 0s | Δ=0s | Number of graphs after canonization of vertices, edges and flows (graph labels assigned here): 1
  685. 289.72 s gammaloop-nextest-integration> [2026-09-23 20:47:45.089] @feyngen::diagram_... INFO : 0s | Δ=0s | Number of graphs after numerator-aware grouping with strategy 'up to a scalar rescaling': 1 (1 isomorphically unique graph, 0 color zero, 0 lorentz zero, 0 grouped and 0 cancellation)
  686. 289.72 s gammaloop-nextest-integration> [2026-09-23 20:47:45.089] @feyngen::diagram_... INFO : ( Sum of the symmetry factors from each graph generated = -1/2 )
  687. 289.72 s gammaloop-nextest-integration> [2026-09-23 20:47:45.089] @commands::generate INFO : Generated amplitude 1 graphs.
  688. 289.72 s gammaloop-nextest-integration> [2026-09-23 20:47:45.089] @commands::generate INFO : Only diagram generation was requested, skipping integrand generation. You can generate integrands later using the 'generate existing <options>' command.
  689. 289.72 s gammaloop-nextest-integration> [2026-09-23 20:47:45.089] @gammaloop_api::se... INFO : Running command generate
  690. 289.72 s gammaloop-nextest-integration> The application panicked (crashed).
  691. 289.72 s gammaloop-nextest-integration> Message: label _func_power_ not found
  692. 289.72 s gammaloop-nextest-integration> Location: /nix/store/n9w914kh1cm59xx3spcs831cdyb56m32-vendor-cargo-deps/c19b7c6f923b580ac259164a89f2577984ad5ab09ee9d583b888f934adbbe8d0/symjit-2.25.6/src/symjit/assembler.rs:77
  693. 289.72 s gammaloop-nextest-integration>
  694. 289.72 s gammaloop-nextest-integration> ━━━━━━━━━━━━━━━━━━━━━━━━━━━━━━━━━━ BACKTRACE ━━━━━━━━━━━━━━━━━━━━━━━━━━━━━━━━━━━
  695. 289.72 s gammaloop-nextest-integration> 1: <color_eyre[51793ea62743adbd]::config::PanicHook>::panic_report<unknown>
  696. 289.72 s gammaloop-nextest-integration> at <unknown source file>:<unknown line>
  697. 289.72 s gammaloop-nextest-integration> 2: <color_eyre[51793ea62743adbd]::config::PanicHook>::into_panic_hook::{closure#0}<unknown>
  698. 289.72 s gammaloop-nextest-integration> at <unknown source file>:<unknown line>
  699. 289.72 s gammaloop-nextest-integration> 3: std[bcb96dfbba0ab899]::panicking::panic_with_hook<unknown>
  700. 289.72 s gammaloop-nextest-integration> at <unknown source file>:<unknown line>
  701. 289.72 s gammaloop-nextest-integration> 4: std[bcb96dfbba0ab899]::panicking::panic_handler::{closure#0}<unknown>
  702. 289.72 s gammaloop-nextest-integration> at <unknown source file>:<unknown line>
  703. 289.72 s gammaloop-nextest-integration> 5: std[bcb96dfbba0ab899]::sys::backtrace::__rust_end_short_backtrace::<std[bcb96dfbba0ab899]::panicking::panic_handler::{closure#0}, !><unknown>
  704. 289.72 s gammaloop-nextest-integration> at <unknown source file>:<unknown line>
  705. 289.72 s gammaloop-nextest-integration> 6: __rustc[6c289b9f9c454d21]::rust_begin_unwind<unknown>
  706. 289.72 s gammaloop-nextest-integration> at <unknown source file>:<unknown line>
  707. 289.72 s gammaloop-nextest-integration> 7: core[940e698046960fd5]::panicking::panic_fmt<unknown>
  708. 289.72 s gammaloop-nextest-integration> at <unknown source file>:<unknown line>
  709. 289.72 s gammaloop-nextest-integration> 8: <symjit[e408de789c333cd]::symjit::assembler::Assembler>::apply_jumps<unknown>
  710. 289.72 s gammaloop-nextest-integration> at <unknown source file>:<unknown line>
  711. 289.72 s gammaloop-nextest-integration> 9: <symjit[e408de789c333cd]::symjit::builder::Builder>::compile_from_mir::<symjit[e408de789c333cd]::symjit::amd::complex::AmdComplexGenerator><unknown>
  712. 289.72 s gammaloop-nextest-integration> at <unknown source file>:<unknown line>
  713. 289.72 s gammaloop-nextest-integration> 10: <symjit[e408de789c333cd]::symjit::runnable::Application>::compile_ty<unknown>
  714. 289.72 s gammaloop-nextest-integration> at <unknown source file>:<unknown line>
  715. 289.72 s gammaloop-nextest-integration> 11: <symjit[e408de789c333cd]::symjit::runnable::Application>::with_mir<unknown>
  716. 289.72 s gammaloop-nextest-integration> at <unknown source file>:<unknown line>
  717. 289.72 s gammaloop-nextest-integration> 12: <symjit[e408de789c333cd]::symjit::composer::DirectTranslator as symjit[e408de789c333cd]::symjit::composer::Composer>::compile<unknown>
  718. 289.72 s gammaloop-nextest-integration> at <unknown source file>:<unknown line>
  719. 289.72 s gammaloop-nextest-integration> 13: <symjit[e408de789c333cd]::symjit::compiler::Translator as symjit[e408de789c333cd]::symjit::composer::Composer>::compile<unknown>
  720. 289.72 s gammaloop-nextest-integration> at <unknown source file>:<unknown line>
  721. 289.72 s gammaloop-nextest-integration> 14: <numerica[124dab8567f4861e]::domains::float::complex::Complex<f64> as symbolica[10e259bab675d243]::evaluate::backend::JITCompiledNumber>::jit_compile<unknown>
  722. 289.72 s gammaloop-nextest-integration> at <unknown source file>:<unknown line>
  723. 289.72 s gammaloop-nextest-integration> 15: <gammalooprs[917cbd3df9e68f8f]::integrands::process::evaluators::GenericEvaluator>::activate_symjit<unknown>
  724. 289.72 s gammaloop-nextest-integration> at <unknown source file>:<unknown line>
  725. 289.72 s gammaloop-nextest-integration> 16: <gammalooprs[917cbd3df9e68f8f]::integrands::process::amplitude::AmplitudeIntegrand>::prepare_runtime_backends_after_generation_with_compile_times<unknown>
  726. 289.72 s gammaloop-nextest-integration> at <unknown source file>:<unknown line>
  727. 289.72 s gammaloop-nextest-integration> 17: <gammalooprs[917cbd3df9e68f8f]::processes::amplitude::Amplitude>::build_integrand<unknown>
  728. 289.72 s gammaloop-nextest-integration> at <unknown source file>:<unknown line>
  729. 289.72 s gammaloop-nextest-integration> 18: <gammalooprs[917cbd3df9e68f8f]::processes::process::Process>::generate_integrands<unknown>
  730. 289.72 s gammaloop-nextest-integration> at <unknown source file>:<unknown line>
  731. 289.72 s gammaloop-nextest-integration> 19: <gammalooprs[917cbd3df9e68f8f]::processes::ProcessList>::generate_integrands<unknown>
  732. 289.72 s gammaloop-nextest-integration> at <unknown source file>:<unknown line>
  733. 289.72 s gammaloop-nextest-integration> 20: <gammaloop_api[9ebf6628f97aeb57]::state::State>::generate_integrands<unknown>
  734. 289.72 s gammaloop-nextest-integration> at <unknown source file>:<unknown line>
  735. 289.72 s gammaloop-nextest-integration> 21: <gammaloop_api[9ebf6628f97aeb57]::commands::generate::Generate>::run::<&std[bcb96dfbba0ab899]::path::PathBuf><unknown>
  736. 289.72 s gammaloop-nextest-integration> at <unknown source file>:<unknown line>
  737. 289.72 s gammaloop-nextest-integration> 22: <gammaloop_api[9ebf6628f97aeb57]::commands::Commands>::run<unknown>
  738. 289.72 s gammaloop-nextest-integration> at <unknown source file>:<unknown line>
  739. 289.72 s gammaloop-nextest-integration> 23: <gammaloop_api[9ebf6628f97aeb57]::session::CliSession>::execute_prepared<unknown>
  740. 289.72 s gammaloop-nextest-integration> at <unknown source file>:<unknown line>
  741. 289.72 s gammaloop-nextest-integration> 24: <gammaloop_api[9ebf6628f97aeb57]::session::CliSession>::execute_prepared_commands<unknown>
  742. 289.72 s gammaloop-nextest-integration> at <unknown source file>:<unknown line>
  743. 289.72 s gammaloop-nextest-integration> 25: <gammaloop_api[9ebf6628f97aeb57]::session::CliSession>::execute_prepared<unknown>
  744. 289.72 s gammaloop-nextest-integration> at <unknown source file>:<unknown line>
  745. 289.72 s gammaloop-nextest-integration> 26: <gammaloop_api[9ebf6628f97aeb57]::session::CliSession>::execute_command<unknown>
  746. 289.72 s gammaloop-nextest-integration> at <unknown source file>:<unknown line>
  747. 289.72 s gammaloop-nextest-integration> 27: <gammaloop_integration_tests[191607b70c61cd5a]::CLIState>::run_command<unknown>
  748. 289.72 s gammaloop-nextest-integration> at <unknown source file>:<unknown line>
  749. 289.72 s gammaloop-nextest-integration> 28: uv[3c7454ef256d6487]::run_single_integrated_uv_case<unknown>
  750. 289.72 s gammaloop-nextest-integration> at <unknown source file>:<unknown line>
  751. 289.72 s gammaloop-nextest-integration> 29: <uv[3c7454ef256d6487]::thermal_sunrise_uv::{closure#0} as core[940e698046960fd5]::ops::function::FnOnce<()>>::call_once<unknown>
  752. 289.72 s gammaloop-nextest-integration> at <unknown source file>:<unknown line>
  753. 289.72 s gammaloop-nextest-integration> 30: test[75d6903177b1d7e9]::__rust_begin_short_backtrace::<core[940e698046960fd5]::result::Result<(), alloc[2ea6bcb46fca0c42]::string::String>, fn() -> core[940e698046960fd5]::result::Result<(), alloc[2ea6bcb46fca0c42]::string::String>><unknown>
  754. 289.72 s gammaloop-nextest-integration> at <unknown source file>:<unknown line>
  755. 289.72 s gammaloop-nextest-integration> 31: test[75d6903177b1d7e9]::run_test::{closure#0}<unknown>
  756. 289.72 s gammaloop-nextest-integration> at <unknown source file>:<unknown line>
  757. 289.72 s gammaloop-nextest-integration> 32: std[bcb96dfbba0ab899]::sys::backtrace::__rust_begin_short_backtrace::<test[75d6903177b1d7e9]::run_test::{closure#1}, ()><unknown>
  758. 289.72 s gammaloop-nextest-integration> at <unknown source file>:<unknown line>
  759. 289.72 s gammaloop-nextest-integration> 33: <std[bcb96dfbba0ab899]::thread::lifecycle::spawn_unchecked<test[75d6903177b1d7e9]::run_test::{closure#1}, ()>::{closure#1} as core[940e698046960fd5]::ops::function::FnOnce<()>>::call_once::{shim:vtable#0}<unknown>
  760. 289.72 s gammaloop-nextest-integration> at <unknown source file>:<unknown line>
  761. 289.72 s gammaloop-nextest-integration> 34: <std[bcb96dfbba0ab899]::sys::thread::unix::Thread>::new::thread_start<unknown>
  762. 289.72 s gammaloop-nextest-integration> at <unknown source file>:<unknown line>
  763. 289.72 s gammaloop-nextest-integration> 35: start_thread<unknown>
  764. 289.72 s gammaloop-nextest-integration> at <unknown source file>:<unknown line>
  765. 289.72 s gammaloop-nextest-integration> 36: __clone3<unknown>
  766. 289.72 s gammaloop-nextest-integration> at <unknown source file>:<unknown line>
  767. 289.72 s gammaloop-nextest-integration>
  768. 289.72 s gammaloop-nextest-integration> Run with COLORBT_SHOW_HIDDEN=1 environment variable to disable frame filtering.
  769. 289.72 s gammaloop-nextest-integration> Run with RUST_BACKTRACE=full to include source snippets.
  770. 289.72 s gammaloop-nextest-integration> Warning: SpanTrace capture is Unsupported.
  771. 289.72 s gammaloop-nextest-integration> Ensure that you've setup a tracing-error ErrorLayer and the semver versions are compatible
  772. 289.72 s gammaloop-nextest-integration> =========================================
  773. 289.82 s error: Cannot build '/nix/store/3f1dcfqxy8q0az6011047m7cljdkdh7f-gammaloop-nextest-integration.drv'.
  774. 289.82 s Reason: builder failed with exit code 100.
  775. 289.82 s Output paths:
  776. 289.82 s /nix/store/5lq23p49k83mdbx3l9l9r84yi8448q7g-gammaloop-nextest-integration
  777. 289.82 s Last 755 log lines:
  778. 289.82 s > Extracting 13 binaries, 1 build script output directory, and 3 linked paths to /build/nextest-archive-4ARkN7
  779. 289.82 s > Extracted 30 files to /build/nextest-archive-4ARkN7 in 2.82s
  780. 289.82 s > ------------
  781. 289.82 s > Nextest run ID c13ea1df-eec4-40f0-a015-9d651c53724b with nextest profile: ci_gammaloop
  782. 289.82 s > Starting 170 tests across 13 binaries (209 tests skipped, including 208 tests via profile.ci_gammaloop.default-filter)
  783. 289.82 s > FAIL [ 3.444s] ( 55/170) gammaloop-integration-tests::test_runs aa_aa::important::aa_aa_local_inspect_backend_consistency
  784. 289.82 s > stdout ---
  785. 289.82 s >
  786. 289.82 s > running 1 test
  787. 289.82 s > test aa_aa::important::aa_aa_local_inspect_backend_consistency ... FAILED
  788. 289.82 s >
  789. 289.82 s > failures:
  790. 289.82 s >
  791. 289.82 s > failures:
  792. 289.82 s > aa_aa::important::aa_aa_local_inspect_backend_consistency
  793. 289.82 s >
  794. 289.82 s > test result: FAILED. 0 passed; 1 failed; 0 ignored; 0 measured; 274 filtered out; finished in 3.42s
  795. 289.82 s >
  796. 289.82 s > stderr ---
  797. 289.82 s > [2026-09-23 20:46:47.181] @gammaloop_api::se... INFO : Running command import model sm-default.json
  798. 289.82 s > [2026-09-23 20:46:47.181] @import::model INFO : Loading built-in JSON model sm-default
  799. 289.82 s > [2026-09-23 20:46:47.208] @gammalooprs::model INFO : The following 15 external parameters were forced to zero by the restriction card:
  800. 289.82 s > lamWS, AWS, rhoWS, etaWS, ymc, yme, ymm, MC, Me, MM, WTau, muQ, muLe, muLmu, muLtau
  801. 289.82 s > [2026-09-23 20:46:47.209] @gammalooprs::model INFO : The following 34 vertex rules were removed by the restriction card:
  802. 289.82 s > V_82 -> (c~, d, G+) | V_83 -> (t~, d, G+) | V_84 -> (c~, s, G+) | V_85 -> (t~, s, G+) | V_86 -> (u~, b, G+) | V_87 -> (c~, b, G+) | V_90 -> (c~, d, W+) | V_91 -> (t~, d, W+) | V_92 -> (u~, s, W+) | V_94 -> (t~, s, W+) | V_95 -> (u~, b, W+) | V_96 -> (c~, b, W+) | V_101 -> (e+, e-, G0) | V_102 -> (mu+, mu-, G0) | V_104 -> (e+, e-, H) | V_105 -> (mu+, mu-, H) | V_110 -> (ve~, e-, G+) | V_111 -> (vm~, mu-, G+) | V_116 -> (b~, u, G-) | V_117 -> (d~, c, G-) | V_118 -> (s~, c, G-) | V_119 -> (b~, c, G-) | V_120 -> (d~, t, G-) | V_121 -> (s~, t, G-) | V_124 -> (s~, u, W-) | V_125 -> (b~, u, W-) | V_126 -> (d~, c, W-) | V_128 -> (b~, c, W-) | V_129 -> (d~, t, W-) | V_130 -> (s~, t, W-) | V_138 -> (c~, c, G0) | V_140 -> (c~, c, H) | V_145 -> (e+, ve, G-) | V_146 -> (mu+, vm, G-)
  803. 289.82 s > [2026-09-23 20:46:47.209] @gammalooprs::model INFO : The following 36 couplings were removed by the restriction card:
  804. 289.82 s > GC_13, GC_14, GC_16, GC_17, GC_18, GC_19, GC_20, GC_22, GC_23, GC_24, GC_25, GC_26, GC_28, GC_29, GC_42, GC_43, GC_44, GC_46, GC_47, GC_48, GC_84, GC_85, GC_86, GC_87, GC_88, GC_89, GC_90, GC_91, GC_92, GC_93, GC_101, GC_102, GC_103, GC_105, GC_106, GC_107
  805. 289.82 s > [2026-09-23 20:46:47.209] @gammaloop_api::se... INFO : Running command run set_model_parameters
  806. 289.82 s > [2026-09-23 20:46:47.209] @gammaloop_api::se... INFO : Starting command block set_model_parameters
  807. 289.82 s > [2026-09-23 20:46:47.210] @gammaloop_api::se... INFO : Running command set model MT=173.0
  808. 289.82 s > [2026-09-23 20:46:47.215] @gammaloop_api::se... INFO : Running command set model WT=0.0
  809. 289.82 s > [2026-09-23 20:46:47.220] @gammaloop_api::se... INFO : Running command set model ymt=173.0
  810. 289.82 s > [2026-09-23 20:46:47.224] @gammaloop_api::se... INFO : Running command set model aS=0.118
  811. 289.82 s > [2026-09-23 20:46:47.229] @gammaloop_api::se... INFO : Running command set model aEWM1=137.036
  812. 289.82 s > [2026-09-23 20:46:47.233] @gammaloop_api::se... INFO : Running command set model Gf=1.166390e-05
  813. 289.82 s > [2026-09-23 20:46:47.238] @gammaloop_api::se... INFO : Running command set model MZ=91.188
  814. 289.82 s > [2026-09-23 20:46:47.244] @gammaloop_api::se... INFO : Running command set global string '
  815. 289.82 s > [global.generation.compile]
  816. 289.82 s > compilation_mode = "symjit"
  817. 289.82 s > optimization_level = "O0"
  818. 289.82 s > fast_math = false
  819. 289.82 s > [...]
  820. 289.82 s > [2026-09-23 20:46:47.245] @gammaloop_api::se... INFO : Running command import graphs ./examples/cli/aa_aa/1L/aa_aa_1L.dot -p aa_aa_all_helicities -i 1L_ppmm -o
  821. 289.82 s > [2026-09-23 20:46:47.245] @commands::import INFO : Loading graphs from '/build/source/examples/cli/aa_aa/1L/aa_aa_1L.dot'
  822. 289.82 s > [2026-09-23 20:46:47.256] @gammaloop_api::se... INFO : Running command generate existing -p aa_aa_all_helicities
  823. 289.82 s > The application panicked (crashed).
  824. 289.82 s > Message: label _func_power_ not found
  825. 289.82 s > Location: /nix/store/n9w914kh1cm59xx3spcs831cdyb56m32-vendor-cargo-deps/c19b7c6f923b580ac259164a89f2577984ad5ab09ee9d583b888f934adbbe8d0/symjit-2.25.6/src/symjit/assembler.rs:77
  826. 289.82 s >
  827. 289.82 s > ━━━━━━━━━━━━━━━━━━━━━━━━━━━━━━━━━━ BACKTRACE ━━━━━━━━━━━━━━━━━━━━━━━━━━━━━━━━━━━
  828. 289.82 s > 1: <color_eyre[51793ea62743adbd]::config::PanicHook>::panic_report<unknown>
  829. 289.82 s > at <unknown source file>:<unknown line>
  830. 289.82 s > 2: <color_eyre[51793ea62743adbd]::config::PanicHook>::into_panic_hook::{closure#0}<unknown>
  831. 289.82 s > at <unknown source file>:<unknown line>
  832. 289.82 s > 3: std[bcb96dfbba0ab899]::panicking::panic_with_hook<unknown>
  833. 289.82 s > at <unknown source file>:<unknown line>
  834. 289.82 s > 4: std[bcb96dfbba0ab899]::panicking::panic_handler::{closure#0}<unknown>
  835. 289.82 s > at <unknown source file>:<unknown line>
  836. 289.82 s > 5: std[bcb96dfbba0ab899]::sys::backtrace::__rust_end_short_backtrace::<std[bcb96dfbba0ab899]::panicking::panic_handler::{closure#0}, !><unknown>
  837. 289.82 s > at <unknown source file>:<unknown line>
  838. 289.82 s > 6: __rustc[6c289b9f9c454d21]::rust_begin_unwind<unknown>
  839. 289.82 s > at <unknown source file>:<unknown line>
  840. 289.82 s > 7: core[940e698046960fd5]::panicking::panic_fmt<unknown>
  841. 289.82 s > at <unknown source file>:<unknown line>
  842. 289.82 s > 8: <symjit[e408de789c333cd]::symjit::assembler::Assembler>::apply_jumps<unknown>
  843. 289.82 s > at <unknown source file>:<unknown line>
  844. 289.82 s > 9: <symjit[e408de789c333cd]::symjit::builder::Builder>::compile_from_mir::<symjit[e408de789c333cd]::symjit::amd::complex::AmdComplexGenerator><unknown>
  845. 289.82 s > at <unknown source file>:<unknown line>
  846. 289.82 s > 10: <symjit[e408de789c333cd]::symjit::runnable::Application>::compile_ty<unknown>
  847. 289.82 s > at <unknown source file>:<unknown line>
  848. 289.82 s > 11: <symjit[e408de789c333cd]::symjit::runnable::Application>::with_mir<unknown>
  849. 289.82 s > at <unknown source file>:<unknown line>
  850. 289.82 s > 12: <symjit[e408de789c333cd]::symjit::composer::DirectTranslator as symjit[e408de789c333cd]::symjit::composer::Composer>::compile<unknown>
  851. 289.82 s > at <unknown source file>:<unknown line>
  852. 289.82 s > 13: <symjit[e408de789c333cd]::symjit::compiler::Translator as symjit[e408de789c333cd]::symjit::composer::Composer>::compile<unknown>
  853. 289.82 s > at <unknown source file>:<unknown line>
  854. 289.82 s > 14: <numerica[124dab8567f4861e]::domains::float::complex::Complex<f64> as symbolica[10e259bab675d243]::evaluate::backend::JITCompiledNumber>::jit_compile<unknown>
  855. 289.82 s > at <unknown source file>:<unknown line>
  856. 289.82 s > 15: <gammalooprs[917cbd3df9e68f8f]::integrands::process::evaluators::GenericEvaluator>::activate_symjit<unknown>
  857. 289.82 s > at <unknown source file>:<unknown line>
  858. 289.82 s > 16: <gammalooprs[917cbd3df9e68f8f]::integrands::process::amplitude::AmplitudeIntegrand>::prepare_runtime_backends_after_generation_with_compile_times<unknown>
  859. 289.82 s > at <unknown source file>:<unknown line>
  860. 289.82 s > 17: <gammalooprs[917cbd3df9e68f8f]::processes::amplitude::Amplitude>::build_integrand<unknown>
  861. 289.82 s > at <unknown source file>:<unknown line>
  862. 289.82 s > 18: <gammalooprs[917cbd3df9e68f8f]::processes::process::Process>::generate_integrands<unknown>
  863. 289.82 s > at <unknown source file>:<unknown line>
  864. 289.82 s > 19: <gammaloop_api[9ebf6628f97aeb57]::state::State>::generate_integrand<unknown>
  865. 289.82 s > at <unknown source file>:<unknown line>
  866. 289.82 s > 20: <gammaloop_api[9ebf6628f97aeb57]::commands::generate::Generate>::run::<&std[bcb96dfbba0ab899]::path::PathBuf><unknown>
  867. 289.82 s > at <unknown source file>:<unknown line>
  868. 289.82 s > 21: <gammaloop_api[9ebf6628f97aeb57]::commands::Commands>::run<unknown>
  869. 289.82 s > at <unknown source file>:<unknown line>
  870. 289.82 s > 22: <gammaloop_api[9ebf6628f97aeb57]::session::CliSession>::execute_prepared<unknown>
  871. 289.82 s > at <unknown source file>:<unknown line>
  872. 289.82 s > 23: <gammaloop_api[9ebf6628f97aeb57]::session::CliSession>::execute_command<unknown>
  873. 289.82 s > at <unknown source file>:<unknown line>
  874. 289.82 s > 24: <gammaloop_integration_tests[191607b70c61cd5a]::CLIState>::run_command<unknown>
  875. 289.82 s > at <unknown source file>:<unknown line>
  876. 289.82 s > 25: test_runs[9b7e2dc2dc4f29b0]::aa_aa::generate_aa_aa_helicity_family<unknown>
  877. 289.82 s > at <unknown source file>:<unknown line>
  878. 289.82 s > 26: <test_runs[9b7e2dc2dc4f29b0]::aa_aa::important::aa_aa_local_inspect_backend_consistency::{closure#0} as core[940e698046960fd5]::ops::function::FnOnce<()>>::call_once<unknown>
  879. 289.82 s > at <unknown source file>:<unknown line>
  880. 289.82 s > 27: serial_test[cd99724524a2f1c0]::serial_code_lock::local_serial_core_with_return::<(), eyre[cb2fd339c0c40fca]::Report><unknown>
  881. 289.82 s > at <unknown source file>:<unknown line>
  882. 289.82 s > 28: <test_runs[9b7e2dc2dc4f29b0]::aa_aa::important::aa_aa_local_inspect_backend_consistency::{closure#0} as core[940e698046960fd5]::ops::function::FnOnce<()>>::call_once<unknown>
  883. 289.82 s > at <unknown source file>:<unknown line>
  884. 289.82 s > 29: test[75d6903177b1d7e9]::__rust_begin_short_backtrace::<core[940e698046960fd5]::result::Result<(), alloc[2ea6bcb46fca0c42]::string::String>, fn() -> core[940e698046960fd5]::result::Result<(), alloc[2ea6bcb46fca0c42]::string::String>><unknown>
  885. 289.82 s > at <unknown source file>:<unknown line>
  886. 289.82 s > 30: test[75d6903177b1d7e9]::run_test::{closure#0}<unknown>
  887. 289.82 s > at <unknown source file>:<unknown line>
  888. 289.82 s > 31: std[bcb96dfbba0ab899]::sys::backtrace::__rust_begin_short_backtrace::<test[75d6903177b1d7e9]::run_test::{closure#1}, ()><unknown>
  889. 289.82 s > at <unknown source file>:<unknown line>
  890. 289.82 s > 32: <std[bcb96dfbba0ab899]::thread::lifecycle::spawn_unchecked<test[75d6903177b1d7e9]::run_test::{closure#1}, ()>::{closure#1} as core[940e698046960fd5]::ops::function::FnOnce<()>>::call_once::{shim:vtable#0}<unknown>
  891. 289.82 s > at <unknown source file>:<unknown line>
  892. 289.82 s > 33: <std[bcb96dfbba0ab899]::sys::thread::unix::Thread>::new::thread_start<unknown>
  893. 289.82 s > at <unknown source file>:<unknown line>
  894. 289.82 s > 34: start_thread<unknown>
  895. 289.82 s > at <unknown source file>:<unknown line>
  896. 289.82 s > 35: __clone3<unknown>
  897. 289.82 s > at <unknown source file>:<unknown line>
  898. 289.82 s >
  899. 289.82 s > Run with COLORBT_SHOW_HIDDEN=1 environment variable to disable frame filtering.
  900. 289.82 s > Run with RUST_BACKTRACE=full to include source snippets.
  901. 289.82 s > Warning: SpanTrace capture is Unsupported.
  902. 289.82 s > Ensure that you've setup a tracing-error ErrorLayer and the semver versions are compatible
  903. 289.82 s >
  904. 289.82 s > FAIL [ 3.759s] (157/170) gammaloop-integration-tests::uv thermal_sunrise_uv
  905. 289.82 s > stdout ---
  906. 289.82 s >
  907. 289.82 s > running 1 test
  908. 289.82 s > test thermal_sunrise_uv ... FAILED
  909. 289.82 s >
  910. 289.82 s > failures:
  911. 289.82 s >
  912. 289.82 s > failures:
  913. 289.82 s > thermal_sunrise_uv
  914. 289.82 s >
  915. 289.82 s > test result: FAILED. 0 passed; 1 failed; 0 ignored; 0 measured; 31 filtered out; finished in 3.75s
  916. 289.82 s >
  917. 289.82 s > stderr ---
  918. 289.82 s > [2026-09-23 20:47:45.035] @gammaloop_api::se... INFO : Running command run generate
  919. 289.82 s > [2026-09-23 20:47:45.035] @gammaloop_api::se... INFO : Starting command block generate
  920. 289.82 s > [2026-09-23 20:47:45.036] @gammaloop_api::se... INFO : Running command import model sm-default.json
  921. 289.82 s > [2026-09-23 20:47:45.036] @import::model INFO : Loading built-in JSON model sm-default
  922. 289.82 s > [2026-09-23 20:47:45.070] @gammalooprs::model INFO : The following 15 external parameters were forced to zero by the restriction card:
  923. 289.82 s > lamWS, AWS, rhoWS, etaWS, ymc, yme, ymm, MC, Me, MM, WTau, muQ, muLe, muLmu, muLtau
  924. 289.82 s > [2026-09-23 20:47:45.071] @gammalooprs::model INFO : The following 34 vertex rules were removed by the restriction card:
  925. 289.82 s > V_82 -> (c~, d, G+) | V_83 -> (t~, d, G+) | V_84 -> (c~, s, G+) | V_85 -> (t~, s, G+) | V_86 -> (u~, b, G+) | V_87 -> (c~, b, G+) | V_90 -> (c~, d, W+) | V_91 -> (t~, d, W+) | V_92 -> (u~, s, W+) | V_94 -> (t~, s, W+) | V_95 -> (u~, b, W+) | V_96 -> (c~, b, W+) | V_101 -> (e+, e-, G0) | V_102 -> (mu+, mu-, G0) | V_104 -> (e+, e-, H) | V_105 -> (mu+, mu-, H) | V_110 -> (ve~, e-, G+) | V_111 -> (vm~, mu-, G+) | V_116 -> (b~, u, G-) | V_117 -> (d~, c, G-) | V_118 -> (s~, c, G-) | V_119 -> (b~, c, G-) | V_120 -> (d~, t, G-) | V_121 -> (s~, t, G-) | V_124 -> (s~, u, W-) | V_125 -> (b~, u, W-) | V_126 -> (d~, c, W-) | V_128 -> (b~, c, W-) | V_129 -> (d~, t, W-) | V_130 -> (s~, t, W-) | V_138 -> (c~, c, G0) | V_140 -> (c~, c, H) | V_145 -> (e+, ve, G-) | V_146 -> (mu+, vm, G-)
  926. 289.82 s > [2026-09-23 20:47:45.071] @gammalooprs::model INFO : The following 36 couplings were removed by the restriction card:
  927. 289.82 s > GC_13, GC_14, GC_16, GC_17, GC_18, GC_19, GC_20, GC_22, GC_23, GC_24, GC_25, GC_26, GC_28, GC_29, GC_42, GC_43, GC_44, GC_46, GC_47, GC_48, GC_84, GC_85, GC_86, GC_87, GC_88, GC_89, GC_90, GC_91, GC_92, GC_93, GC_101, GC_102, GC_103, GC_105, GC_106, GC_107
  928. 289.82 s > [2026-09-23 20:47:45.071] @gammaloop_api::se... INFO : Running command remove processes
  929. 289.82 s > [2026-09-23 20:47:45.071] @gammaloop_api::se... INFO : Running command generate amp {} > {} [{2}] | g u
  930. 289.82 s > --numerator-grouping group_identical_graphs_up_to_scalar_rescaling
  931. 289.82 s > --max-n-bridges 0
  932. 289.82 s > --number-of-factorized-loop-subtopologies 1 1
  933. 289.82 s > --number-of-anticommutating-loops 1 1
  934. 289.82 s > [...]
  935. 289.82 s > [2026-09-23 20:47:45.073] @feyngen::diagram_... INFO : 0s | Δ=0s | Starting Feynman graph generation with Symbolica...
  936. 289.82 s > [2026-09-23 20:47:45.073] @feyngen::diagram_... INFO : 0s | Δ=0s | Number of graphs resulting from Symbolica generation: 3
  937. 289.82 s > [2026-09-23 20:47:45.073] @feyngen::diagram_... INFO : 0s | Δ=0s | Number of graphs retained after removal of vetoed topologies: 2
  938. 289.82 s > [2026-09-23 20:47:45.073] @feyngen::diagram_... INFO : 0s | Δ=0s | Number of graphs after vertex info assignment: 2
  939. 289.82 s > [2026-09-23 20:47:45.073] @feyngen::diagram_... INFO : 0s | Δ=0s | Number of graphs after all complete graphs filters are applied: 2
  940. 289.82 s > [2026-09-23 20:47:45.073] @feyngen::diagram_... INFO : 0s | Δ=0s | Number of graphs after closed anticommutating chains analysis: 1
  941. 289.82 s > [2026-09-23 20:47:45.073] @feyngen::diagram_... INFO : 0s | Δ=0s | Number of graphs after symmetrization of external states: 1
  942. 289.82 s > [2026-09-23 20:47:45.073] @feyngen::diagram_... INFO : 0s | Δ=0s | Number of graphs after canonization of vertices, edges and flows (graph labels assigned here): 1
  943. 289.82 s > [2026-09-23 20:47:45.089] @feyngen::diagram_... INFO : 0s | Δ=0s | Number of graphs after numerator-aware grouping with strategy 'up to a scalar rescaling': 1 (1 isomorphically unique graph, 0 color zero, 0 lorentz zero, 0 grouped and 0 cancellation)
  944. 289.82 s > [2026-09-23 20:47:45.089] @feyngen::diagram_... INFO : ( Sum of the symmetry factors from each graph generated = -1/2 )
  945. 289.82 s > [2026-09-23 20:47:45.089] @commands::generate INFO : Generated amplitude 1 graphs.
  946. 289.82 s > [2026-09-23 20:47:45.089] @commands::generate INFO : Only diagram generation was requested, skipping integrand generation. You can generate integrands later using the 'generate existing <options>' command.
  947. 289.82 s > [2026-09-23 20:47:45.089] @gammaloop_api::se... INFO : Running command generate
  948. 289.82 s > The application panicked (crashed).
  949. 289.82 s > Message: label _func_power_ not found
  950. 289.82 s > Location: /nix/store/n9w914kh1cm59xx3spcs831cdyb56m32-vendor-cargo-deps/c19b7c6f923b580ac259164a89f2577984ad5ab09ee9d583b888f934adbbe8d0/symjit-2.25.6/src/symjit/assembler.rs:77
  951. 289.82 s >
  952. 289.82 s > ━━━━━━━━━━━━━━━━━━━━━━━━━━━━━━━━━━ BACKTRACE ━━━━━━━━━━━━━━━━━━━━━━━━━━━━━━━━━━━
  953. 289.82 s > 1: <color_eyre[51793ea62743adbd]::config::PanicHook>::panic_report<unknown>
  954. 289.82 s > at <unknown source file>:<unknown line>
  955. 289.82 s > 2: <color_eyre[51793ea62743adbd]::config::PanicHook>::into_panic_hook::{closure#0}<unknown>
  956. 289.82 s > at <unknown source file>:<unknown line>
  957. 289.82 s > 3: std[bcb96dfbba0ab899]::panicking::panic_with_hook<unknown>
  958. 289.82 s > at <unknown source file>:<unknown line>
  959. 289.82 s > 4: std[bcb96dfbba0ab899]::panicking::panic_handler::{closure#0}<unknown>
  960. 289.82 s > at <unknown source file>:<unknown line>
  961. 289.82 s > 5: std[bcb96dfbba0ab899]::sys::backtrace::__rust_end_short_backtrace::<std[bcb96dfbba0ab899]::panicking::panic_handler::{closure#0}, !><unknown>
  962. 289.82 s > at <unknown source file>:<unknown line>
  963. 289.82 s > 6: __rustc[6c289b9f9c454d21]::rust_begin_unwind<unknown>
  964. 289.82 s > at <unknown source file>:<unknown line>
  965. 289.82 s > 7: core[940e698046960fd5]::panicking::panic_fmt<unknown>
  966. 289.82 s > at <unknown source file>:<unknown line>
  967. 289.82 s > 8: <symjit[e408de789c333cd]::symjit::assembler::Assembler>::apply_jumps<unknown>
  968. 289.82 s > at <unknown source file>:<unknown line>
  969. 289.82 s > 9: <symjit[e408de789c333cd]::symjit::builder::Builder>::compile_from_mir::<symjit[e408de789c333cd]::symjit::amd::complex::AmdComplexGenerator><unknown>
  970. 289.82 s > at <unknown source file>:<unknown line>
  971. 289.82 s > 10: <symjit[e408de789c333cd]::symjit::runnable::Application>::compile_ty<unknown>
  972. 289.82 s > at <unknown source file>:<unknown line>
  973. 289.82 s > 11: <symjit[e408de789c333cd]::symjit::runnable::Application>::with_mir<unknown>
  974. 289.82 s > at <unknown source file>:<unknown line>
  975. 289.82 s > 12: <symjit[e408de789c333cd]::symjit::composer::DirectTranslator as symjit[e408de789c333cd]::symjit::composer::Composer>::compile<unknown>
  976. 289.82 s > at <unknown source file>:<unknown line>
  977. 289.82 s > 13: <symjit[e408de789c333cd]::symjit::compiler::Translator as symjit[e408de789c333cd]::symjit::composer::Composer>::compile<unknown>
  978. 289.82 s > at <unknown source file>:<unknown line>
  979. 289.82 s > 14: <numerica[124dab8567f4861e]::domains::float::complex::Complex<f64> as symbolica[10e259bab675d243]::evaluate::backend::JITCompiledNumber>::jit_compile<unknown>
  980. 289.82 s > at <unknown source file>:<unknown line>
  981. 289.82 s > 15: <gammalooprs[917cbd3df9e68f8f]::integrands::process::evaluators::GenericEvaluator>::activate_symjit<unknown>
  982. 289.82 s > at <unknown source file>:<unknown line>
  983. 289.82 s > 16: <gammalooprs[917cbd3df9e68f8f]::integrands::process::amplitude::AmplitudeIntegrand>::prepare_runtime_backends_after_generation_with_compile_times<unknown>
  984. 289.82 s > at <unknown source file>:<unknown line>
  985. 289.82 s > 17: <gammalooprs[917cbd3df9e68f8f]::processes::amplitude::Amplitude>::build_integrand<unknown>
  986. 289.82 s > at <unknown source file>:<unknown line>
  987. 289.82 s > 18: <gammalooprs[917cbd3df9e68f8f]::processes::process::Process>::generate_integrands<unknown>
  988. 289.82 s > at <unknown source file>:<unknown line>
  989. 289.82 s > 19: <gammalooprs[917cbd3df9e68f8f]::processes::ProcessList>::generate_integrands<unknown>
  990. 289.82 s > at <unknown source file>:<unknown line>
  991. 289.82 s > 20: <gammaloop_api[9ebf6628f97aeb57]::state::State>::generate_integrands<unknown>
  992. 289.82 s > at <unknown source file>:<unknown line>
  993. 289.82 s > 21: <gammaloop_api[9ebf6628f97aeb57]::commands::generate::Generate>::run::<&std[bcb96dfbba0ab899]::path::PathBuf><unknown>
  994. 289.82 s > at <unknown source file>:<unknown line>
  995. 289.82 s > 22: <gammaloop_api[9ebf6628f97aeb57]::commands::Commands>::run<unknown>
  996. 289.82 s > at <unknown source file>:<unknown line>
  997. 289.82 s > 23: <gammaloop_api[9ebf6628f97aeb57]::session::CliSession>::execute_prepared<unknown>
  998. 289.82 s > at <unknown source file>:<unknown line>
  999. 289.82 s > 24: <gammaloop_api[9ebf6628f97aeb57]::session::CliSession>::execute_prepared_commands<unknown>
  1000. 289.82 s > at <unknown source file>:<unknown line>
  1001. 289.82 s > 25: <gammaloop_api[9ebf6628f97aeb57]::session::CliSession>::execute_prepared<unknown>
  1002. 289.82 s > at <unknown source file>:<unknown line>
  1003. 289.82 s > 26: <gammaloop_api[9ebf6628f97aeb57]::session::CliSession>::execute_command<unknown>
  1004. 289.82 s > at <unknown source file>:<unknown line>
  1005. 289.82 s > 27: <gammaloop_integration_tests[191607b70c61cd5a]::CLIState>::run_command<unknown>
  1006. 289.82 s > at <unknown source file>:<unknown line>
  1007. 289.82 s > 28: uv[3c7454ef256d6487]::run_single_integrated_uv_case<unknown>
  1008. 289.82 s > at <unknown source file>:<unknown line>
  1009. 289.82 s > 29: <uv[3c7454ef256d6487]::thermal_sunrise_uv::{closure#0} as core[940e698046960fd5]::ops::function::FnOnce<()>>::call_once<unknown>
  1010. 289.82 s > at <unknown source file>:<unknown line>
  1011. 289.82 s > 30: test[75d6903177b1d7e9]::__rust_begin_short_backtrace::<core[940e698046960fd5]::result::Result<(), alloc[2ea6bcb46fca0c42]::string::String>, fn() -> core[940e698046960fd5]::result::Result<(), alloc[2ea6bcb46fca0c42]::string::String>><unknown>
  1012. 289.82 s > at <unknown source file>:<unknown line>
  1013. 289.82 s > 31: test[75d6903177b1d7e9]::run_test::{closure#0}<unknown>
  1014. 289.82 s > at <unknown source file>:<unknown line>
  1015. 289.82 s > 32: std[bcb96dfbba0ab899]::sys::backtrace::__rust_begin_short_backtrace::<test[75d6903177b1d7e9]::run_test::{closure#1}, ()><unknown>
  1016. 289.82 s > at <unknown source file>:<unknown line>
  1017. 289.82 s > 33: <std[bcb96dfbba0ab899]::thread::lifecycle::spawn_unchecked<test[75d6903177b1d7e9]::run_test::{closure#1}, ()>::{closure#1} as core[940e698046960fd5]::ops::function::FnOnce<()>>::call_once::{shim:vtable#0}<unknown>
  1018. 289.82 s > at <unknown source file>:<unknown line>
  1019. 289.82 s > 34: <std[bcb96dfbba0ab899]::sys::thread::unix::Thread>::new::thread_start<unknown>
  1020. 289.82 s > at <unknown source file>:<unknown line>
  1021. 289.82 s > 35: start_thread<unknown>
  1022. 289.82 s > at <unknown source file>:<unknown line>
  1023. 289.82 s > 36: __clone3<unknown>
  1024. 289.82 s > at <unknown source file>:<unknown line>
  1025. 289.82 s >
  1026. 289.82 s > Run with COLORBT_SHOW_HIDDEN=1 environment variable to disable frame filtering.
  1027. 289.82 s > Run with RUST_BACKTRACE=full to include source snippets.
  1028. 289.82 s > Warning: SpanTrace capture is Unsupported.
  1029. 289.82 s > Ensure that you've setup a tracing-error ErrorLayer and the semver versions are compatible
  1030. 289.82 s >
  1031. 289.82 s > ------------
  1032. 289.82 s > Summary [ 252.442s] 170 tests run: 168 passed, 2 failed, 209 skipped
  1033. 289.82 s > FAIL [ 3.444s] ( 55/170) gammaloop-integration-tests::test_runs aa_aa::important::aa_aa_local_inspect_backend_consistency
  1034. 289.82 s > stdout ---
  1035. 289.82 s >
  1036. 289.82 s > running 1 test
  1037. 289.82 s > test aa_aa::important::aa_aa_local_inspect_backend_consistency ... FAILED
  1038. 289.82 s >
  1039. 289.82 s > failures:
  1040. 289.82 s >
  1041. 289.82 s > failures:
  1042. 289.82 s > aa_aa::important::aa_aa_local_inspect_backend_consistency
  1043. 289.82 s >
  1044. 289.82 s > test result: FAILED. 0 passed; 1 failed; 0 ignored; 0 measured; 274 filtered out; finished in 3.42s
  1045. 289.82 s >
  1046. 289.82 s > stderr ---
  1047. 289.82 s > [2026-09-23 20:46:47.181] @gammaloop_api::se... INFO : Running command import model sm-default.json
  1048. 289.82 s > [2026-09-23 20:46:47.181] @import::model INFO : Loading built-in JSON model sm-default
  1049. 289.82 s > [2026-09-23 20:46:47.208] @gammalooprs::model INFO : The following 15 external parameters were forced to zero by the restriction card:
  1050. 289.82 s > lamWS, AWS, rhoWS, etaWS, ymc, yme, ymm, MC, Me, MM, WTau, muQ, muLe, muLmu, muLtau
  1051. 289.82 s > [2026-09-23 20:46:47.209] @gammalooprs::model INFO : The following 34 vertex rules were removed by the restriction card:
  1052. 289.82 s > V_82 -> (c~, d, G+) | V_83 -> (t~, d, G+) | V_84 -> (c~, s, G+) | V_85 -> (t~, s, G+) | V_86 -> (u~, b, G+) | V_87 -> (c~, b, G+) | V_90 -> (c~, d, W+) | V_91 -> (t~, d, W+) | V_92 -> (u~, s, W+) | V_94 -> (t~, s, W+) | V_95 -> (u~, b, W+) | V_96 -> (c~, b, W+) | V_101 -> (e+, e-, G0) | V_102 -> (mu+, mu-, G0) | V_104 -> (e+, e-, H) | V_105 -> (mu+, mu-, H) | V_110 -> (ve~, e-, G+) | V_111 -> (vm~, mu-, G+) | V_116 -> (b~, u, G-) | V_117 -> (d~, c, G-) | V_118 -> (s~, c, G-) | V_119 -> (b~, c, G-) | V_120 -> (d~, t, G-) | V_121 -> (s~, t, G-) | V_124 -> (s~, u, W-) | V_125 -> (b~, u, W-) | V_126 -> (d~, c, W-) | V_128 -> (b~, c, W-) | V_129 -> (d~, t, W-) | V_130 -> (s~, t, W-) | V_138 -> (c~, c, G0) | V_140 -> (c~, c, H) | V_145 -> (e+, ve, G-) | V_146 -> (mu+, vm, G-)
  1053. 289.82 s > [2026-09-23 20:46:47.209] @gammalooprs::model INFO : The following 36 couplings were removed by the restriction card:
  1054. 289.82 s > GC_13, GC_14, GC_16, GC_17, GC_18, GC_19, GC_20, GC_22, GC_23, GC_24, GC_25, GC_26, GC_28, GC_29, GC_42, GC_43, GC_44, GC_46, GC_47, GC_48, GC_84, GC_85, GC_86, GC_87, GC_88, GC_89, GC_90, GC_91, GC_92, GC_93, GC_101, GC_102, GC_103, GC_105, GC_106, GC_107
  1055. 289.82 s > [2026-09-23 20:46:47.209] @gammaloop_api::se... INFO : Running command run set_model_parameters
  1056. 289.82 s > [2026-09-23 20:46:47.209] @gammaloop_api::se... INFO : Starting command block set_model_parameters
  1057. 289.82 s > [2026-09-23 20:46:47.210] @gammaloop_api::se... INFO : Running command set model MT=173.0
  1058. 289.82 s > [2026-09-23 20:46:47.215] @gammaloop_api::se... INFO : Running command set model WT=0.0
  1059. 289.82 s > [2026-09-23 20:46:47.220] @gammaloop_api::se... INFO : Running command set model ymt=173.0
  1060. 289.82 s > [2026-09-23 20:46:47.224] @gammaloop_api::se... INFO : Running command set model aS=0.118
  1061. 289.82 s > [2026-09-23 20:46:47.229] @gammaloop_api::se... INFO : Running command set model aEWM1=137.036
  1062. 289.82 s > [2026-09-23 20:46:47.233] @gammaloop_api::se... INFO : Running command set model Gf=1.166390e-05
  1063. 289.82 s > [2026-09-23 20:46:47.238] @gammaloop_api::se... INFO : Running command set model MZ=91.188
  1064. 289.82 s > [2026-09-23 20:46:47.244] @gammaloop_api::se... INFO : Running command set global string '
  1065. 289.82 s > [global.generation.compile]
  1066. 289.82 s > compilation_mode = "symjit"
  1067. 289.82 s > optimization_level = "O0"
  1068. 289.82 s > fast_math = false
  1069. 289.82 s > [...]
  1070. 289.82 s > [2026-09-23 20:46:47.245] @gammaloop_api::se... INFO : Running command import graphs ./examples/cli/aa_aa/1L/aa_aa_1L.dot -p aa_aa_all_helicities -i 1L_ppmm -o
  1071. 289.82 s > [2026-09-23 20:46:47.245] @commands::import INFO : Loading graphs from '/build/source/examples/cli/aa_aa/1L/aa_aa_1L.dot'
  1072. 289.82 s > [2026-09-23 20:46:47.256] @gammaloop_api::se... INFO : Running command generate existing -p aa_aa_all_helicities
  1073. 289.82 s > The application panicked (crashed).
  1074. 289.82 s > Message: label _func_power_ not found
  1075. 289.82 s > Location: /nix/store/n9w914kh1cm59xx3spcs831cdyb56m32-vendor-cargo-deps/c19b7c6f923b580ac259164a89f2577984ad5ab09ee9d583b888f934adbbe8d0/symjit-2.25.6/src/symjit/assembler.rs:77
  1076. 289.82 s >
  1077. 289.82 s > ━━━━━━━━━━━━━━━━━━━━━━━━━━━━━━━━━━ BACKTRACE ━━━━━━━━━━━━━━━━━━━━━━━━━━━━━━━━━━━
  1078. 289.82 s > 1: <color_eyre[51793ea62743adbd]::config::PanicHook>::panic_report<unknown>
  1079. 289.82 s > at <unknown source file>:<unknown line>
  1080. 289.82 s > 2: <color_eyre[51793ea62743adbd]::config::PanicHook>::into_panic_hook::{closure#0}<unknown>
  1081. 289.82 s > at <unknown source file>:<unknown line>
  1082. 289.82 s > 3: std[bcb96dfbba0ab899]::panicking::panic_with_hook<unknown>
  1083. 289.82 s > at <unknown source file>:<unknown line>
  1084. 289.82 s > 4: std[bcb96dfbba0ab899]::panicking::panic_handler::{closure#0}<unknown>
  1085. 289.82 s > at <unknown source file>:<unknown line>
  1086. 289.82 s > 5: std[bcb96dfbba0ab899]::sys::backtrace::__rust_end_short_backtrace::<std[bcb96dfbba0ab899]::panicking::panic_handler::{closure#0}, !><unknown>
  1087. 289.82 s > at <unknown source file>:<unknown line>
  1088. 289.82 s > 6: __rustc[6c289b9f9c454d21]::rust_begin_unwind<unknown>
  1089. 289.82 s > at <unknown source file>:<unknown line>
  1090. 289.82 s > 7: core[940e698046960fd5]::panicking::panic_fmt<unknown>
  1091. 289.82 s > at <unknown source file>:<unknown line>
  1092. 289.82 s > 8: <symjit[e408de789c333cd]::symjit::assembler::Assembler>::apply_jumps<unknown>
  1093. 289.82 s > at <unknown source file>:<unknown line>
  1094. 289.82 s > 9: <symjit[e408de789c333cd]::symjit::builder::Builder>::compile_from_mir::<symjit[e408de789c333cd]::symjit::amd::complex::AmdComplexGenerator><unknown>
  1095. 289.82 s > at <unknown source file>:<unknown line>
  1096. 289.82 s > 10: <symjit[e408de789c333cd]::symjit::runnable::Application>::compile_ty<unknown>
  1097. 289.82 s > at <unknown source file>:<unknown line>
  1098. 289.82 s > 11: <symjit[e408de789c333cd]::symjit::runnable::Application>::with_mir<unknown>
  1099. 289.82 s > at <unknown source file>:<unknown line>
  1100. 289.82 s > 12: <symjit[e408de789c333cd]::symjit::composer::DirectTranslator as symjit[e408de789c333cd]::symjit::composer::Composer>::compile<unknown>
  1101. 289.82 s > at <unknown source file>:<unknown line>
  1102. 289.82 s > 13: <symjit[e408de789c333cd]::symjit::compiler::Translator as symjit[e408de789c333cd]::symjit::composer::Composer>::compile<unknown>
  1103. 289.82 s > at <unknown source file>:<unknown line>
  1104. 289.82 s > 14: <numerica[124dab8567f4861e]::domains::float::complex::Complex<f64> as symbolica[10e259bab675d243]::evaluate::backend::JITCompiledNumber>::jit_compile<unknown>
  1105. 289.82 s > at <unknown source file>:<unknown line>
  1106. 289.82 s > 15: <gammalooprs[917cbd3df9e68f8f]::integrands::process::evaluators::GenericEvaluator>::activate_symjit<unknown>
  1107. 289.82 s > at <unknown source file>:<unknown line>
  1108. 289.82 s > 16: <gammalooprs[917cbd3df9e68f8f]::integrands::process::amplitude::AmplitudeIntegrand>::prepare_runtime_backends_after_generation_with_compile_times<unknown>
  1109. 289.82 s > at <unknown source file>:<unknown line>
  1110. 289.82 s > 17: <gammalooprs[917cbd3df9e68f8f]::processes::amplitude::Amplitude>::build_integrand<unknown>
  1111. 289.82 s > at <unknown source file>:<unknown line>
  1112. 289.82 s > 18: <gammalooprs[917cbd3df9e68f8f]::processes::process::Process>::generate_integrands<unknown>
  1113. 289.82 s > at <unknown source file>:<unknown line>
  1114. 289.82 s > 19: <gammaloop_api[9ebf6628f97aeb57]::state::State>::generate_integrand<unknown>
  1115. 289.82 s > at <unknown source file>:<unknown line>
  1116. 289.82 s > 20: <gammaloop_api[9ebf6628f97aeb57]::commands::generate::Generate>::run::<&std[bcb96dfbba0ab899]::path::PathBuf><unknown>
  1117. 289.82 s > at <unknown source file>:<unknown line>
  1118. 289.82 s > 21: <gammaloop_api[9ebf6628f97aeb57]::commands::Commands>::run<unknown>
  1119. 289.82 s > at <unknown source file>:<unknown line>
  1120. 289.82 s > 22: <gammaloop_api[9ebf6628f97aeb57]::session::CliSession>::execute_prepared<unknown>
  1121. 289.82 s > at <unknown source file>:<unknown line>
  1122. 289.82 s > 23: <gammaloop_api[9ebf6628f97aeb57]::session::CliSession>::execute_command<unknown>
  1123. 289.82 s > at <unknown source file>:<unknown line>
  1124. 289.82 s > 24: <gammaloop_integration_tests[191607b70c61cd5a]::CLIState>::run_command<unknown>
  1125. 289.82 s > at <unknown source file>:<unknown line>
  1126. 289.82 s > 25: test_runs[9b7e2dc2dc4f29b0]::aa_aa::generate_aa_aa_helicity_family<unknown>
  1127. 289.82 s > at <unknown source file>:<unknown line>
  1128. 289.82 s > 26: <test_runs[9b7e2dc2dc4f29b0]::aa_aa::important::aa_aa_local_inspect_backend_consistency::{closure#0} as core[940e698046960fd5]::ops::function::FnOnce<()>>::call_once<unknown>
  1129. 289.82 s > at <unknown source file>:<unknown line>
  1130. 289.82 s > 27: serial_test[cd99724524a2f1c0]::serial_code_lock::local_serial_core_with_return::<(), eyre[cb2fd339c0c40fca]::Report><unknown>
  1131. 289.82 s > at <unknown source file>:<unknown line>
  1132. 289.82 s > 28: <test_runs[9b7e2dc2dc4f29b0]::aa_aa::important::aa_aa_local_inspect_backend_consistency::{closure#0} as core[940e698046960fd5]::ops::function::FnOnce<()>>::call_once<unknown>
  1133. 289.82 s > at <unknown source file>:<unknown line>
  1134. 289.82 s > 29: test[75d6903177b1d7e9]::__rust_begin_short_backtrace::<core[940e698046960fd5]::result::Result<(), alloc[2ea6bcb46fca0c42]::string::String>, fn() -> core[940e698046960fd5]::result::Result<(), alloc[2ea6bcb46fca0c42]::string::String>><unknown>
  1135. 289.82 s > at <unknown source file>:<unknown line>
  1136. 289.82 s > 30: test[75d6903177b1d7e9]::run_test::{closure#0}<unknown>
  1137. 289.82 s > at <unknown source file>:<unknown line>
  1138. 289.82 s > 31: std[bcb96dfbba0ab899]::sys::backtrace::__rust_begin_short_backtrace::<test[75d6903177b1d7e9]::run_test::{closure#1}, ()><unknown>
  1139. 289.82 s > at <unknown source file>:<unknown line>
  1140. 289.82 s > 32: <std[bcb96dfbba0ab899]::thread::lifecycle::spawn_unchecked<test[75d6903177b1d7e9]::run_test::{closure#1}, ()>::{closure#1} as core[940e698046960fd5]::ops::function::FnOnce<()>>::call_once::{shim:vtable#0}<unknown>
  1141. 289.82 s > at <unknown source file>:<unknown line>
  1142. 289.82 s > 33: <std[bcb96dfbba0ab899]::sys::thread::unix::Thread>::new::thread_start<unknown>
  1143. 289.82 s > at <unknown source file>:<unknown line>
  1144. 289.82 s > 34: start_thread<unknown>
  1145. 289.82 s > at <unknown source file>:<unknown line>
  1146. 289.82 s > 35: __clone3<unknown>
  1147. 289.82 s > at <unknown source file>:<unknown line>
  1148. 289.82 s >
  1149. 289.82 s > Run with COLORBT_SHOW_HIDDEN=1 environment variable to disable frame filtering.
  1150. 289.82 s > Run with RUST_BACKTRACE=full to include source snippets.
  1151. 289.82 s > Warning: SpanTrace capture is Unsupported.
  1152. 289.82 s > Ensure that you've setup a tracing-error ErrorLayer and the semver versions are compatible
  1153. 289.82 s >
  1154. 289.82 s > FAIL [ 3.759s] (157/170) gammaloop-integration-tests::uv thermal_sunrise_uv
  1155. 289.82 s > stdout ---
  1156. 289.82 s >
  1157. 289.82 s > running 1 test
  1158. 289.82 s > test thermal_sunrise_uv ... FAILED
  1159. 289.82 s >
  1160. 289.82 s > failures:
  1161. 289.82 s >
  1162. 289.82 s > failures:
  1163. 289.82 s > thermal_sunrise_uv
  1164. 289.82 s >
  1165. 289.82 s > test result: FAILED. 0 passed; 1 failed; 0 ignored; 0 measured; 31 filtered out; finished in 3.75s
  1166. 289.82 s >
  1167. 289.82 s > stderr ---
  1168. 289.82 s > [2026-09-23 20:47:45.035] @gammaloop_api::se... INFO : Running command run generate
  1169. 289.82 s > [2026-09-23 20:47:45.035] @gammaloop_api::se... INFO : Starting command block generate
  1170. 289.82 s > [2026-09-23 20:47:45.036] @gammaloop_api::se... INFO : Running command import model sm-default.json
  1171. 289.82 s > [2026-09-23 20:47:45.036] @import::model INFO : Loading built-in JSON model sm-default
  1172. 289.82 s > [2026-09-23 20:47:45.070] @gammalooprs::model INFO : The following 15 external parameters were forced to zero by the restriction card:
  1173. 289.82 s > lamWS, AWS, rhoWS, etaWS, ymc, yme, ymm, MC, Me, MM, WTau, muQ, muLe, muLmu, muLtau
  1174. 289.82 s > [2026-09-23 20:47:45.071] @gammalooprs::model INFO : The following 34 vertex rules were removed by the restriction card:
  1175. 289.82 s > V_82 -> (c~, d, G+) | V_83 -> (t~, d, G+) | V_84 -> (c~, s, G+) | V_85 -> (t~, s, G+) | V_86 -> (u~, b, G+) | V_87 -> (c~, b, G+) | V_90 -> (c~, d, W+) | V_91 -> (t~, d, W+) | V_92 -> (u~, s, W+) | V_94 -> (t~, s, W+) | V_95 -> (u~, b, W+) | V_96 -> (c~, b, W+) | V_101 -> (e+, e-, G0) | V_102 -> (mu+, mu-, G0) | V_104 -> (e+, e-, H) | V_105 -> (mu+, mu-, H) | V_110 -> (ve~, e-, G+) | V_111 -> (vm~, mu-, G+) | V_116 -> (b~, u, G-) | V_117 -> (d~, c, G-) | V_118 -> (s~, c, G-) | V_119 -> (b~, c, G-) | V_120 -> (d~, t, G-) | V_121 -> (s~, t, G-) | V_124 -> (s~, u, W-) | V_125 -> (b~, u, W-) | V_126 -> (d~, c, W-) | V_128 -> (b~, c, W-) | V_129 -> (d~, t, W-) | V_130 -> (s~, t, W-) | V_138 -> (c~, c, G0) | V_140 -> (c~, c, H) | V_145 -> (e+, ve, G-) | V_146 -> (mu+, vm, G-)
  1176. 289.82 s > [2026-09-23 20:47:45.071] @gammalooprs::model INFO : The following 36 couplings were removed by the restriction card:
  1177. 289.82 s > GC_13, GC_14, GC_16, GC_17, GC_18, GC_19, GC_20, GC_22, GC_23, GC_24, GC_25, GC_26, GC_28, GC_29, GC_42, GC_43, GC_44, GC_46, GC_47, GC_48, GC_84, GC_85, GC_86, GC_87, GC_88, GC_89, GC_90, GC_91, GC_92, GC_93, GC_101, GC_102, GC_103, GC_105, GC_106, GC_107
  1178. 289.82 s > [2026-09-23 20:47:45.071] @gammaloop_api::se... INFO : Running command remove processes
  1179. 289.82 s > [2026-09-23 20:47:45.071] @gammaloop_api::se... INFO : Running command generate amp {} > {} [{2}] | g u
  1180. 289.82 s > --numerator-grouping group_identical_graphs_up_to_scalar_rescaling
  1181. 289.82 s > --max-n-bridges 0
  1182. 289.82 s > --number-of-factorized-loop-subtopologies 1 1
  1183. 289.82 s > --number-of-anticommutating-loops 1 1
  1184. 289.82 s > [...]
  1185. 289.82 s > [2026-09-23 20:47:45.073] @feyngen::diagram_... INFO : 0s | Δ=0s | Starting Feynman graph generation with Symbolica...
  1186. 289.82 s > [2026-09-23 20:47:45.073] @feyngen::diagram_... INFO : 0s | Δ=0s | Number of graphs resulting from Symbolica generation: 3
  1187. 289.82 s > [2026-09-23 20:47:45.073] @feyngen::diagram_... INFO : 0s | Δ=0s | Number of graphs retained after removal of vetoed topologies: 2
  1188. 289.82 s > [2026-09-23 20:47:45.073] @feyngen::diagram_... INFO : 0s | Δ=0s | Number of graphs after vertex info assignment: 2
  1189. 289.82 s > [2026-09-23 20:47:45.073] @feyngen::diagram_... INFO : 0s | Δ=0s | Number of graphs after all complete graphs filters are applied: 2
  1190. 289.82 s > [2026-09-23 20:47:45.073] @feyngen::diagram_... INFO : 0s | Δ=0s | Number of graphs after closed anticommutating chains analysis: 1
  1191. 289.82 s > [2026-09-23 20:47:45.073] @feyngen::diagram_... INFO : 0s | Δ=0s | Number of graphs after symmetrization of external states: 1
  1192. 289.82 s > [2026-09-23 20:47:45.073] @feyngen::diagram_... INFO : 0s | Δ=0s | Number of graphs after canonization of vertices, edges and flows (graph labels assigned here): 1
  1193. 289.82 s > [2026-09-23 20:47:45.089] @feyngen::diagram_... INFO : 0s | Δ=0s | Number of graphs after numerator-aware grouping with strategy 'up to a scalar rescaling': 1 (1 isomorphically unique graph, 0 color zero, 0 lorentz zero, 0 grouped and 0 cancellation)
  1194. 289.82 s > [2026-09-23 20:47:45.089] @feyngen::diagram_... INFO : ( Sum of the symmetry factors from each graph generated = -1/2 )
  1195. 289.82 s > [2026-09-23 20:47:45.089] @commands::generate INFO : Generated amplitude 1 graphs.
  1196. 289.82 s > [2026-09-23 20:47:45.089] @commands::generate INFO : Only diagram generation was requested, skipping integrand generation. You can generate integrands later using the 'generate existing <options>' command.
  1197. 289.82 s > [2026-09-23 20:47:45.089] @gammaloop_api::se... INFO : Running command generate
  1198. 289.82 s > The application panicked (crashed).
  1199. 289.82 s > Message: label _func_power_ not found
  1200. 289.82 s > Location: /nix/store/n9w914kh1cm59xx3spcs831cdyb56m32-vendor-cargo-deps/c19b7c6f923b580ac259164a89f2577984ad5ab09ee9d583b888f934adbbe8d0/symjit-2.25.6/src/symjit/assembler.rs:77
  1201. 289.82 s >
  1202. 289.82 s > ━━━━━━━━━━━━━━━━━━━━━━━━━━━━━━━━━━ BACKTRACE ━━━━━━━━━━━━━━━━━━━━━━━━━━━━━━━━━━━
  1203. 289.82 s > 1: <color_eyre[51793ea62743adbd]::config::PanicHook>::panic_report<unknown>
  1204. 289.82 s > at <unknown source file>:<unknown line>
  1205. 289.82 s > 2: <color_eyre[51793ea62743adbd]::config::PanicHook>::into_panic_hook::{closure#0}<unknown>
  1206. 289.82 s > at <unknown source file>:<unknown line>
  1207. 289.82 s > 3: std[bcb96dfbba0ab899]::panicking::panic_with_hook<unknown>
  1208. 289.82 s > at <unknown source file>:<unknown line>
  1209. 289.82 s > 4: std[bcb96dfbba0ab899]::panicking::panic_handler::{closure#0}<unknown>
  1210. 289.82 s > at <unknown source file>:<unknown line>
  1211. 289.82 s > 5: std[bcb96dfbba0ab899]::sys::backtrace::__rust_end_short_backtrace::<std[bcb96dfbba0ab899]::panicking::panic_handler::{closure#0}, !><unknown>
  1212. 289.82 s > at <unknown source file>:<unknown line>
  1213. 289.82 s > 6: __rustc[6c289b9f9c454d21]::rust_begin_unwind<unknown>
  1214. 289.82 s > at <unknown source file>:<unknown line>
  1215. 289.82 s > 7: core[940e698046960fd5]::panicking::panic_fmt<unknown>
  1216. 289.82 s > at <unknown source file>:<unknown line>
  1217. 289.82 s > 8: <symjit[e408de789c333cd]::symjit::assembler::Assembler>::apply_jumps<unknown>
  1218. 289.82 s > at <unknown source file>:<unknown line>
  1219. 289.82 s > 9: <symjit[e408de789c333cd]::symjit::builder::Builder>::compile_from_mir::<symjit[e408de789c333cd]::symjit::amd::complex::AmdComplexGenerator><unknown>
  1220. 289.82 s > at <unknown source file>:<unknown line>
  1221. 289.82 s > 10: <symjit[e408de789c333cd]::symjit::runnable::Application>::compile_ty<unknown>
  1222. 289.82 s > at <unknown source file>:<unknown line>
  1223. 289.82 s > 11: <symjit[e408de789c333cd]::symjit::runnable::Application>::with_mir<unknown>
  1224. 289.82 s > at <unknown source file>:<unknown line>
  1225. 289.82 s > 12: <symjit[e408de789c333cd]::symjit::composer::DirectTranslator as symjit[e408de789c333cd]::symjit::composer::Composer>::compile<unknown>
  1226. 289.82 s > at <unknown source file>:<unknown line>
  1227. 289.82 s > 13: <symjit[e408de789c333cd]::symjit::compiler::Translator as symjit[e408de789c333cd]::symjit::composer::Composer>::compile<unknown>
  1228. 289.82 s > at <unknown source file>:<unknown line>
  1229. 289.82 s > 14: <numerica[124dab8567f4861e]::domains::float::complex::Complex<f64> as symbolica[10e259bab675d243]::evaluate::backend::JITCompiledNumber>::jit_compile<unknown>
  1230. 289.82 s > at <unknown source file>:<unknown line>
  1231. 289.82 s > 15: <gammalooprs[917cbd3df9e68f8f]::integrands::process::evaluators::GenericEvaluator>::activate_symjit<unknown>
  1232. 289.82 s > at <unknown source file>:<unknown line>
  1233. 289.82 s > 16: <gammalooprs[917cbd3df9e68f8f]::integrands::process::amplitude::AmplitudeIntegrand>::prepare_runtime_backends_after_generation_with_compile_times<unknown>
  1234. 289.82 s > at <unknown source file>:<unknown line>
  1235. 289.82 s > 17: <gammalooprs[917cbd3df9e68f8f]::processes::amplitude::Amplitude>::build_integrand<unknown>
  1236. 289.82 s > at <unknown source file>:<unknown line>
  1237. 289.82 s > 18: <gammalooprs[917cbd3df9e68f8f]::processes::process::Process>::generate_integrands<unknown>
  1238. 289.82 s > at <unknown source file>:<unknown line>
  1239. 289.82 s > 19: <gammalooprs[917cbd3df9e68f8f]::processes::ProcessList>::generate_integrands<unknown>
  1240. 289.82 s > at <unknown source file>:<unknown line>
  1241. 289.82 s > 20: <gammaloop_api[9ebf6628f97aeb57]::state::State>::generate_integrands<unknown>
  1242. 289.82 s > at <unknown source file>:<unknown line>
  1243. 289.82 s > 21: <gammaloop_api[9ebf6628f97aeb57]::commands::generate::Generate>::run::<&std[bcb96dfbba0ab899]::path::PathBuf><unknown>
  1244. 289.82 s > at <unknown source file>:<unknown line>
  1245. 289.82 s > 22: <gammaloop_api[9ebf6628f97aeb57]::commands::Commands>::run<unknown>
  1246. 289.82 s > at <unknown source file>:<unknown line>
  1247. 289.82 s > 23: <gammaloop_api[9ebf6628f97aeb57]::session::CliSession>::execute_prepared<unknown>
  1248. 289.82 s > at <unknown source file>:<unknown line>
  1249. 289.82 s > 24: <gammaloop_api[9ebf6628f97aeb57]::session::CliSession>::execute_prepared_commands<unknown>
  1250. 289.82 s > at <unknown source file>:<unknown line>
  1251. 289.82 s > 25: <gammaloop_api[9ebf6628f97aeb57]::session::CliSession>::execute_prepared<unknown>
  1252. 289.82 s > at <unknown source file>:<unknown line>
  1253. 289.82 s > 26: <gammaloop_api[9ebf6628f97aeb57]::session::CliSession>::execute_command<unknown>
  1254. 289.82 s > at <unknown source file>:<unknown line>
  1255. 289.82 s > 27: <gammaloop_integration_tests[191607b70c61cd5a]::CLIState>::run_command<unknown>
  1256. 289.82 s > at <unknown source file>:<unknown line>
  1257. 289.82 s > 28: uv[3c7454ef256d6487]::run_single_integrated_uv_case<unknown>
  1258. 289.82 s > at <unknown source file>:<unknown line>
  1259. 289.82 s > 29: <uv[3c7454ef256d6487]::thermal_sunrise_uv::{closure#0} as core[940e698046960fd5]::ops::function::FnOnce<()>>::call_once<unknown>
  1260. 289.82 s > at <unknown source file>:<unknown line>
  1261. 289.82 s > 30: test[75d6903177b1d7e9]::__rust_begin_short_backtrace::<core[940e698046960fd5]::result::Result<(), alloc[2ea6bcb46fca0c42]::string::String>, fn() -> core[940e698046960fd5]::result::Result<(), alloc[2ea6bcb46fca0c42]::string::String>><unknown>
  1262. 289.82 s > at <unknown source file>:<unknown line>
  1263. 289.82 s > 31: test[75d6903177b1d7e9]::run_test::{closure#0}<unknown>
  1264. 289.82 s > at <unknown source file>:<unknown line>
  1265. 289.82 s > 32: std[bcb96dfbba0ab899]::sys::backtrace::__rust_begin_short_backtrace::<test[75d6903177b1d7e9]::run_test::{closure#1}, ()><unknown>
  1266. 289.82 s > at <unknown source file>:<unknown line>
  1267. 289.82 s > 33: <std[bcb96dfbba0ab899]::thread::lifecycle::spawn_unchecked<test[75d6903177b1d7e9]::run_test::{closure#1}, ()>::{closure#1} as core[940e698046960fd5]::ops::function::FnOnce<()>>::call_once::{shim:vtable#0}<unknown>
  1268. 289.82 s > at <unknown source file>:<unknown line>
  1269. 289.82 s > 34: <std[bcb96dfbba0ab899]::sys::thread::unix::Thread>::new::thread_start<unknown>
  1270. 289.82 s > at <unknown source file>:<unknown line>
  1271. 289.82 s > 35: start_thread<unknown>
  1272. 289.82 s > at <unknown source file>:<unknown line>
  1273. 289.82 s > 36: __clone3<unknown>
  1274. 289.82 s > at <unknown source file>:<unknown line>
  1275. 289.82 s >
  1276. 289.82 s > Run with COLORBT_SHOW_HIDDEN=1 environment variable to disable frame filtering.
  1277. 289.82 s > Run with RUST_BACKTRACE=full to include source snippets.
  1278. 289.82 s > Warning: SpanTrace capture is Unsupported.
  1279. 289.82 s > Ensure that you've setup a tracing-error ErrorLayer and the semver versions are compatible
  1280. 289.82 s >
  1281. 289.82 s > error: test run failed
  1282. 289.82 s >
  1283. 289.82 s > ========== nextest test summary ==========
  1284. 289.82 s > report: target/nextest/ci_gammaloop/junit.xml
  1285. 289.82 s > tests: 170, failures: 2, errors: 0
  1286. 289.82 s >
  1287. 289.82 s > 1. gammaloop-integration-tests::test_runs::aa_aa::important::aa_aa_local_inspect_backend_consistency
  1288. 289.82 s > failure: test failure with exit code 101
  1289. 289.82 s > system-out
  1290. 289.82 s > running 1 test
  1291. 289.82 s > test aa_aa::important::aa_aa_local_inspect_backend_consistency ... FAILED
  1292. 289.82 s >
  1293. 289.82 s > failures:
  1294. 289.82 s >
  1295. 289.82 s > failures:
  1296. 289.82 s > aa_aa::important::aa_aa_local_inspect_backend_consistency
  1297. 289.82 s >
  1298. 289.82 s > test result: FAILED. 0 passed; 1 failed; 0 ignored; 0 measured; 274 filtered out; finished in 3.42s
  1299. 289.82 s > system-err
  1300. 289.82 s > [2026-09-23 20:46:47.181] @gammaloop_api::se... INFO : Running command import model sm-default.json
  1301. 289.82 s > [2026-09-23 20:46:47.181] @import::model INFO : Loading built-in JSON model sm-default
  1302. 289.82 s > [2026-09-23 20:46:47.208] @gammalooprs::model INFO : The following 15 external parameters were forced to zero by the restriction card:
  1303. 289.82 s > lamWS, AWS, rhoWS, etaWS, ymc, yme, ymm, MC, Me, MM, WTau, muQ, muLe, muLmu, muLtau
  1304. 289.82 s > [2026-09-23 20:46:47.209] @gammalooprs::model INFO : The following 34 vertex rules were removed by the restriction card:
  1305. 289.82 s > V_82 -> (c~, d, G+) | V_83 -> (t~, d, G+) | V_84 -> (c~, s, G+) | V_85 -> (t~, s, G+) | V_86 -> (u~, b, G+) | V_87 -> (c~, b, G+) | V_90 -> (c~, d, W+) | V_91 -> (t~, d, W+) | V_92 -> (u~, s, W+) | V_94 -> (t~, s, W+) | V_95 -> (u~, b, W+) | V_96 -> (c~, b, W+) | V_101 -> (e+, e-, G0) | V_102 -> (mu+, mu-, G0) | V_104 -> (e+, e-, H) | V_105 -> (mu+, mu-, H) | V_110 -> (ve~, e-, G+) | V_111 -> (vm~, mu-, G+) | V_116 -> (b~, u, G-) | V_117 -> (d~, c, G-) | V_118 -> (s~, c, G-) | V_119 -> (b~, c, G-) | V_120 -> (d~, t, G-) | V_121 -> (s~, t, G-) | V_124 -> (s~, u, W-) | V_125 -> (b~, u, W-) | V_126 -> (d~, c, W-) | V_128 -> (b~, c, W-) | V_129 -> (d~, t, W-) | V_130 -> (s~, t, W-) | V_138 -> (c~, c, G0) | V_140 -> (c~, c, H) | V_145 -> (e+, ve, G-) | V_146 -> (mu+, vm, G-)
  1306. 289.82 s > [2026-09-23 20:46:47.209] @gammalooprs::model INFO : The following 36 couplings were removed by the restriction card:
  1307. 289.82 s > GC_13, GC_14, GC_16, GC_17, GC_18, GC_19, GC_20, GC_22, GC_23, GC_24, GC_25, GC_26, GC_28, GC_29, GC_42, GC_43, GC_44, GC_46, GC_47, GC_48, GC_84, GC_85, GC_86, GC_87, GC_88, GC_89, GC_90, GC_91, GC_92, GC_93, GC_101, GC_102, GC_103, GC_105, GC_106, GC_107
  1308. 289.82 s > [2026-09-23 20:46:47.209] @gammaloop_api::se... INFO : Running command run set_model_parameters
  1309. 289.82 s > [2026-09-23 20:46:47.209] @gammaloop_api::se... INFO : Starting command block set_model_parameters
  1310. 289.82 s > [2026-09-23 20:46:47.210] @gammaloop_api::se... INFO : Running command set model MT=173.0
  1311. 289.82 s > [2026-09-23 20:46:47.215] @gammaloop_api::se... INFO : Running command set model WT=0.0
  1312. 289.82 s > [2026-09-23 20:46:47.220] @gammaloop_api::se... INFO : Running command set model ymt=173.0
  1313. 289.82 s > [2026-09-23 20:46:47.224] @gammaloop_api::se... INFO : Running command set model aS=0.118
  1314. 289.82 s > [2026-09-23 20:46:47.229] @gammaloop_api::se... INFO : Running command set model aEWM1=137.036
  1315. 289.82 s > [2026-09-23 20:46:47.233] @gammaloop_api::se... INFO : Running command set model Gf=1.166390e-05
  1316. 289.82 s > [2026-09-23 20:46:47.238] @gammaloop_api::se... INFO : Running command set model MZ=91.188
  1317. 289.82 s > [2026-09-23 20:46:47.244] @gammaloop_api::se... INFO : Running command set global string '
  1318. 289.82 s > [global.generation.compile]
  1319. 289.82 s > compilation_mode = "symjit"
  1320. 289.82 s > optimization_level = "O0"
  1321. 289.82 s > fast_math = false
  1322. 289.82 s > [...]
  1323. 289.82 s > [2026-09-23 20:46:47.245] @gammaloop_api::se... INFO : Running command import graphs ./examples/cli/aa_aa/1L/aa_aa_1L.dot -p aa_aa_all_helicities -i 1L_ppmm -o
  1324. 289.82 s > [2026-09-23 20:46:47.245] @commands::import INFO : Loading graphs from '/build/source/examples/cli/aa_aa/1L/aa_aa_1L.dot'
  1325. 289.82 s > [2026-09-23 20:46:47.256] @gammaloop_api::se... INFO : Running command generate existing -p aa_aa_all_helicities
  1326. 289.82 s > The application panicked (crashed).
  1327. 289.82 s > Message: label _func_power_ not found
  1328. 289.82 s > Location: /nix/store/n9w914kh1cm59xx3spcs831cdyb56m32-vendor-cargo-deps/c19b7c6f923b580ac259164a89f2577984ad5ab09ee9d583b888f934adbbe8d0/symjit-2.25.6/src/symjit/assembler.rs:77
  1329. 289.82 s >
  1330. 289.82 s > ━━━━━━━━━━━━━━━━━━━━━━━━━━━━━━━━━━ BACKTRACE ━━━━━━━━━━━━━━━━━━━━━━━━━━━━━━━━━━━
  1331. 289.82 s > 1: <color_eyre[51793ea62743adbd]::config::PanicHook>::panic_report<unknown>
  1332. 289.82 s > at <unknown source file>:<unknown line>
  1333. 289.82 s > 2: <color_eyre[51793ea62743adbd]::config::PanicHook>::into_panic_hook::{closure#0}<unknown>
  1334. 289.82 s > at <unknown source file>:<unknown line>
  1335. 289.82 s > 3: std[bcb96dfbba0ab899]::panicking::panic_with_hook<unknown>
  1336. 289.82 s > at <unknown source file>:<unknown line>
  1337. 289.82 s > 4: std[bcb96dfbba0ab899]::panicking::panic_handler::{closure#0}<unknown>
  1338. 289.82 s > at <unknown source file>:<unknown line>
  1339. 289.82 s > 5: std[bcb96dfbba0ab899]::sys::backtrace::__rust_end_short_backtrace::<std[bcb96dfbba0ab899]::panicking::panic_handler::{closure#0}, !><unknown>
  1340. 289.82 s > at <unknown source file>:<unknown line>
  1341. 289.82 s > 6: __rustc[6c289b9f9c454d21]::rust_begin_unwind<unknown>
  1342. 289.82 s > at <unknown source file>:<unknown line>
  1343. 289.82 s > 7: core[940e698046960fd5]::panicking::panic_fmt<unknown>
  1344. 289.82 s > at <unknown source file>:<unknown line>
  1345. 289.82 s > 8: <symjit[e408de789c333cd]::symjit::assembler::Assembler>::apply_jumps<unknown>
  1346. 289.82 s > at <unknown source file>:<unknown line>
  1347. 289.82 s > 9: <symjit[e408de789c333cd]::symjit::builder::Builder>::compile_from_mir::<symjit[e408de789c333cd]::symjit::amd::complex::AmdComplexGenerator><unknown>
  1348. 289.82 s > at <unknown source file>:<unknown line>
  1349. 289.82 s > 10: <symjit[e408de789c333cd]::symjit::runnable::Application>::compile_ty<unknown>
  1350. 289.82 s > at <unknown source file>:<unknown line>
  1351. 289.82 s > 11: <symjit[e408de789c333cd]::symjit::runnable::Application>::with_mir<unknown>
  1352. 289.82 s > at <unknown source file>:<unknown line>
  1353. 289.82 s > 12: <symjit[e408de789c333cd]::symjit::composer::DirectTranslator as symjit[e408de789c333cd]::symjit::composer::Composer>::compile<unknown>
  1354. 289.82 s > at <unknown source file>:<unknown line>
  1355. 289.82 s > 13: <symjit[e408de789c333cd]::symjit::compiler::Translator as symjit[e408de789c333cd]::symjit::composer::Composer>::compile<unknown>
  1356. 289.82 s > at <unknown source file>:<unknown line>
  1357. 289.82 s > 14: <numerica[124dab8567f4861e]::domains::float::complex::Complex<f64> as symbolica[10e259bab675d243]::evaluate::backend::JITCompiledNumber>::jit_compile<unknown>
  1358. 289.82 s > at <unknown source file>:<unknown line>
  1359. 289.82 s > 15: <gammalooprs[917cbd3df9e68f8f]::integrands::process::evaluators::GenericEvaluator>::activate_symjit<unknown>
  1360. 289.82 s > at <unknown source file>:<unknown line>
  1361. 289.82 s > 16: <gammalooprs[917cbd3df9e68f8f]::integrands::process::amplitude::AmplitudeIntegrand>::prepare_runtime_backends_after_generation_with_compile_times<unknown>
  1362. 289.82 s > at <unknown source file>:<unknown line>
  1363. 289.82 s > 17: <gammalooprs[917cbd3df9e68f8f]::processes::amplitude::Amplitude>::build_integrand<unknown>
  1364. 289.82 s > at <unknown source file>:<unknown line>
  1365. 289.82 s > 18: <gammalooprs[917cbd3df9e68f8f]::processes::process::Process>::generate_integrands<unknown>
  1366. 289.82 s > at <unknown source file>:<unknown line>
  1367. 289.82 s > 19: <gammaloop_api[9ebf6628f97aeb57]::state::State>::generate_integrand<unknown>
  1368. 289.82 s > at <unknown source file>:<unknown line>
  1369. 289.82 s > 20: <gammaloop_api[9ebf6628f97aeb57]::commands::generate::Generate>::run::<&std[bcb96dfbba0ab899]::path::PathBuf><unknown>
  1370. 289.82 s > at <unknown source file>:<unknown line>
  1371. 289.82 s > 21: <gammaloop_api[9ebf6628f97aeb57]::commands::Commands>::run<unknown>
  1372. 289.82 s > at <unknown source file>:<unknown line>
  1373. 289.82 s > 22: <gammaloop_api[9ebf6628f97aeb57]::session::CliSession>::execute_prepared<unknown>
  1374. 289.82 s > at <unknown source file>:<unknown line>
  1375. 289.82 s > 23: <gammaloop_api[9ebf6628f97aeb57]::session::CliSession>::execute_command<unknown>
  1376. 289.82 s > at <unknown source file>:<unknown line>
  1377. 289.82 s > 24: <gammaloop_integration_tests[191607b70c61cd5a]::CLIState>::run_command<unknown>
  1378. 289.82 s > at <unknown source file>:<unknown line>
  1379. 289.82 s > 25: test_runs[9b7e2dc2dc4f29b0]::aa_aa::generate_aa_aa_helicity_family<unknown>
  1380. 289.82 s > at <unknown source file>:<unknown line>
  1381. 289.82 s > 26: <test_runs[9b7e2dc2dc4f29b0]::aa_aa::important::aa_aa_local_inspect_backend_consistency::{closure#0} as core[940e698046960fd5]::ops::function::FnOnce<()>>::call_once<unknown>
  1382. 289.82 s > at <unknown source file>:<unknown line>
  1383. 289.82 s > 27: serial_test[cd99724524a2f1c0]::serial_code_lock::local_serial_core_with_return::<(), eyre[cb2fd339c0c40fca]::Report><unknown>
  1384. 289.82 s > at <unknown source file>:<unknown line>
  1385. 289.82 s > 28: <test_runs[9b7e2dc2dc4f29b0]::aa_aa::important::aa_aa_local_inspect_backend_consistency::{closure#0} as core[940e698046960fd5]::ops::function::FnOnce<()>>::call_once<unknown>
  1386. 289.82 s > at <unknown source file>:<unknown line>
  1387. 289.82 s > 29: test[75d6903177b1d7e9]::__rust_begin_short_backtrace::<core[940e698046960fd5]::result::Result<(), alloc[2ea6bcb46fca0c42]::string::String>, fn() -> core[940e698046960fd5]::result::Result<(), alloc[2ea6bcb46fca0c42]::string::String>><unknown>
  1388. 289.82 s > at <unknown source file>:<unknown line>
  1389. 289.82 s > 30: test[75d6903177b1d7e9]::run_test::{closure#0}<unknown>
  1390. 289.82 s > at <unknown source file>:<unknown line>
  1391. 289.82 s > 31: std[bcb96dfbba0ab899]::sys::backtrace::__rust_begin_short_backtrace::<test[75d6903177b1d7e9]::run_test::{closure#1}, ()><unknown>
  1392. 289.82 s > at <unknown source file>:<unknown line>
  1393. 289.82 s > 32: <std[bcb96dfbba0ab899]::thread::lifecycle::spawn_unchecked<test[75d6903177b1d7e9]::run_test::{closure#1}, ()>::{closure#1} as core[940e698046960fd5]::ops::function::FnOnce<()>>::call_once::{shim:vtable#0}<unknown>
  1394. 289.82 s > at <unknown source file>:<unknown line>
  1395. 289.82 s > 33: <std[bcb96dfbba0ab899]::sys::thread::unix::Thread>::new::thread_start<unknown>
  1396. 289.82 s > at <unknown source file>:<unknown line>
  1397. 289.82 s > 34: start_thread<unknown>
  1398. 289.82 s > at <unknown source file>:<unknown line>
  1399. 289.82 s > 35: __clone3<unknown>
  1400. 289.82 s > at <unknown source file>:<unknown line>
  1401. 289.82 s >
  1402. 289.82 s > Run with COLORBT_SHOW_HIDDEN=1 environment variable to disable frame filtering.
  1403. 289.82 s > Run with RUST_BACKTRACE=full to include source snippets.
  1404. 289.82 s > Warning: SpanTrace capture is Unsupported.
  1405. 289.82 s > Ensure that you've setup a tracing-error ErrorLayer and the semver versions are compatible
  1406. 289.82 s >
  1407. 289.82 s > 2. gammaloop-integration-tests::uv::thermal_sunrise_uv
  1408. 289.82 s > failure: test failure with exit code 101
  1409. 289.82 s > system-out
  1410. 289.82 s > running 1 test
  1411. 289.82 s > test thermal_sunrise_uv ... FAILED
  1412. 289.82 s >
  1413. 289.82 s > failures:
  1414. 289.82 s >
  1415. 289.82 s > failures:
  1416. 289.82 s > thermal_sunrise_uv
  1417. 289.82 s >
  1418. 289.82 s > test result: FAILED. 0 passed; 1 failed; 0 ignored; 0 measured; 31 filtered out; finished in 3.75s
  1419. 289.82 s > system-err
  1420. 289.82 s > [2026-09-23 20:47:45.035] @gammaloop_api::se... INFO : Running command run generate
  1421. 289.82 s > [2026-09-23 20:47:45.035] @gammaloop_api::se... INFO : Starting command block generate
  1422. 289.82 s > [2026-09-23 20:47:45.036] @gammaloop_api::se... INFO : Running command import model sm-default.json
  1423. 289.82 s > [2026-09-23 20:47:45.036] @import::model INFO : Loading built-in JSON model sm-default
  1424. 289.82 s > [2026-09-23 20:47:45.070] @gammalooprs::model INFO : The following 15 external parameters were forced to zero by the restriction card:
  1425. 289.82 s > lamWS, AWS, rhoWS, etaWS, ymc, yme, ymm, MC, Me, MM, WTau, muQ, muLe, muLmu, muLtau
  1426. 289.82 s > [2026-09-23 20:47:45.071] @gammalooprs::model INFO : The following 34 vertex rules were removed by the restriction card:
  1427. 289.82 s > V_82 -> (c~, d, G+) | V_83 -> (t~, d, G+) | V_84 -> (c~, s, G+) | V_85 -> (t~, s, G+) | V_86 -> (u~, b, G+) | V_87 -> (c~, b, G+) | V_90 -> (c~, d, W+) | V_91 -> (t~, d, W+) | V_92 -> (u~, s, W+) | V_94 -> (t~, s, W+) | V_95 -> (u~, b, W+) | V_96 -> (c~, b, W+) | V_101 -> (e+, e-, G0) | V_102 -> (mu+, mu-, G0) | V_104 -> (e+, e-, H) | V_105 -> (mu+, mu-, H) | V_110 -> (ve~, e-, G+) | V_111 -> (vm~, mu-, G+) | V_116 -> (b~, u, G-) | V_117 -> (d~, c, G-) | V_118 -> (s~, c, G-) | V_119 -> (b~, c, G-) | V_120 -> (d~, t, G-) | V_121 -> (s~, t, G-) | V_124 -> (s~, u, W-) | V_125 -> (b~, u, W-) | V_126 -> (d~, c, W-) | V_128 -> (b~, c, W-) | V_129 -> (d~, t, W-) | V_130 -> (s~, t, W-) | V_138 -> (c~, c, G0) | V_140 -> (c~, c, H) | V_145 -> (e+, ve, G-) | V_146 -> (mu+, vm, G-)
  1428. 289.82 s > [2026-09-23 20:47:45.071] @gammalooprs::model INFO : The following 36 couplings were removed by the restriction card:
  1429. 289.82 s > GC_13, GC_14, GC_16, GC_17, GC_18, GC_19, GC_20, GC_22, GC_23, GC_24, GC_25, GC_26, GC_28, GC_29, GC_42, GC_43, GC_44, GC_46, GC_47, GC_48, GC_84, GC_85, GC_86, GC_87, GC_88, GC_89, GC_90, GC_91, GC_92, GC_93, GC_101, GC_102, GC_103, GC_105, GC_106, GC_107
  1430. 289.82 s > [2026-09-23 20:47:45.071] @gammaloop_api::se... INFO : Running command remove processes
  1431. 289.82 s > [2026-09-23 20:47:45.071] @gammaloop_api::se... INFO : Running command generate amp {} > {} [{2}] | g u
  1432. 289.82 s > --numerator-grouping group_identical_graphs_up_to_scalar_rescaling
  1433. 289.82 s > --max-n-bridges 0
  1434. 289.82 s > --number-of-factorized-loop-subtopologies 1 1
  1435. 289.82 s > --number-of-anticommutating-loops 1 1
  1436. 289.82 s > [...]
  1437. 289.82 s > [2026-09-23 20:47:45.073] @feyngen::diagram_... INFO : 0s | Δ=0s | Starting Feynman graph generation with Symbolica...
  1438. 289.82 s > [2026-09-23 20:47:45.073] @feyngen::diagram_... INFO : 0s | Δ=0s | Number of graphs resulting from Symbolica generation: 3
  1439. 289.82 s > [2026-09-23 20:47:45.073] @feyngen::diagram_... INFO : 0s | Δ=0s | Number of graphs retained after removal of vetoed topologies: 2
  1440. 289.82 s > [2026-09-23 20:47:45.073] @feyngen::diagram_... INFO : 0s | Δ=0s | Number of graphs after vertex info assignment: 2
  1441. 289.82 s > [2026-09-23 20:47:45.073] @feyngen::diagram_... INFO : 0s | Δ=0s | Number of graphs after all complete graphs filters are applied: 2
  1442. 289.82 s > [2026-09-23 20:47:45.073] @feyngen::diagram_... INFO : 0s | Δ=0s | Number of graphs after closed anticommutating chains analysis: 1
  1443. 289.82 s > [2026-09-23 20:47:45.073] @feyngen::diagram_... INFO : 0s | Δ=0s | Number of graphs after symmetrization of external states: 1
  1444. 289.82 s > [2026-09-23 20:47:45.073] @feyngen::diagram_... INFO : 0s | Δ=0s | Number of graphs after canonization of vertices, edges and flows (graph labels assigned here): 1
  1445. 289.82 s > [2026-09-23 20:47:45.089] @feyngen::diagram_... INFO : 0s | Δ=0s | Number of graphs after numerator-aware grouping with strategy 'up to a scalar rescaling': 1 (1 isomorphically unique graph, 0 color zero, 0 lorentz zero, 0 grouped and 0 cancellation)
  1446. 289.82 s > [2026-09-23 20:47:45.089] @feyngen::diagram_... INFO : ( Sum of the symmetry factors from each graph generated = -1/2 )
  1447. 289.82 s > [2026-09-23 20:47:45.089] @commands::generate INFO : Generated amplitude 1 graphs.
  1448. 289.82 s > [2026-09-23 20:47:45.089] @commands::generate INFO : Only diagram generation was requested, skipping integrand generation. You can generate integrands later using the 'generate existing <options>' command.
  1449. 289.82 s > [2026-09-23 20:47:45.089] @gammaloop_api::se... INFO : Running command generate
  1450. 289.82 s > The application panicked (crashed).
  1451. 289.82 s > Message: label _func_power_ not found
  1452. 289.82 s > Location: /nix/store/n9w914kh1cm59xx3spcs831cdyb56m32-vendor-cargo-deps/c19b7c6f923b580ac259164a89f2577984ad5ab09ee9d583b888f934adbbe8d0/symjit-2.25.6/src/symjit/assembler.rs:77
  1453. 289.82 s >
  1454. 289.82 s > ━━━━━━━━━━━━━━━━━━━━━━━━━━━━━━━━━━ BACKTRACE ━━━━━━━━━━━━━━━━━━━━━━━━━━━━━━━━━━━
  1455. 289.82 s > 1: <color_eyre[51793ea62743adbd]::config::PanicHook>::panic_report<unknown>
  1456. 289.82 s > at <unknown source file>:<unknown line>
  1457. 289.82 s > 2: <color_eyre[51793ea62743adbd]::config::PanicHook>::into_panic_hook::{closure#0}<unknown>
  1458. 289.82 s > at <unknown source file>:<unknown line>
  1459. 289.82 s > 3: std[bcb96dfbba0ab899]::panicking::panic_with_hook<unknown>
  1460. 289.82 s > at <unknown source file>:<unknown line>
  1461. 289.82 s > 4: std[bcb96dfbba0ab899]::panicking::panic_handler::{closure#0}<unknown>
  1462. 289.82 s > at <unknown source file>:<unknown line>
  1463. 289.82 s > 5: std[bcb96dfbba0ab899]::sys::backtrace::__rust_end_short_backtrace::<std[bcb96dfbba0ab899]::panicking::panic_handler::{closure#0}, !><unknown>
  1464. 289.82 s > at <unknown source file>:<unknown line>
  1465. 289.82 s > 6: __rustc[6c289b9f9c454d21]::rust_begin_unwind<unknown>
  1466. 289.82 s > at <unknown source file>:<unknown line>
  1467. 289.82 s > 7: core[940e698046960fd5]::panicking::panic_fmt<unknown>
  1468. 289.82 s > at <unknown source file>:<unknown line>
  1469. 289.82 s > 8: <symjit[e408de789c333cd]::symjit::assembler::Assembler>::apply_jumps<unknown>
  1470. 289.82 s > at <unknown source file>:<unknown line>
  1471. 289.82 s > 9: <symjit[e408de789c333cd]::symjit::builder::Builder>::compile_from_mir::<symjit[e408de789c333cd]::symjit::amd::complex::AmdComplexGenerator><unknown>
  1472. 289.82 s > at <unknown source file>:<unknown line>
  1473. 289.82 s > 10: <symjit[e408de789c333cd]::symjit::runnable::Application>::compile_ty<unknown>
  1474. 289.82 s > at <unknown source file>:<unknown line>
  1475. 289.82 s > 11: <symjit[e408de789c333cd]::symjit::runnable::Application>::with_mir<unknown>
  1476. 289.82 s > at <unknown source file>:<unknown line>
  1477. 289.82 s > 12: <symjit[e408de789c333cd]::symjit::composer::DirectTranslator as symjit[e408de789c333cd]::symjit::composer::Composer>::compile<unknown>
  1478. 289.82 s > at <unknown source file>:<unknown line>
  1479. 289.82 s > 13: <symjit[e408de789c333cd]::symjit::compiler::Translator as symjit[e408de789c333cd]::symjit::composer::Composer>::compile<unknown>
  1480. 289.82 s > at <unknown source file>:<unknown line>
  1481. 289.82 s > 14: <numerica[124dab8567f4861e]::domains::float::complex::Complex<f64> as symbolica[10e259bab675d243]::evaluate::backend::JITCompiledNumber>::jit_compile<unknown>
  1482. 289.82 s > at <unknown source file>:<unknown line>
  1483. 289.82 s > 15: <gammalooprs[917cbd3df9e68f8f]::integrands::process::evaluators::GenericEvaluator>::activate_symjit<unknown>
  1484. 289.82 s > at <unknown source file>:<unknown line>
  1485. 289.82 s > 16: <gammalooprs[917cbd3df9e68f8f]::integrands::process::amplitude::AmplitudeIntegrand>::prepare_runtime_backends_after_generation_with_compile_times<unknown>
  1486. 289.82 s > at <unknown source file>:<unknown line>
  1487. 289.82 s > 17: <gammalooprs[917cbd3df9e68f8f]::processes::amplitude::Amplitude>::build_integrand<unknown>
  1488. 289.82 s > at <unknown source file>:<unknown line>
  1489. 289.82 s > 18: <gammalooprs[917cbd3df9e68f8f]::processes::process::Process>::generate_integrands<unknown>
  1490. 289.82 s > at <unknown source file>:<unknown line>
  1491. 289.82 s > 19: <gammalooprs[917cbd3df9e68f8f]::processes::ProcessList>::generate_integrands<unknown>
  1492. 289.82 s > at <unknown source file>:<unknown line>
  1493. 289.82 s > 20: <gammaloop_api[9ebf6628f97aeb57]::state::State>::generate_integrands<unknown>
  1494. 289.82 s > at <unknown source file>:<unknown line>
  1495. 289.82 s > 21: <gammaloop_api[9ebf6628f97aeb57]::commands::generate::Generate>::run::<&std[bcb96dfbba0ab899]::path::PathBuf><unknown>
  1496. 289.82 s > at <unknown source file>:<unknown line>
  1497. 289.82 s > 22: <gammaloop_api[9ebf6628f97aeb57]::commands::Commands>::run<unknown>
  1498. 289.82 s > at <unknown source file>:<unknown line>
  1499. 289.82 s > 23: <gammaloop_api[9ebf6628f97aeb57]::session::CliSession>::execute_prepared<unknown>
  1500. 289.82 s > at <unknown source file>:<unknown line>
  1501. 289.82 s > 24: <gammaloop_api[9ebf6628f97aeb57]::session::CliSession>::execute_prepared_commands<unknown>
  1502. 289.82 s > at <unknown source file>:<unknown line>
  1503. 289.82 s > 25: <gammaloop_api[9ebf6628f97aeb57]::session::CliSession>::execute_prepared<unknown>
  1504. 289.82 s > at <unknown source file>:<unknown line>
  1505. 289.82 s > 26: <gammaloop_api[9ebf6628f97aeb57]::session::CliSession>::execute_command<unknown>
  1506. 289.82 s > at <unknown source file>:<unknown line>
  1507. 289.82 s > 27: <gammaloop_integration_tests[191607b70c61cd5a]::CLIState>::run_command<unknown>
  1508. 289.82 s > at <unknown source file>:<unknown line>
  1509. 289.82 s > 28: uv[3c7454ef256d6487]::run_single_integrated_uv_case<unknown>
  1510. 289.82 s > at <unknown source file>:<unknown line>
  1511. 289.82 s > 29: <uv[3c7454ef256d6487]::thermal_sunrise_uv::{closure#0} as core[940e698046960fd5]::ops::function::FnOnce<()>>::call_once<unknown>
  1512. 289.82 s > at <unknown source file>:<unknown line>
  1513. 289.82 s > 30: test[75d6903177b1d7e9]::__rust_begin_short_backtrace::<core[940e698046960fd5]::result::Result<(), alloc[2ea6bcb46fca0c42]::string::String>, fn() -> core[940e698046960fd5]::result::Result<(), alloc[2ea6bcb46fca0c42]::string::String>><unknown>
  1514. 289.82 s > at <unknown source file>:<unknown line>
  1515. 289.82 s > 31: test[75d6903177b1d7e9]::run_test::{closure#0}<unknown>
  1516. 289.82 s > at <unknown source file>:<unknown line>
  1517. 289.82 s > 32: std[bcb96dfbba0ab899]::sys::backtrace::__rust_begin_short_backtrace::<test[75d6903177b1d7e9]::run_test::{closure#1}, ()><unknown>
  1518. 289.82 s > at <unknown source file>:<unknown line>
  1519. 289.82 s > 33: <std[bcb96dfbba0ab899]::thread::lifecycle::spawn_unchecked<test[75d6903177b1d7e9]::run_test::{closure#1}, ()>::{closure#1} as core[940e698046960fd5]::ops::function::FnOnce<()>>::call_once::{shim:vtable#0}<unknown>
  1520. 289.82 s > at <unknown source file>:<unknown line>
  1521. 289.82 s > 34: <std[bcb96dfbba0ab899]::sys::thread::unix::Thread>::new::thread_start<unknown>
  1522. 289.82 s > at <unknown source file>:<unknown line>
  1523. 289.82 s > 35: start_thread<unknown>
  1524. 289.82 s > at <unknown source file>:<unknown line>
  1525. 289.82 s > 36: __clone3<unknown>
  1526. 289.82 s > at <unknown source file>:<unknown line>
  1527. 289.82 s >
  1528. 289.82 s > Run with COLORBT_SHOW_HIDDEN=1 environment variable to disable frame filtering.
  1529. 289.82 s > Run with RUST_BACKTRACE=full to include source snippets.
  1530. 289.82 s > Warning: SpanTrace capture is Unsupported.
  1531. 289.82 s > Ensure that you've setup a tracing-error ErrorLayer and the semver versions are compatible
  1532. 289.82 s > =========================================
  1533. 289.82 s For full logs, run:
  1534. 289.82 s nix log /nix/store/3f1dcfqxy8q0az6011047m7cljdkdh7f-gammaloop-nextest-integration.drv
  1535. 290.00 s [0 built (1 failed), 0.0Run failed.