0.02 s
$ /nix/store/9ypz3flqsrl5xl495mm8h645gadjsxi1-coreutils-9.11/bin/timeout --kill-after=15s 7200s /nix/store/23zk8sgzamrbmj1fday15szf7f2279s8-nix-2.34.7/bin/nix --extra-experimental-features nix-command --extra-experimental-features flakes flake clone git+https://github.com/alphal00p/gammaloop --dest /tmp/nix-ci-worker/stable-pwd/repo/
0.12 s
Cloning into '/tmp/nix-ci-worker/stable-pwd/repo'...
0.96 s
remote: Enumerating objects: 79455, done.
1.08 s
remote: Counting objects: 0% (1/9050)
remote: Counting objects: 1% (91/9050)
remote: Counting objects: 2% (181/9050)
remote: Counting objects: 3% (272/9050)
remote: Counting objects: 4% (362/9050)
remote: Counting objects: 5% (453/9050)
remote: Counting objects: 6% (543/9050)
remote: Counting objects: 7% (634/9050)
remote: Counting objects: 8% (724/9050)
remote: Counting objects: 9% (815/9050)
remote: Counting objects: 10% (905/9050)
remote: Counting objects: 11% (996/9050)
remote: Counting objects: 12% (1086/9050)
remote: Counting objects: 13% (1177/9050)
remote: Counting objects: 14% (1267/9050)
remote: Counting objects: 15% (1358/9050)
remote: Counting objects: 16% (1448/9050)
remote: Counting objects: 17% (1539/9050)
remote: Counting objects: 18% (1629/9050)
remote: Counting objects: 19% (1720/9050)
remote: Counting objects: 20% (1810/9050)
remote: Counting objects: 21% (1901/9050)
remote: Counting objects: 22% (1991/9050)
remote: Counting objects: 23% (2082/9050)
remote: Counting objects: 24% (2172/9050)
remote: Counting objects: 25% (2263/9050)
remote: Counting objects: 26% (2353/9050)
remote: Counting objects: 27% (2444/9050)
remote: Counting objects: 28% (2534/9050)
remote: Counting objects: 29% (2625/9050)
remote: Counting objects: 30% (2715/9050)
remote: Counting objects: 31% (2806/9050)
remote: Counting objects: 32% (2896/9050)
remote: Counting objects: 33% (2987/9050)
remote: Counting objects: 34% (3077/9050)
remote: Counting objects: 35% (3168/9050)
remote: Counting objects: 36% (3258/9050)
remote: Counting objects: 37% (3349/9050)
remote: Counting objects: 38% (3439/9050)
remote: Counting objects: 39% (3530/9050)
remote: Counting objects: 40% (3620/9050)
remote: Counting objects: 41% (3711/9050)
remote: Counting objects: 42% (3801/9050)
remote: Counting objects: 43% (3892/9050)
remote: Counting objects: 44% (3982/9050)
remote: Counting objects: 45% (4073/9050)
remote: Counting objects: 46% (4163/9050)
remote: Counting objects: 47% (4254/9050)
remote: Counting objects: 48% (4344/9050)
remote: Counting objects: 49% (4435/9050)
remote: Counting objects: 50% (4525/9050)
remote: Counting objects: 51% (4616/9050)
remote: Counting objects: 52% (4706/9050)
remote: Counting objects: 53% (4797/9050)
remote: Counting objects: 54% (4887/9050)
remote: Counting objects: 55% (4978/9050)
remote: Counting objects: 56% (5068/9050)
remote: Counting objects: 57% (5159/9050)
remote: Counting objects: 58% (5249/9050)
remote: Counting objects: 59% (5340/9050)
remote: Counting objects: 60% (5430/9050)
remote: Counting objects: 61% (5521/9050)
remote: Counting objects: 62% (5611/9050)
remote: Counting objects: 63% (5702/9050)
remote: Counting objects: 64% (5792/9050)
remote: Counting objects: 65% (5883/9050)
remote: Counting objects: 66% (5973/9050)
remote: Counting objects: 67% (6064/9050)
remote: Counting objects: 68% (6154/9050)
remote: Counting objects: 69% (6245/9050)
remote: Counting objects: 70% (6335/9050)
remote: Counting objects: 71% (6426/9050)
remote: Counting objects: 72% (6516/9050)
remote: Counting objects: 73% (6607/9050)
remote: Counting objects: 74% (6697/9050)
remote: Counting objects: 75% (6788/9050)
remote: Counting objects: 76% (6878/9050)
remote: Counting objects: 77% (6969/9050)
remote: Counting objects: 78% (7059/9050)
remote: Counting objects: 79% (7150/9050)
remote: Counting objects: 80% (7240/9050)
remote: Counting objects: 81% (7331/9050)
remote: Counting objects: 82% (7421/9050)
remote: Counting objects: 83% (7512/9050)
remote: Counting objects: 84% (7602/9050)
remote: Counting objects: 85% (7693/9050)
remote: Counting objects: 86% (7783/9050)
remote: Counting objects: 87% (7874/9050)
remote: Counting objects: 88% (7964/9050)
remote: Counting objects: 89% (8055/9050)
remote: Counting objects: 90% (8145/9050)
remote: Counting objects: 91% (8236/9050)
remote: Counting objects: 92% (8326/9050)
remote: Counting objects: 93% (8417/9050)
remote: Counting objects: 94% (8507/9050)
remote: Counting objects: 95% (8598/9050)
remote: Counting objects: 96% (8688/9050)
remote: Counting objects: 97% (8779/9050)
remote: Counting objects: 98% (8869/9050)
remote: Counting objects: 99% (8960/9050)
remote: Counting objects: 100% (9050/9050)
remote: Counting objects: 100% (9050/9050), done.
3.30 s
remote: Compressing objects: 0% (1/1946)
remote: Compressing objects: 1% (20/1946)
remote: Compressing objects: 2% (39/1946)
remote: Compressing objects: 3% (59/1946)
remote: Compressing objects: 4% (78/1946)
remote: Compressing objects: 5% (98/1946)
remote: Compressing objects: 6% (117/1946)
remote: Compressing objects: 7% (137/1946)
remote: Compressing objects: 8% (156/1946)
remote: Compressing objects: 9% (176/1946)
remote: Compressing objects: 10% (195/1946)
remote: Compressing objects: 11% (215/1946)
remote: Compressing objects: 12% (234/1946)
remote: Compressing objects: 12% (250/1946)
remote: Compressing objects: 13% (253/1946)
remote: Compressing objects: 14% (273/1946)
remote: Compressing objects: 15% (292/1946)
remote: Compressing objects: 16% (312/1946)
remote: Compressing objects: 17% (331/1946)
remote: Compressing objects: 18% (351/1946)
remote: Compressing objects: 19% (370/1946)
remote: Compressing objects: 20% (390/1946)
remote: Compressing objects: 21% (409/1946)
remote: Compressing objects: 22% (429/1946)
remote: Compressing objects: 22% (442/1946)
remote: Compressing objects: 23% (448/1946)
remote: Compressing objects: 24% (468/1946)
remote: Compressing objects: 25% (487/1946)
remote: Compressing objects: 26% (506/1946)
remote: Compressing objects: 27% (526/1946)
remote: Compressing objects: 28% (545/1946)
remote: Compressing objects: 29% (565/1946)
remote: Compressing objects: 30% (584/1946)
remote: Compressing objects: 31% (604/1946)
remote: Compressing objects: 32% (623/1946)
remote: Compressing objects: 33% (643/1946)
remote: Compressing objects: 34% (662/1946)
remote: Compressing objects: 35% (682/1946)
remote: Compressing objects: 36% (701/1946)
remote: Compressing objects: 37% (721/1946)
remote: Compressing objects: 38% (740/1946)
remote: Compressing objects: 39% (759/1946)
remote: Compressing objects: 40% (779/1946)
remote: Compressing objects: 41% (798/1946)
remote: Compressing objects: 42% (818/1946)
remote: Compressing objects: 43% (837/1946)
remote: Compressing objects: 44% (857/1946)
remote: Compressing objects: 45% (876/1946)
remote: Compressing objects: 46% (896/1946)
remote: Compressing objects: 47% (915/1946)
remote: Compressing objects: 48% (935/1946)
remote: Compressing objects: 49% (954/1946)
remote: Compressing objects: 50% (973/1946)
remote: Compressing objects: 51% (993/1946)
remote: Compressing objects: 52% (1012/1946)
remote: Compressing objects: 53% (1032/1946)
remote: Compressing objects: 54% (1051/1946)
remote: Compressing objects: 55% (1071/1946)
remote: Compressing objects: 56% (1090/1946)
remote: Compressing objects: 57% (1110/1946)
remote: Compressing objects: 58% (1129/1946)
remote: Compressing objects: 59% (1149/1946)
remote: Compressing objects: 60% (1168/1946)
remote: Compressing objects: 61% (1188/1946)
remote: Compressing objects: 62% (1207/1946)
remote: Compressing objects: 63% (1226/1946)
remote: Compressing objects: 64% (1246/1946)
remote: Compressing objects: 65% (1265/1946)
remote: Compressing objects: 66% (1285/1946)
remote: Compressing objects: 67% (1304/1946)
remote: Compressing objects: 68% (1324/1946)
remote: Compressing objects: 69% (1343/1946)
remote: Compressing objects: 70% (1363/1946)
remote: Compressing objects: 71% (1382/1946)
remote: Compressing objects: 72% (1402/1946)
remote: Compressing objects: 73% (1421/1946)
remote: Compressing objects: 74% (1441/1946)
remote: Compressing objects: 75% (1460/1946)
remote: Compressing objects: 76% (1479/1946)
remote: Compressing objects: 77% (1499/1946)
remote: Compressing objects: 78% (1518/1946)
remote: Compressing objects: 79% (1538/1946)
remote: Compressing objects: 80% (1557/1946)
remote: Compressing objects: 81% (1577/1946)
remote: Compressing objects: 82% (1596/1946)
remote: Compressing objects: 83% (1616/1946)
remote: Compressing objects: 84% (1635/1946)
remote: Compressing objects: 85% (1655/1946)
remote: Compressing objects: 86% (1674/1946)
remote: Compressing objects: 87% (1694/1946)
remote: Compressing objects: 88% (1713/1946)
remote: Compressing objects: 89% (1732/1946)
remote: Compressing objects: 90% (1752/1946)
remote: Compressing objects: 91% (1771/1946)
remote: Compressing objects: 92% (1791/1946)
remote: Compressing objects: 93% (1810/1946)
remote: Compressing objects: 94% (1830/1946)
remote: Compressing objects: 95% (1849/1946)
remote: Compressing objects: 96% (1869/1946)
remote: Compressing objects: 97% (1888/1946)
remote: Compressing objects: 98% (1908/1946)
remote: Compressing objects: 99% (1927/1946)
remote: Compressing objects: 100% (1946/1946)
remote: Compressing objects: 100% (1946/1946), done.
7.87 s
Receiving objects: 0% (1/79455)
Receiving objects: 1% (795/79455), 3.95 MiB | 7.89 MiB/s
Receiving objects: 2% (1590/79455), 3.95 MiB | 7.89 MiB/s
Receiving objects: 3% (2384/79455), 3.95 MiB | 7.89 MiB/s
Receiving objects: 4% (3179/79455), 3.95 MiB | 7.89 MiB/s
Receiving objects: 5% (3973/79455), 3.95 MiB | 7.89 MiB/s
Receiving objects: 6% (4768/79455), 3.95 MiB | 7.89 MiB/s
Receiving objects: 7% (5562/79455), 3.95 MiB | 7.89 MiB/s
Receiving objects: 8% (6357/79455), 3.95 MiB | 7.89 MiB/s
Receiving objects: 9% (7151/79455), 3.95 MiB | 7.89 MiB/s
Receiving objects: 9% (7324/79455), 3.95 MiB | 7.89 MiB/s
Receiving objects: 10% (7946/79455), 17.48 MiB | 17.48 MiB/s
Receiving objects: 11% (8741/79455), 17.48 MiB | 17.48 MiB/s
Receiving objects: 12% (9535/79455), 17.48 MiB | 17.48 MiB/s
Receiving objects: 13% (10330/79455), 17.48 MiB | 17.48 MiB/s
Receiving objects: 14% (11124/79455), 17.48 MiB | 17.48 MiB/s
Receiving objects: 15% (11919/79455), 17.48 MiB | 17.48 MiB/s
Receiving objects: 16% (12713/79455), 17.48 MiB | 17.48 MiB/s
Receiving objects: 17% (13508/79455), 17.48 MiB | 17.48 MiB/s
Receiving objects: 18% (14302/79455), 17.48 MiB | 17.48 MiB/s
Receiving objects: 19% (15097/79455), 17.48 MiB | 17.48 MiB/s
Receiving objects: 20% (15891/79455), 17.48 MiB | 17.48 MiB/s
Receiving objects: 21% (16686/79455), 17.48 MiB | 17.48 MiB/s
Receiving objects: 22% (17481/79455), 17.48 MiB | 17.48 MiB/s
Receiving objects: 23% (18275/79455), 17.48 MiB | 17.48 MiB/s
Receiving objects: 24% (19070/79455), 17.48 MiB | 17.48 MiB/s
Receiving objects: 25% (19864/79455), 17.48 MiB | 17.48 MiB/s
Receiving objects: 26% (20659/79455), 17.48 MiB | 17.48 MiB/s
Receiving objects: 27% (21453/79455), 17.48 MiB | 17.48 MiB/s
Receiving objects: 28% (22248/79455), 17.48 MiB | 17.48 MiB/s
Receiving objects: 29% (23042/79455), 17.48 MiB | 17.48 MiB/s
Receiving objects: 30% (23837/79455), 17.48 MiB | 17.48 MiB/s
Receiving objects: 31% (24632/79455), 17.48 MiB | 17.48 MiB/s
Receiving objects: 32% (25426/79455), 17.48 MiB | 17.48 MiB/s
Receiving objects: 33% (26221/79455), 17.48 MiB | 17.48 MiB/s
Receiving objects: 34% (27015/79455), 17.48 MiB | 17.48 MiB/s
Receiving objects: 35% (27810/79455), 17.48 MiB | 17.48 MiB/s
Receiving objects: 36% (28604/79455), 17.48 MiB | 17.48 MiB/s
Receiving objects: 37% (29399/79455), 17.48 MiB | 17.48 MiB/s
Receiving objects: 38% (30193/79455), 17.48 MiB | 17.48 MiB/s
Receiving objects: 39% (30988/79455), 17.48 MiB | 17.48 MiB/s
Receiving objects: 40% (31782/79455), 17.48 MiB | 17.48 MiB/s
Receiving objects: 41% (32577/79455), 17.48 MiB | 17.48 MiB/s
Receiving objects: 42% (33372/79455), 17.48 MiB | 17.48 MiB/s
Receiving objects: 43% (34166/79455), 32.59 MiB | 21.58 MiB/s
Receiving objects: 44% (34961/79455), 32.59 MiB | 21.58 MiB/s
Receiving objects: 45% (35755/79455), 32.59 MiB | 21.58 MiB/s
Receiving objects: 46% (36550/79455), 32.59 MiB | 21.58 MiB/s
Receiving objects: 47% (37344/79455), 32.59 MiB | 21.58 MiB/s
Receiving objects: 48% (38139/79455), 32.59 MiB | 21.58 MiB/s
Receiving objects: 49% (38933/79455), 32.59 MiB | 21.58 MiB/s
Receiving objects: 50% (39728/79455), 32.59 MiB | 21.58 MiB/s
Receiving objects: 50% (39891/79455), 32.59 MiB | 21.58 MiB/s
Receiving objects: 51% (40523/79455), 47.69 MiB | 23.73 MiB/s
Receiving objects: 52% (41317/79455), 47.69 MiB | 23.73 MiB/s
Receiving objects: 53% (42112/79455), 47.69 MiB | 23.73 MiB/s
Receiving objects: 54% (42906/79455), 47.69 MiB | 23.73 MiB/s
Receiving objects: 55% (43701/79455), 47.69 MiB | 23.73 MiB/s
Receiving objects: 56% (44495/79455), 47.69 MiB | 23.73 MiB/s
Receiving objects: 57% (45290/79455), 47.69 MiB | 23.73 MiB/s
Receiving objects: 58% (46084/79455), 47.69 MiB | 23.73 MiB/s
Receiving objects: 59% (46879/79455), 47.69 MiB | 23.73 MiB/s
Receiving objects: 60% (47673/79455), 47.69 MiB | 23.73 MiB/s
Receiving objects: 61% (48468/79455), 47.69 MiB | 23.73 MiB/s
Receiving objects: 62% (49263/79455), 62.63 MiB | 24.95 MiB/s
Receiving objects: 63% (50057/79455), 62.63 MiB | 24.95 MiB/s
Receiving objects: 64% (50852/79455), 62.63 MiB | 24.95 MiB/s
Receiving objects: 65% (51646/79455), 62.63 MiB | 24.95 MiB/s
Receiving objects: 66% (52441/79455), 62.63 MiB | 24.95 MiB/s
Receiving objects: 66% (53117/79455), 62.63 MiB | 24.95 MiB/s
Receiving objects: 67% (53235/79455), 62.63 MiB | 24.95 MiB/s
Receiving objects: 68% (54030/79455), 77.24 MiB | 25.19 MiB/s
Receiving objects: 69% (54824/79455), 77.24 MiB | 25.19 MiB/s
Receiving objects: 70% (55619/79455), 77.24 MiB | 25.19 MiB/s
Receiving objects: 71% (56414/79455), 77.24 MiB | 25.19 MiB/s
Receiving objects: 72% (57208/79455), 77.24 MiB | 25.19 MiB/s
Receiving objects: 73% (58003/79455), 77.24 MiB | 25.19 MiB/s
Receiving objects: 74% (58797/79455), 77.24 MiB | 25.19 MiB/s
Receiving objects: 75% (59592/79455), 77.24 MiB | 25.19 MiB/s
Receiving objects: 76% (60386/79455), 77.24 MiB | 25.19 MiB/s
Receiving objects: 77% (61181/79455), 92.09 MiB | 25.82 MiB/s
Receiving objects: 78% (61975/79455), 92.09 MiB | 25.82 MiB/s
Receiving objects: 79% (62770/79455), 92.09 MiB | 25.82 MiB/s
Receiving objects: 80% (63564/79455), 92.09 MiB | 25.82 MiB/s
Receiving objects: 80% (63732/79455), 107.07 MiB | 26.33 MiB/s
Receiving objects: 81% (64359/79455), 107.07 MiB | 26.33 MiB/s
Receiving objects: 82% (65154/79455), 107.07 MiB | 26.33 MiB/s
Receiving objects: 83% (65948/79455), 107.07 MiB | 26.33 MiB/s
Receiving objects: 84% (66743/79455), 107.07 MiB | 26.33 MiB/s
Receiving objects: 85% (67537/79455), 107.07 MiB | 26.33 MiB/s
Receiving objects: 86% (68332/79455), 107.07 MiB | 26.33 MiB/s
Receiving objects: 87% (69126/79455), 107.07 MiB | 26.33 MiB/s
Receiving objects: 88% (69921/79455), 107.07 MiB | 26.33 MiB/s
Receiving objects: 89% (70715/79455), 107.07 MiB | 26.33 MiB/s
Receiving objects: 90% (71510/79455), 107.07 MiB | 26.33 MiB/s
Receiving objects: 91% (72305/79455), 107.07 MiB | 26.33 MiB/s
Receiving objects: 92% (73099/79455), 107.07 MiB | 26.33 MiB/s
Receiving objects: 93% (73894/79455), 107.07 MiB | 26.33 MiB/s
Receiving objects: 94% (74688/79455), 107.07 MiB | 26.33 MiB/s
Receiving objects: 95% (75483/79455), 107.07 MiB | 26.33 MiB/s
Receiving objects: 96% (76277/79455), 107.07 MiB | 26.33 MiB/s
Receiving objects: 97% (77072/79455), 107.07 MiB | 26.33 MiB/s
Receiving objects: 98% (77866/79455), 107.07 MiB | 26.33 MiB/s
Receiving objects: 99% (78661/79455), 107.07 MiB | 26.33 MiB/s
remote: Total 79455 (delta 7758), reused 7291 (delta 7098), pack-reused 70405 (from 2)
7.87 s
Receiving objects: 100% (79455/79455), 107.07 MiB | 26.33 MiB/s
Receiving objects: 100% (79455/79455), 121.88 MiB | 26.70 MiB/s, done.
8.86 s
Resolving deltas: 0% (0/54239)
Resolving deltas: 1% (543/54239)
Resolving deltas: 2% (1085/54239)
Resolving deltas: 3% (1628/54239)
Resolving deltas: 4% (2170/54239)
Resolving deltas: 5% (2712/54239)
Resolving deltas: 6% (3256/54239)
Resolving deltas: 7% (3797/54239)
Resolving deltas: 8% (4340/54239)
Resolving deltas: 9% (4882/54239)
Resolving deltas: 10% (5424/54239)
Resolving deltas: 11% (5967/54239)
Resolving deltas: 12% (6509/54239)
Resolving deltas: 13% (7052/54239)
Resolving deltas: 14% (7595/54239)
Resolving deltas: 15% (8136/54239)
Resolving deltas: 16% (8679/54239)
Resolving deltas: 17% (9222/54239)
Resolving deltas: 18% (9766/54239)
Resolving deltas: 19% (10306/54239)
Resolving deltas: 20% (10848/54239)
Resolving deltas: 21% (11391/54239)
Resolving deltas: 22% (11933/54239)
Resolving deltas: 23% (12475/54239)
Resolving deltas: 24% (13019/54239)
Resolving deltas: 25% (13560/54239)
Resolving deltas: 26% (14104/54239)
Resolving deltas: 27% (14645/54239)
Resolving deltas: 28% (15187/54239)
Resolving deltas: 29% (15730/54239)
Resolving deltas: 30% (16272/54239)
Resolving deltas: 31% (16815/54239)
Resolving deltas: 32% (17357/54239)
Resolving deltas: 33% (17899/54239)
Resolving deltas: 34% (18442/54239)
Resolving deltas: 35% (18984/54239)
Resolving deltas: 36% (19527/54239)
Resolving deltas: 37% (20069/54239)
Resolving deltas: 38% (20612/54239)
Resolving deltas: 39% (21156/54239)
Resolving deltas: 40% (21697/54239)
Resolving deltas: 41% (22238/54239)
Resolving deltas: 42% (22782/54239)
Resolving deltas: 43% (23323/54239)
Resolving deltas: 44% (23866/54239)
Resolving deltas: 45% (24408/54239)
Resolving deltas: 46% (24950/54239)
Resolving deltas: 47% (25493/54239)
Resolving deltas: 48% (26035/54239)
Resolving deltas: 49% (26578/54239)
Resolving deltas: 50% (27120/54239)
Resolving deltas: 51% (27664/54239)
Resolving deltas: 52% (28206/54239)
Resolving deltas: 53% (28747/54239)
Resolving deltas: 54% (29290/54239)
Resolving deltas: 55% (29832/54239)
Resolving deltas: 56% (30374/54239)
Resolving deltas: 57% (30917/54239)
Resolving deltas: 58% (31459/54239)
Resolving deltas: 59% (32002/54239)
Resolving deltas: 60% (32544/54239)
Resolving deltas: 61% (33086/54239)
Resolving deltas: 62% (33629/54239)
Resolving deltas: 63% (34171/54239)
Resolving deltas: 64% (34713/54239)
Resolving deltas: 65% (35256/54239)
Resolving deltas: 66% (35798/54239)
Resolving deltas: 67% (36341/54239)
Resolving deltas: 68% (36884/54239)
Resolving deltas: 69% (37425/54239)
Resolving deltas: 70% (37968/54239)
Resolving deltas: 71% (38511/54239)
Resolving deltas: 72% (39053/54239)
Resolving deltas: 73% (39596/54239)
Resolving deltas: 74% (40137/54239)
Resolving deltas: 75% (40680/54239)
Resolving deltas: 76% (41222/54239)
Resolving deltas: 77% (41767/54239)
Resolving deltas: 78% (42307/54239)
Resolving deltas: 79% (42849/54239)
Resolving deltas: 80% (43392/54239)
Resolving deltas: 81% (43934/54239)
Resolving deltas: 82% (44476/54239)
Resolving deltas: 83% (45019/54239)
Resolving deltas: 84% (45561/54239)
Resolving deltas: 85% (46104/54239)
Resolving deltas: 86% (46646/54239)
Resolving deltas: 87% (47188/54239)
Resolving deltas: 88% (47731/54239)
Resolving deltas: 89% (48273/54239)
Resolving deltas: 90% (48816/54239)
Resolving deltas: 91% (49359/54239)
Resolving deltas: 92% (49900/54239)
Resolving deltas: 93% (50444/54239)
Resolving deltas: 94% (50985/54239)
Resolving deltas: 95% (51528/54239)
Resolving deltas: 96% (52070/54239)
Resolving deltas: 97% (52612/54239)
Resolving deltas: 98% (53155/54239)
Resolving deltas: 99% (53697/54239)
Resolving deltas: 100% (54239/54239)
Resolving deltas: 100% (54239/54239), done.
9.25 s
Fetching commit 19a6460c658f411e7362060603c87d1d1e990af4 for codex/ci-efficiency-feynkit ...
9.25 s
$ /nix/store/bcnisk3ydfgv26v2gw3zlky24g00yww2-git-2.54.0/bin/git fetch origin 19a6460c658f411e7362060603c87d1d1e990af4
9.76 s
From https://github.com/alphal00p/gammaloop
9.76 s
* branch 19a6460c658f411e7362060603c87d1d1e990af4 -> FETCH_HEAD
9.78 s
$ /nix/store/9ypz3flqsrl5xl495mm8h645gadjsxi1-coreutils-9.11/bin/timeout --kill-after=15s 7200s /nix/store/bcnisk3ydfgv26v2gw3zlky24g00yww2-git-2.54.0/bin/git -c advice.detachedHead=false checkout 19a6460c658f411e7362060603c87d1d1e990af4
10.01 s
HEAD is now at 19a6460c6 preserve sibling crate cargo fingerprints
10.01 s
$ /nix/store/9ypz3flqsrl5xl495mm8h645gadjsxi1-coreutils-9.11/bin/timeout --kill-after=15s 7200s /nix/store/23zk8sgzamrbmj1fday15szf7f2279s8-nix-2.34.7/bin/nix --extra-experimental-features nix-command --extra-experimental-features flakes --log-format internal-json run .#packages.x86_64-linux.nix-ci-check-gammaloop-nextest-integration --print-build-logs
10.55 s
12.01 s
Downloading cached source from https://cache.nix-ci.com
19.97 s
Downloaded cached source (199.4 MiB) in 7.9s
19.97 s
Progress: 1 of 1 downloaded from cache
28.33 s
fetching Git repository 'https://github.com/symbolica-dev/symbolica'
29.06 s
remote: Enumerating objects: 9552, done.
29.16 s
remote: Counting objects: 0% (1/528)
remote: Counting objects: 1% (6/528)
remote: Counting objects: 2% (11/528)
remote: Counting objects: 3% (16/528)
remote: Counting objects: 4% (22/528)
remote: Counting objects: 5% (27/528)
remote: Counting objects: 6% (32/528)
remote: Counting objects: 7% (37/528)
remote: Counting objects: 8% (43/528)
remote: Counting objects: 9% (48/528)
remote: Counting objects: 10% (53/528)
remote: Counting objects: 11% (59/528)
remote: Counting objects: 12% (64/528)
remote: Counting objects: 13% (69/528)
remote: Counting objects: 14% (74/528)
remote: Counting objects: 15% (80/528)
remote: Counting objects: 16% (85/528)
remote: Counting objects: 17% (90/528)
remote: Counting objects: 18% (96/528)
remote: Counting objects: 19% (101/528)
remote: Counting objects: 20% (106/528)
remote: Counting objects: 21% (111/528)
remote: Counting objects: 22% (117/528)
remote: Counting objects: 23% (122/528)
remote: Counting objects: 24% (127/528)
remote: Counting objects: 25% (132/528)
remote: Counting objects: 26% (138/528)
remote: Counting objects: 27% (143/528)
remote: Counting objects: 28% (148/528)
remote: Counting objects: 29% (154/528)
remote: Counting objects: 30% (159/528)
remote: Counting objects: 31% (164/528)
remote: Counting objects: 32% (169/528)
remote: Counting objects: 33% (175/528)
remote: Counting objects: 34% (180/528)
remote: Counting objects: 35% (185/528)
remote: Counting objects: 36% (191/528)
remote: Counting objects: 37% (196/528)
remote: Counting objects: 38% (201/528)
remote: Counting objects: 39% (206/528)
remote: Counting objects: 40% (212/528)
remote: Counting objects: 41% (217/528)
remote: Counting objects: 42% (222/528)
remote: Counting objects: 43% (228/528)
remote: Counting objects: 44% (233/528)
remote: Counting objects: 45% (238/528)
remote: Counting objects: 46% (243/528)
remote: Counting objects: 47% (249/528)
remote: Counting objects: 48% (254/528)
remote: Counting objects: 49% (259/528)
remote: Counting objects: 50% (264/528)
remote: Counting objects: 51% (270/528)
remote: Counting objects: 52% (275/528)
remote: Counting objects: 53% (280/528)
remote: Counting objects: 54% (286/528)
remote: Counting objects: 55% (291/528)
remote: Counting objects: 56% (296/528)
remote: Counting objects: 57% (301/528)
remote: Counting objects: 58% (307/528)
remote: Counting objects: 59% (312/528)
remote: Counting objects: 60% (317/528)
remote: Counting objects: 61% (323/528)
remote: Counting objects: 62% (328/528)
remote: Counting objects: 63% (333/528)
remote: Counting objects: 64% (338/528)
remote: Counting objects: 65% (344/528)
remote: Counting objects: 66% (349/528)
remote: Counting objects: 67% (354/528)
remote: Counting objects: 68% (360/528)
remote: Counting objects: 69% (365/528)
remote: Counting objects: 70% (370/528)
remote: Counting objects: 71% (375/528)
remote: Counting objects: 72% (381/528)
remote: Counting objects: 73% (386/528)
remote: Counting objects: 74% (391/528)
remote: Counting objects: 75% (396/528)
remote: Counting objects: 76% (402/528)
remote: Counting objects: 77% (407/528)
remote: Counting objects: 78% (412/528)
remote: Counting objects: 79% (418/528)
remote: Counting objects: 80% (423/528)
remote: Counting objects: 81% (428/528)
remote: Counting objects: 82% (433/528)
remote: Counting objects: 83% (439/528)
remote: Counting objects: 84% (444/528)
remote: Counting objects: 85% (449/528)
remote: Counting objects: 86% (455/528)
remote: Counting objects: 87% (460/528)
remote: Counting objects: 88% (465/528)
remote: Counting objects: 89% (470/528)
remote: Counting objects: 90% (476/528)
remote: Counting objects: 91% (481/528)
remote: Counting objects: 92% (486/528)
remote: Counting objects: 93% (492/528)
remote: Counting objects: 94% (497/528)
remote: Counting objects: 95% (502/528)
remote: Counting objects: 96% (507/528)
remote: Counting objects: 97% (513/528)
remote: Counting objects: 98% (518/528)
remote: Counting objects: 99% (523/528)
remote: Counting objects: 100% (528/528)
remote: Counting objects: 100% (528/528), done.
29.51 s
remote: Compressing objects: 0% (1/103)
remote: Compressing objects: 1% (2/103)
remote: Compressing objects: 2% (3/103)
remote: Compressing objects: 3% (4/103)
remote: Compressing objects: 4% (5/103)
remote: Compressing objects: 5% (6/103)
remote: Compressing objects: 6% (7/103)
remote: Compressing objects: 7% (8/103)
remote: Compressing objects: 8% (9/103)
remote: Compressing objects: 9% (10/103)
remote: Compressing objects: 10% (11/103)
remote: Compressing objects: 11% (12/103)
remote: Compressing objects: 12% (13/103)
remote: Compressing objects: 13% (14/103)
remote: Compressing objects: 14% (15/103)
remote: Compressing objects: 15% (16/103)
remote: Compressing objects: 16% (17/103)
remote: Compressing objects: 17% (18/103)
remote: Compressing objects: 18% (19/103)
remote: Compressing objects: 19% (20/103)
remote: Compressing objects: 20% (21/103)
remote: Compressing objects: 21% (22/103)
remote: Compressing objects: 22% (23/103)
remote: Compressing objects: 23% (24/103)
remote: Compressing objects: 24% (25/103)
remote: Compressing objects: 25% (26/103)
remote: Compressing objects: 26% (27/103)
remote: Compressing objects: 27% (28/103)
remote: Compressing objects: 28% (29/103)
remote: Compressing objects: 29% (30/103)
remote: Compressing objects: 30% (31/103)
remote: Compressing objects: 31% (32/103)
remote: Compressing objects: 32% (33/103)
remote: Compressing objects: 33% (34/103)
remote: Compressing objects: 34% (36/103)
remote: Compressing objects: 35% (37/103)
remote: Compressing objects: 36% (38/103)
remote: Compressing objects: 37% (39/103)
remote: Compressing objects: 38% (40/103)
remote: Compressing objects: 39% (41/103)
remote: Compressing objects: 40% (42/103)
remote: Compressing objects: 41% (43/103)
remote: Compressing objects: 42% (44/103)
remote: Compressing objects: 43% (45/103)
remote: Compressing objects: 44% (46/103)
remote: Compressing objects: 45% (47/103)
remote: Compressing objects: 46% (48/103)
remote: Compressing objects: 47% (49/103)
remote: Compressing objects: 48% (50/103)
remote: Compressing objects: 49% (51/103)
remote: Compressing objects: 50% (52/103)
remote: Compressing objects: 51% (53/103)
remote: Compressing objects: 52% (54/103)
remote: Compressing objects: 53% (55/103)
remote: Compressing objects: 54% (56/103)
remote: Compressing objects: 55% (57/103)
remote: Compressing objects: 56% (58/103)
remote: Compressing objects: 57% (59/103)
remote: Compressing objects: 58% (60/103)
remote: Compressing objects: 59% (61/103)
remote: Compressing objects: 60% (62/103)
remote: Compressing objects: 61% (63/103)
remote: Compressing objects: 62% (64/103)
remote: Compressing objects: 63% (65/103)
remote: Compressing objects: 64% (66/103)
remote: Compressing objects: 65% (67/103)
remote: Compressing objects: 66% (68/103)
remote: Compressing objects: 67% (70/103)
remote: Compressing objects: 68% (71/103)
remote: Compressing objects: 69% (72/103)
remote: Compressing objects: 70% (73/103)
remote: Compressing objects: 71% (74/103)
remote: Compressing objects: 72% (75/103)
remote: Compressing objects: 73% (76/103)
remote: Compressing objects: 74% (77/103)
remote: Compressing objects: 75% (78/103)
remote: Compressing objects: 76% (79/103)
remote: Compressing objects: 77% (80/103)
remote: Compressing objects: 78% (81/103)
remote: Compressing objects: 79% (82/103)
remote: Compressing objects: 80% (83/103)
remote: Compressing objects: 81% (84/103)
remote: Compressing objects: 82% (85/103)
remote: Compressing objects: 83% (86/103)
remote: Compressing objects: 84% (87/103)
remote: Compressing objects: 85% (88/103)
remote: Compressing objects: 86% (89/103)
remote: Compressing objects: 87% (90/103)
remote: Compressing objects: 88% (91/103)
remote: Compressing objects: 89% (92/103)
remote: Compressing objects: 90% (93/103)
remote: Compressing objects: 91% (94/103)
remote: Compressing objects: 92% (95/103)
remote: Compressing objects: 93% (96/103)
remote: Compressing objects: 94% (97/103)
remote: Compressing objects: 95% (98/103)
remote: Compressing objects: 96% (99/103)
remote: Compressing objects: 97% (100/103)
remote: Compressing objects: 98% (101/103)
remote: Compressing objects: 99% (102/103)
remote: Compressing objects: 100% (103/103)
remote: Compressing objects: 100% (103/103), done.
29.67 s
Receiving objects: 0% (1/9552)
Receiving objects: 1% (96/9552)
Receiving objects: 2% (192/9552)
Receiving objects: 3% (287/9552)
Receiving objects: 4% (383/9552)
Receiving objects: 5% (478/9552)
Receiving objects: 6% (574/9552)
Receiving objects: 7% (669/9552)
Receiving objects: 8% (765/9552)
Receiving objects: 9% (860/9552)
Receiving objects: 10% (956/9552)
Receiving objects: 11% (1051/9552)
Receiving objects: 12% (1147/9552)
Receiving objects: 13% (1242/9552)
Receiving objects: 14% (1338/9552)
Receiving objects: 15% (1433/9552)
Receiving objects: 16% (1529/9552)
Receiving objects: 17% (1624/9552)
Receiving objects: 18% (1720/9552)
Receiving objects: 19% (1815/9552)
Receiving objects: 20% (1911/9552)
Receiving objects: 21% (2006/9552)
Receiving objects: 22% (2102/9552)
Receiving objects: 23% (2197/9552)
Receiving objects: 24% (2293/9552)
Receiving objects: 25% (2388/9552)
Receiving objects: 26% (2484/9552)
Receiving objects: 27% (2580/9552)
Receiving objects: 28% (2675/9552)
Receiving objects: 29% (2771/9552)
Receiving objects: 30% (2866/9552)
Receiving objects: 31% (2962/9552)
Receiving objects: 32% (3057/9552)
Receiving objects: 33% (3153/9552)
Receiving objects: 34% (3248/9552)
Receiving objects: 35% (3344/9552)
Receiving objects: 36% (3439/9552)
Receiving objects: 37% (3535/9552)
Receiving objects: 38% (3630/9552)
Receiving objects: 39% (3726/9552)
Receiving objects: 40% (3821/9552)
Receiving objects: 41% (3917/9552)
Receiving objects: 42% (4012/9552)
Receiving objects: 43% (4108/9552)
Receiving objects: 44% (4203/9552)
Receiving objects: 45% (4299/9552)
Receiving objects: 46% (4394/9552)
Receiving objects: 47% (4490/9552)
Receiving objects: 48% (4585/9552)
Receiving objects: 49% (4681/9552)
Receiving objects: 50% (4776/9552)
Receiving objects: 51% (4872/9552)
Receiving objects: 52% (4968/9552)
Receiving objects: 53% (5063/9552)
Receiving objects: 54% (5159/9552)
Receiving objects: 55% (5254/9552)
Receiving objects: 56% (5350/9552)
Receiving objects: 57% (5445/9552)
Receiving objects: 58% (5541/9552)
Receiving objects: 59% (5636/9552)
Receiving objects: 60% (5732/9552)
Receiving objects: 61% (5827/9552)
Receiving objects: 62% (5923/9552)
Receiving objects: 63% (6018/9552)
Receiving objects: 64% (6114/9552)
Receiving objects: 65% (6209/9552)
Receiving objects: 66% (6305/9552)
Receiving objects: 67% (6400/9552)
Receiving objects: 68% (6496/9552)
Receiving objects: 69% (6591/9552)
Receiving objects: 70% (6687/9552)
Receiving objects: 71% (6782/9552)
Receiving objects: 72% (6878/9552)
Receiving objects: 73% (6973/9552)
Receiving objects: 74% (7069/9552)
Receiving objects: 75% (7164/9552)
Receiving objects: 76% (7260/9552)
Receiving objects: 77% (7356/9552)
Receiving objects: 78% (7451/9552)
Receiving objects: 79% (7547/9552)
Receiving objects: 80% (7642/9552)
Receiving objects: 81% (7738/9552)
Receiving objects: 82% (7833/9552)
Receiving objects: 83% (7929/9552)
Receiving objects: 84% (8024/9552)
Receiving objects: 85% (8120/9552)
Receiving objects: 86% (8215/9552)
Receiving objects: 87% (8311/9552)
Receiving objects: 88% (8406/9552)
Receiving objects: 89% (8502/9552)
Receiving objects: 90% (8597/9552)
Receiving objects: 91% (8693/9552)
Receiving objects: 92% (8788/9552)
Receiving objects: 93% (8884/9552)
Receiving objects: 94% (8979/9552)
Receiving objects: 95% (9075/9552)
Receiving objects: 96% (9170/9552)
Receiving objects: 97% (9266/9552)
Receiving objects: 98% (9361/9552)
Receiving objects: 99% (9457/9552)
remote: Total 9552 (delta 468), reused 425 (delta 425), pack-reused 9024 (from 2)
29.67 s
Receiving objects: 100% (9552/9552)
Receiving objects: 100% (9552/9552), 5.79 MiB | 39.00 MiB/s, done.
29.83 s
Resolving deltas: 0% (0/7517)
Resolving deltas: 1% (76/7517)
Resolving deltas: 2% (151/7517)
Resolving deltas: 3% (226/7517)
Resolving deltas: 4% (301/7517)
Resolving deltas: 5% (376/7517)
Resolving deltas: 6% (452/7517)
Resolving deltas: 7% (527/7517)
Resolving deltas: 8% (602/7517)
Resolving deltas: 9% (678/7517)
Resolving deltas: 10% (753/7517)
Resolving deltas: 11% (827/7517)
Resolving deltas: 12% (903/7517)
Resolving deltas: 13% (978/7517)
Resolving deltas: 14% (1053/7517)
Resolving deltas: 15% (1128/7517)
Resolving deltas: 16% (1203/7517)
Resolving deltas: 17% (1278/7517)
Resolving deltas: 18% (1354/7517)
Resolving deltas: 19% (1429/7517)
Resolving deltas: 20% (1504/7517)
Resolving deltas: 21% (1579/7517)
Resolving deltas: 22% (1654/7517)
Resolving deltas: 23% (1729/7517)
Resolving deltas: 24% (1805/7517)
Resolving deltas: 25% (1880/7517)
Resolving deltas: 26% (1955/7517)
Resolving deltas: 27% (2030/7517)
Resolving deltas: 28% (2105/7517)
Resolving deltas: 29% (2180/7517)
Resolving deltas: 30% (2258/7517)
Resolving deltas: 31% (2331/7517)
Resolving deltas: 32% (2406/7517)
Resolving deltas: 33% (2481/7517)
Resolving deltas: 34% (2556/7517)
Resolving deltas: 35% (2635/7517)
Resolving deltas: 36% (2707/7517)
Resolving deltas: 37% (2782/7517)
Resolving deltas: 38% (2857/7517)
Resolving deltas: 39% (2932/7517)
Resolving deltas: 40% (3007/7517)
Resolving deltas: 41% (3082/7517)
Resolving deltas: 42% (3158/7517)
Resolving deltas: 43% (3233/7517)
Resolving deltas: 44% (3308/7517)
Resolving deltas: 45% (3383/7517)
Resolving deltas: 46% (3458/7517)
Resolving deltas: 47% (3538/7517)
Resolving deltas: 48% (3609/7517)
Resolving deltas: 49% (3684/7517)
Resolving deltas: 50% (3759/7517)
Resolving deltas: 51% (3835/7517)
Resolving deltas: 52% (3909/7517)
Resolving deltas: 53% (3986/7517)
Resolving deltas: 54% (4060/7517)
Resolving deltas: 55% (4135/7517)
Resolving deltas: 56% (4210/7517)
Resolving deltas: 57% (4285/7517)
Resolving deltas: 58% (4360/7517)
Resolving deltas: 59% (4436/7517)
Resolving deltas: 60% (4511/7517)
Resolving deltas: 61% (4586/7517)
Resolving deltas: 62% (4661/7517)
Resolving deltas: 63% (4736/7517)
Resolving deltas: 64% (4811/7517)
Resolving deltas: 65% (4887/7517)
Resolving deltas: 66% (4962/7517)
Resolving deltas: 67% (5037/7517)
Resolving deltas: 68% (5112/7517)
Resolving deltas: 69% (5187/7517)
Resolving deltas: 70% (5262/7517)
Resolving deltas: 71% (5338/7517)
Resolving deltas: 72% (5413/7517)
Resolving deltas: 73% (5489/7517)
Resolving deltas: 74% (5563/7517)
Resolving deltas: 75% (5639/7517)
Resolving deltas: 76% (5713/7517)
Resolving deltas: 77% (5789/7517)
Resolving deltas: 78% (5864/7517)
Resolving deltas: 79% (5940/7517)
Resolving deltas: 80% (6015/7517)
Resolving deltas: 81% (6089/7517)
Resolving deltas: 82% (6164/7517)
Resolving deltas: 83% (6240/7517)
Resolving deltas: 84% (6316/7517)
Resolving deltas: 85% (6390/7517)
Resolving deltas: 86% (6465/7517)
Resolving deltas: 87% (6540/7517)
Resolving deltas: 88% (6615/7517)
Resolving deltas: 89% (6692/7517)
Resolving deltas: 90% (6766/7517)
Resolving deltas: 91% (6841/7517)
Resolving deltas: 92% (6917/7517)
Resolving deltas: 93% (6991/7517)
Resolving deltas: 94% (7066/7517)
Resolving deltas: 95% (7143/7517)
Resolving deltas: 96% (7217/7517)
Resolving deltas: 97% (7292/7517)
Resolving deltas: 98% (7367/7517)
Resolving deltas: 99% (7442/7517)
Resolving deltas: 100% (7517/7517)
Resolving deltas: 100% (7517/7517), done.
29.87 s
From https://github.com/symbolica-dev/symbolica
29.87 s
* branch 0441bd7a511209dce2ca99925fe87f8b18e4bf03 -> FETCH_HEAD
33.57 s
33.57 s
Downloading cached gammaloop-nextest-binaries-integration-gammaloop-integration-tests from https://cache.nix-ci.com
33.58 s
Downloading cached xgcc-15.2.0-libgcc from https://cache.nix-ci.com
33.58 s
Downloading cached busybox from https://cache.nix-ci.com
33.58 s
Downloading cached gcc-15.2.0-libgcc from https://cache.nix-ci.com
33.58 s
Downloading cached libunistring from https://cache.nix-ci.com
33.58 s
Downloading cached publicsuffix-list-0-unstable-2026-05 from https://cache.nix-ci.com
33.88 s
Downloaded cached gcc-15.2.0-libgcc (193 KiB) in 304ms
33.88 s
Progress: 0 of 1 built, 1 of 68 downloaded from cache (5 downloading)
33.88 s
Downloaded cached busybox (230 KiB) in 305ms
33.88 s
Progress: 0 of 1 built, 2 of 68 downloaded from cache (4 downloading)
33.89 s
Downloaded cached xgcc-15.2.0-libgcc (193 KiB) in 308ms
33.89 s
Progress: 0 of 1 built, 3 of 68 downloaded from cache (3 downloading)
33.89 s
Downloaded cached publicsuffix-list-0-unstable-2026-05 (329 KiB) in 305ms
33.89 s
Progress: 0 of 1 built, 4 of 68 downloaded from cache (2 downloading)
33.91 s
Downloaded cached libunistring (2 MiB) in 327ms
33.91 s
Progress: 0 of 1 built, 5 of 68 downloaded from cache (1 downloading)
33.91 s
Downloading cached libidn2 from https://cache.nix-ci.com
34.25 s
Downloaded cached libidn2 (359 KiB) in 341ms
34.25 s
Progress: 0 of 1 built, 6 of 68 downloaded from cache (1 downloading)
34.25 s
Downloading cached glibc-2.42 from https://cache.nix-ci.com
34.95 s
Downloaded cached glibc-2.42 (33.5 MiB) in 696ms
34.95 s
Progress: 0 of 1 built, 7 of 68 downloaded from cache (1 downloading)
34.95 s
Downloading cached attr from https://cache.nix-ci.com
34.95 s
Downloading cached aws-c-common from https://cache.nix-ci.com
34.95 s
Downloading cached bash from https://cache.nix-ci.com
34.95 s
Downloading cached brotli-1.2.0-lib from https://cache.nix-ci.com
34.95 s
Downloading cached bzip2 from https://cache.nix-ci.com
34.95 s
Downloading cached editline-1.17.1-unstable-2025-05 from https://cache.nix-ci.com
34.95 s
Downloading cached gcc-15.2.0-lib from https://cache.nix-ci.com
34.95 s
Downloading cached hwloc-2.14.0-lib from https://cache.nix-ci.com
34.95 s
Downloading cached libcpuid from https://cache.nix-ci.com
34.95 s
Downloading cached keyutils-1.6.3-lib from https://cache.nix-ci.com
34.95 s
Downloading cached libpsl from https://cache.nix-ci.com
34.95 s
Downloading cached libseccomp-2.6.0-lib from https://cache.nix-ci.com
34.95 s
Downloading cached libsodium-1.0.22-unstable-2026-04 from https://cache.nix-ci.com
34.95 s
Downloading cached libxml2 from https://cache.nix-ci.com
34.96 s
Downloading cached llhttp from https://cache.nix-ci.com
35.28 s
Downloaded cached bzip2 (86 KiB) in 332ms
35.28 s
Progress: 0 of 1 built, 8 of 68 downloaded from cache (15 downloading)
35.28 s
Downloading cached lowdown-3.0.1-lib from https://cache.nix-ci.com
35.28 s
Downloaded cached attr (90 KiB) in 334ms
35.28 s
Progress: 0 of 1 built, 9 of 68 downloaded from cache (15 downloading)
35.28 s
Downloading cached nghttp2-1.69.0-lib from https://cache.nix-ci.com
35.28 s
Downloaded cached editline-1.17.1-unstable-2025-05 (58 KiB) in 335ms
35.28 s
Progress: 0 of 1 built, 10 of 68 downloaded from cache (15 downloading)
35.28 s
Downloading cached acl from https://cache.nix-ci.com
35.29 s
Downloaded cached aws-c-common (1.1 MiB) in 340ms
35.29 s
Progress: 0 of 1 built, 11 of 68 downloaded from cache (15 downloading)
35.29 s
Downloading cached nghttp3 from https://cache.nix-ci.com
35.29 s
Downloaded cached libpsl (114 KiB) in 345ms
35.29 s
Downloaded cached libcpuid (326 KiB) in 345ms
35.29 s
Progress: 0 of 1 built, 12 of 68 downloaded from cache (15 downloading)
35.29 s
Downloading cached aws-c-compression from https://cache.nix-ci.com
35.29 s
Progress: 0 of 1 built, 13 of 68 downloaded from cache (15 downloading)
35.29 s
Downloading cached aws-c-sdkutils from https://cache.nix-ci.com
35.31 s
Downloaded cached hwloc-2.14.0-lib (459 KiB) in 363ms
35.31 s
Progress: 0 of 1 built, 14 of 68 downloaded from cache (15 downloading)
35.31 s
Downloaded cached keyutils-1.6.3-lib (41 KiB) in 363ms
35.31 s
Downloading cached aws-checksums from https://cache.nix-ci.com
35.31 s
Progress: 0 of 1 built, 15 of 68 downloaded from cache (15 downloading)
35.31 s
Downloading cached openssl from https://cache.nix-ci.com
35.31 s
Downloaded cached libseccomp-2.6.0-lib (193 KiB) in 365ms
35.31 s
Downloaded cached bash (1.8 MiB) in 367ms
35.31 s
Progress: 0 of 1 built, 16 of 68 downloaded from cache (15 downloading)
35.31 s
Downloading cached pcre2 from https://cache.nix-ci.com
35.32 s
Downloaded cached llhttp (89 KiB) in 359ms
35.32 s
Downloaded cached libsodium-1.0.22-unstable-2026-04 (666 KiB) in 366ms
35.32 s
Progress: 0 of 1 built, 17 of 68 downloaded from cache (15 downloading)
35.32 s
Progress: 0 of 1 built, 18 of 68 downloaded from cache (15 downloading)
35.32 s
Downloading cached xz from https://cache.nix-ci.com
35.32 s
Progress: 0 of 1 built, 19 of 68 downloaded from cache (14 downloading)
35.32 s
Downloading cached zlib from https://cache.nix-ci.com
35.32 s
Downloaded cached brotli-1.2.0-lib (961 KiB) in 370ms
35.32 s
Progress: 0 of 1 built, 20 of 68 downloaded from cache (14 downloading)
35.32 s
Downloaded cached libxml2 (1.4 MiB) in 375ms
35.32 s
Progress: 0 of 1 built, 21 of 68 downloaded from cache (13 downloading)
35.41 s
Downloaded cached gcc-15.2.0-lib (9.8 MiB) in 461ms
35.41 s
Progress: 0 of 1 built, 22 of 68 downloaded from cache (12 downloading)
35.41 s
Downloading cached boehm-gc from https://cache.nix-ci.com
35.41 s
Downloading cached onetbb from https://cache.nix-ci.com
35.41 s
Downloading cached icu4c from https://cache.nix-ci.com
35.41 s
Downloading cached zstd from https://cache.nix-ci.com
35.67 s
Downloaded cached nghttp2-1.69.0-lib (225 KiB) in 390ms
35.67 s
Progress: 0 of 1 built, 23 of 68 downloaded from cache (15 downloading)
35.67 s
Downloaded cached lowdown-3.0.1-lib (341 KiB) in 393ms
35.67 s
Progress: 0 of 1 built, 24 of 68 downloaded from cache (14 downloading)
35.68 s
Downloaded cached acl (125 KiB) in 392ms
35.68 s
Progress: 0 of 1 built, 25 of 68 downloaded from cache (13 downloading)
35.68 s
Downloaded cached aws-c-sdkutils (155 KiB) in 389ms
35.68 s
Progress: 0 of 1 built, 26 of 68 downloaded from cache (12 downloading)
35.69 s
Downloaded cached nghttp3 (228 KiB) in 397ms
35.69 s
Progress: 0 of 1 built, 27 of 68 downloaded from cache (11 downloading)
35.69 s
Downloaded cached aws-checksums (86 KiB) in 378ms
35.69 s
Downloaded cached aws-c-compression (31 KiB) in 397ms
35.69 s
Progress: 0 of 1 built, 28 of 68 downloaded from cache (10 downloading)
35.69 s
Progress: 0 of 1 built, 29 of 68 downloaded from cache (9 downloading)
35.69 s
Downloaded cached zlib (129 KiB) in 376ms
35.69 s
Progress: 0 of 1 built, 30 of 68 downloaded from cache (8 downloading)
35.69 s
Downloading cached sqlite from https://cache.nix-ci.com
35.70 s
Downloaded cached onetbb (626 KiB) in 290ms
35.70 s
Progress: 0 of 1 built, 31 of 68 downloaded from cache (8 downloading)
35.70 s
Downloading cached libblake3 from https://cache.nix-ci.com
35.71 s
Downloaded cached xz (837 KiB) in 390ms
35.71 s
Progress: 0 of 1 built, 32 of 68 downloaded from cache (8 downloading)
35.71 s
Downloaded cached boehm-gc (312 KiB) in 305ms
35.72 s
Progress: 0 of 1 built, 33 of 68 downloaded from cache (7 downloading)
35.72 s
Downloaded cached pcre2 (2 MiB) in 401ms
35.72 s
Progress: 0 of 1 built, 34 of 68 downloaded from cache (6 downloading)
35.72 s
Downloaded cached zstd (1.1 MiB) in 310ms
35.72 s
Progress: 0 of 1 built, 35 of 68 downloaded from cache (5 downloading)
35.79 s
Downloaded cached openssl (8.9 MiB) in 478ms
35.79 s
Progress: 0 of 1 built, 36 of 68 downloaded from cache (4 downloading)
35.79 s
Downloading cached aws-c-cal from https://cache.nix-ci.com
35.79 s
Downloading cached krb5-1.22.2-lib from https://cache.nix-ci.com
35.79 s
Downloading cached libarchive-3.8.8-lib from https://cache.nix-ci.com
35.79 s
Downloading cached libssh2 from https://cache.nix-ci.com
35.79 s
Downloading cached ngtcp2 from https://cache.nix-ci.com
35.79 s
Downloading cached s2n-tls from https://cache.nix-ci.com
35.93 s
Downloaded cached icu4c (38.2 MiB) in 524ms
35.93 s
Progress: 0 of 1 built, 37 of 68 downloaded from cache (9 downloading)
35.93 s
Downloading cached boost from https://cache.nix-ci.com
36.10 s
Downloaded cached libblake3 (117 KiB) in 398ms
36.10 s
Progress: 0 of 1 built, 38 of 68 downloaded from cache (9 downloading)
36.10 s
Downloaded cached aws-c-cal (158 KiB) in 313ms
36.10 s
Progress: 0 of 1 built, 39 of 68 downloaded from cache (8 downloading)
36.12 s
Downloaded cached ngtcp2 (515 KiB) in 329ms
36.12 s
Progress: 0 of 1 built, 40 of 68 downloaded from cache (7 downloading)
36.14 s
Downloaded cached libssh2 (330 KiB) in 343ms
36.14 s
Progress: 0 of 1 built, 41 of 68 downloaded from cache (6 downloading)
36.14 s
Downloading cached libgit2-1.9.4-lib from https://cache.nix-ci.com
36.15 s
Downloaded cached libarchive-3.8.8-lib (953 KiB) in 353ms
36.15 s
Progress: 0 of 1 built, 42 of 68 downloaded from cache (6 downloading)
36.15 s
Downloaded cached s2n-tls (1.3 MiB) in 354ms
36.15 s
Progress: 0 of 1 built, 43 of 68 downloaded from cache (5 downloading)
36.15 s
Downloading cached aws-c-io from https://cache.nix-ci.com
36.15 s
Downloaded cached krb5-1.22.2-lib (2.7 MiB) in 358ms
36.15 s
Progress: 0 of 1 built, 44 of 68 downloaded from cache (5 downloading)
36.15 s
Downloading cached curl from https://cache.nix-ci.com
36.17 s
Downloaded cached sqlite (5.7 MiB) in 472ms
36.17 s
Progress: 0 of 1 built, 45 of 68 downloaded from cache (5 downloading)
36.21 s
Downloaded cached boost (14.5 MiB) in 275ms
36.21 s
Progress: 0 of 1 built, 46 of 68 downloaded from cache (4 downloading)
36.21 s
Downloading cached nix-util from https://cache.nix-ci.com
36.47 s
Downloaded cached aws-c-io (648 KiB) in 318ms
36.47 s
Progress: 0 of 1 built, 47 of 68 downloaded from cache (4 downloading)
36.47 s
Downloading cached aws-c-event-stream from https://cache.nix-ci.com
36.47 s
Downloading cached aws-c-http from https://cache.nix-ci.com
36.47 s
Downloaded cached libgit2-1.9.4-lib (1.6 MiB) in 331ms
36.47 s
Progress: 0 of 1 built, 48 of 68 downloaded from cache (5 downloading)
36.48 s
Downloaded cached curl (1.2 MiB) in 331ms
36.48 s
Progress: 0 of 1 built, 49 of 68 downloaded from cache (4 downloading)
36.48 s
Downloaded cached nix-util (2.4 MiB) in 273ms
36.48 s
Progress: 0 of 1 built, 50 of 68 downloaded from cache (3 downloading)
36.48 s
Downloading cached nix-nswrapper from https://cache.nix-ci.com
36.86 s
Downloaded cached nix-nswrapper (131 KiB) in 370ms
36.86 s
Progress: 0 of 1 built, 51 of 68 downloaded from cache (3 downloading)
36.86 s
Downloaded cached aws-c-http (641 KiB) in 390ms
36.86 s
Progress: 0 of 1 built, 52 of 68 downloaded from cache (2 downloading)
36.86 s
Downloaded cached aws-c-event-stream (176 KiB) in 391ms
36.86 s
Downloading cached aws-c-auth from https://cache.nix-ci.com
36.86 s
Downloading cached aws-c-mqtt from https://cache.nix-ci.com
36.86 s
Progress: 0 of 1 built, 53 of 68 downloaded from cache (3 downloading)
36.88 s
Downloaded cached aws-c-mqtt (557 KiB) in 17ms
36.88 s
Progress: 0 of 1 built, 54 of 68 downloaded from cache (2 downloading)
36.88 s
Downloaded cached aws-c-auth (387 KiB) in 18ms
36.88 s
Progress: 0 of 1 built, 55 of 68 downloaded from cache (1 downloading)
36.88 s
Downloading cached aws-c-s3 from https://cache.nix-ci.com
36.89 s
Downloaded cached aws-c-s3 (384 KiB) in 17ms
36.89 s
Progress: 0 of 1 built, 56 of 68 downloaded from cache (1 downloading)
36.89 s
Downloading cached aws-crt-cpp from https://cache.nix-ci.com
36.91 s
Downloaded cached aws-crt-cpp (979 KiB) in 19ms
36.91 s
Progress: 0 of 1 built, 57 of 68 downloaded from cache (1 downloading)
36.91 s
Downloading cached nix-store from https://cache.nix-ci.com
36.96 s
Downloaded cached nix-store (5.8 MiB) in 41ms
36.96 s
Progress: 0 of 1 built, 58 of 68 downloaded from cache (1 downloading)
36.96 s
Downloading cached nix-fetchers from https://cache.nix-ci.com
36.96 s
Downloading cached nix-main from https://cache.nix-ci.com
37.27 s
Downloaded cached nix-main (393 KiB) in 317ms
37.27 s
Progress: 0 of 1 built, 59 of 68 downloaded from cache (2 downloading)
37.27 s
Downloaded cached nix-fetchers (1.5 MiB) in 318ms
37.27 s
Progress: 0 of 1 built, 60 of 68 downloaded from cache (1 downloading)
37.27 s
Downloading cached nix-expr from https://cache.nix-ci.com
37.64 s
Downloaded cached nix-expr (3.3 MiB) in 367ms
37.64 s
Progress: 0 of 1 built, 61 of 68 downloaded from cache (1 downloading)
37.64 s
Downloading cached nix-flake from https://cache.nix-ci.com
37.97 s
Downloaded cached nix-flake (956 KiB) in 326ms
37.97 s
Progress: 0 of 1 built, 62 of 68 downloaded from cache (1 downloading)
37.97 s
Downloading cached nix-cmd from https://cache.nix-ci.com
38.30 s
Downloaded cached nix-cmd (1 MiB) in 334ms
38.30 s
Progress: 0 of 1 built, 63 of 68 downloaded from cache (1 downloading)
38.30 s
Downloading cached nix from https://cache.nix-ci.com
38.59 s
Downloaded cached nix (3.9 MiB) in 284ms
38.59 s
Progress: 0 of 1 built, 64 of 68 downloaded from cache (1 downloading)
38.59 s
Downloading cached nix from https://cache.nix-ci.com
38.90 s
Downloaded cached nix (8848 B) in 309ms
38.90 s
Progress: 0 of 1 built, 65 of 68 downloaded from cache (1 downloading)
51.38 s
Downloaded cached gammaloop-nextest-binaries-integration-gammaloop-integration-tests (277.2 MiB) in 17.8s
51.38 s
Progress: 0 of 1 built, 66 of 68 downloaded from cache
51.38 s
Downloading cached gammaloop-nextest-binaries-integration from https://cache.nix-ci.com
51.67 s
Downloaded cached gammaloop-nextest-binaries-integration (528 B) in 286ms
51.67 s
Progress: 0 of 1 built, 67 of 68 downloaded from cache
51.67 s
Downloading cached nix-ci-check-gammaloop-nextest-integration from https://cache.nix-ci.com
51.67 s
Downloaded cached nix-ci-check-gammaloop-nextest-integration (1032 B) in 3ms
51.67 s
Progress: 0 of 1 built, 68 of 68 downloaded from cache
58.74 s
evaluating derivation 'g
copying '/nix/store/21z8
evaluating derivation 'g
copying '/nix/store/21z8
evaluating derivation 'g
copying '/nix/store/21z8
evaluating derivation 'g
copying '/nix/store/21z8
evaluating derivation 'g
copying '/nix/store/21z8
evaluating derivation 'g
copying '/nix/store/21z8
evaluating derivation 'g
copying '/nix/store/21z8
evaluating derivation 'g
copying '/nix/store/21z8
evaluating derivation 'g
querying gammaloop-nexte
[17.3 KiB DL] querying f
[46.8 KiB DL] querying i
[49.7 KiB DL] querying g
[0 /22 built, 16 /0 /63 cop
[0 /22 built, 16 /6 /63 cop
[0 /21 built, 16 /15 /63 co
[0 /20 built, 16 /17 /63 co
[0 /19 built, 16 /27 /63 co
[0 /19 built, 16 /28 /63 co
[0 /18 built, 16 /29 /63 co
[0 /18 built, 16 /30 /63 co
[0 /17 built, 13 /37 /63 co
[0 /17 built, 14 /40 /63 co
[0 /17 built, 14 /41 /63 co
[0 /17 built, 10 /46 /63 co
[0 /17 built, 9 /49 /63 cop
[0 /17 built, 9 /50 /63 cop
[0 /16 built, 8 /51 /63 cop
[2 /0 /16 built, 8 /51 /63 ccrane-dummy-cargo-target.rs (post)> Uploading to the NixCI cache: /nix/store/hd50hqi25fymr09a2w4xdiy5jmb2cfl5-crane-dummy-cargo-target.rs
58.79 s
crane-dummy-cargo-target.rs (post)> warning: 'warn-short-path-literals' is deprecated, use 'lint-short-path-literals = ignore' instead
58.94 s
crane-dummy-cargo-target.rs (post)> copying 0 paths...
59.01 s
crane-dummy-cargo-target.rs (post)> warning: 'warn-short-path-literals' is deprecated, use 'lint-short-path-literals = ignore' instead
60.94 s
crane-dummy-cargo-target.rs (post)> copying 0 paths...
60.98 s
[1 /1 /16 built, 5 /54 /63 ccrane-dummy-proc-macro-cargo-target.rs (post)> Uploading to the NixCI cache: /nix/store/z0b4s6pznqwlbyw5v4bbq7k1kp721g19-crane-dummy-proc-macro-cargo-target.rs
61.03 s
crane-dummy-proc-macro-cargo-target.rs (post)> warning: 'warn-short-path-literals' is deprecated, use 'lint-short-path-literals = ignore' instead
61.07 s
crane-dummy-proc-macro-cargo-target.rs (post)> copying 0 paths...
61.13 s
crane-dummy-proc-macro-cargo-target.rs (post)> warning: 'warn-short-path-literals' is deprecated, use 'lint-short-path-literals = ignore' instead
61.36 s
crane-dummy-proc-macro-cargo-target.rs (post)> copying 0 paths...
68.62 s
[2 /13 built, 6 /56 /63 cop
[2 /10 built, 3 /59 /63 cop
[2 /9 built, 2 /60 /63 copi
[2 /8 built, 1 /61 /63 copi
[1 /2 /7 built, 1 /62 /63 co
[2 /2 /7 built, 1 /62 /63 corust-stable-with-std (post)> Uploading to the NixCI cache: /nix/store/imnwv6nazijihjlgf2h3l1qm63m7l9wk-rust-stable-with-std-2026-07-09
68.66 s
rust-stable-with-std (post)> warning: 'warn-short-path-literals' is deprecated, use 'lint-short-path-literals = ignore' instead
68.69 s
rust-stable-with-std (post)> copying 0 paths...
68.74 s
rust-stable-with-std (post)> warning: 'warn-short-path-literals' is deprecated, use 'lint-short-path-literals = ignore' instead
69.02 s
rust-stable-with-std (post)> copying 0 paths...
69.20 s
[1 /3 /7 built, 63 copied clippy-stable-with-std (post)> Uploading to the NixCI cache: /nix/store/r4bjy93lvnfma1awpi480n2mz3af0adx-clippy-stable-with-std-2026-07-09
69.25 s
clippy-stable-with-std (post)> warning: 'warn-short-path-literals' is deprecated, use 'lint-short-path-literals = ignore' instead
69.30 s
clippy-stable-with-std (post)> copying 0 paths...
69.35 s
clippy-stable-with-std (post)> warning: 'warn-short-path-literals' is deprecated, use 'lint-short-path-literals = ignore' instead
69.67 s
clippy-stable-with-std (post)> copying 0 paths...
69.77 s
[4 /7 built, 63 copied (1
[1 /4 /6 built, 63 copied rust-stable-with-components> /nix/store/imnwv6nazijihjlgf2h3l1qm63m7l9wk-rust-stable-with-std-2026-07-09/bin:
69.77 s
rust-stable-with-components> rustdoc: Keeping existing link to /nix/store/r4bjy93lvnfma1awpi480n2mz3af0adx-clippy-stable-with-std-2026-07-09/bin/rustdoc
69.77 s
rust-stable-with-components> rust-gdbgui: Keeping existing link to /nix/store/r4bjy93lvnfma1awpi480n2mz3af0adx-clippy-stable-with-std-2026-07-09/bin/rust-gdbgui
69.77 s
rust-stable-with-components> rust-lldb: Keeping existing link to /nix/store/r4bjy93lvnfma1awpi480n2mz3af0adx-clippy-stable-with-std-2026-07-09/bin/rust-lldb
69.77 s
rust-stable-with-components> rust-gdb: Keeping existing link to /nix/store/r4bjy93lvnfma1awpi480n2mz3af0adx-clippy-stable-with-std-2026-07-09/bin/rust-gdb
69.77 s
rust-stable-with-components> rustc: Keeping existing link to /nix/store/r4bjy93lvnfma1awpi480n2mz3af0adx-clippy-stable-with-std-2026-07-09/bin/rustc
69.77 s
rust-stable-with-components> /nix/store/imnwv6nazijihjlgf2h3l1qm63m7l9wk-rust-stable-with-std-2026-07-09/lib:
69.77 s
rust-stable-with-components> librustc_driver-a39fc8bf9e61dbb9.so: Keeping existing link to /nix/store/r4bjy93lvnfma1awpi480n2mz3af0adx-clippy-stable-with-std-2026-07-09/lib/librustc_driver-a39fc8bf9e61dbb9.so
70.27 s
rust-stable-with-components (post)> Uploading to the NixCI cache: /nix/store/9pb4ikjdw4gp766ayxl6gg3b7hqm6ds4-rust-stable-with-components-2026-07-09
70.31 s
rust-stable-with-components (post)> warning: 'warn-short-path-literals' is deprecated, use 'lint-short-path-literals = ignore' instead
70.48 s
rust-stable-with-components (post)> copying 0 paths...
70.53 s
rust-stable-with-components (post)> warning: 'warn-short-path-literals' is deprecated, use 'lint-short-path-literals = ignore' instead
70.75 s
rust-stable-with-components (post)> copying 0 paths...
71.13 s
[5 /7 built, 63 copied (1
[1 /5 /6 built, 63 copied gammaloop-nextest-integration> Extracting 10 binaries, 1 build script output directory, and 3 linked paths to /build/nextest-archive-0mlCHh
72.66 s
gammaloop-nextest-integration> Extracted 27 files to /build/nextest-archive-0mlCHh in 1.53s
72.68 s
gammaloop-nextest-integration> ------------
72.68 s
gammaloop-nextest-integration> Nextest run ID 0bd010be-245a-4c36-9b06-fd72a9729ed5 with nextest profile: ci_gammaloop
72.68 s
gammaloop-nextest-integration> Starting 106 tests across 10 binaries (67 tests skipped via profile.ci_gammaloop.default-filter )
73.68 s
gammaloop-nextest-integration> FAIL [ 0.073s] ( 34/106) gammaloop-integration-tests::test_feyngen test_generate_sm_full_a_ddx
73.68 s
gammaloop-nextest-integration> stdout ---
73.68 s
gammaloop-nextest-integration>
73.68 s
gammaloop-nextest-integration> running 1 test
73.68 s
gammaloop-nextest-integration> test test_generate_sm_full_a_ddx ... FAILED
73.68 s
gammaloop-nextest-integration>
73.68 s
gammaloop-nextest-integration> failures:
73.68 s
gammaloop-nextest-integration>
73.68 s
gammaloop-nextest-integration> failures:
73.68 s
gammaloop-nextest-integration> test_generate_sm_full_a_ddx
73.68 s
gammaloop-nextest-integration>
73.68 s
gammaloop-nextest-integration> test result: FAILED. 0 passed; 1 failed; 0 ignored; 0 measured; 29 filtered out; finished in 0.06s
73.68 s
gammaloop-nextest-integration>
73.68 s
gammaloop-nextest-integration> stderr ---
73.68 s
gammaloop-nextest-integration> Error:
73.68 s
gammaloop-nextest-integration> 0: could not write model data to '/build/source/tests/artifacts/feyn_gen_generation_test/model.json': No such file or directory (os error 2)
73.68 s
gammaloop-nextest-integration> 1: No such file or directory (os error 2)
73.68 s
gammaloop-nextest-integration>
73.68 s
gammaloop-nextest-integration> Location:
73.68 s
gammaloop-nextest-integration> crates/gammaloop-api/src/state.rs :3281
73.68 s
gammaloop-nextest-integration>
73.68 s
gammaloop-nextest-integration> ━━━━━━━━━━━━━━━━━━━━━━━━━━━━━━━━━━ BACKTRACE ━━━━━━━━━━━━━━━━━━━━━━━━━━━━━━━━━━━
73.68 s
gammaloop-nextest-integration> 1: <color_eyre[51793ea62743adbd]::config::EyreHook>::into_eyre_hook::{closure#0} <unknown>
73.68 s
gammaloop-nextest-integration> at <unknown source file> :<unknown line>
73.68 s
gammaloop-nextest-integration> 2: eyre[cb2fd339c0c40fca]::capture_handler <unknown>
73.68 s
gammaloop-nextest-integration> at <unknown source file> :<unknown line>
73.68 s
gammaloop-nextest-integration> 3: <eyre[cb2fd339c0c40fca]::Report>::from_std::<feynkit_model[a2b643db882f5a57]::error::ModelError> <unknown>
73.68 s
gammaloop-nextest-integration> at <unknown source file> :<unknown line>
73.68 s
gammaloop-nextest-integration> 4: <gammaloop_api[bff55112c48008d0]::state::State>::save <unknown>
73.68 s
gammaloop-nextest-integration> at <unknown source file> :<unknown line>
73.68 s
gammaloop-nextest-integration> 5: <gammaloop_api[bff55112c48008d0]::commands::save::SaveState>::save <unknown>
73.68 s
gammaloop-nextest-integration> at <unknown source file> :<unknown line>
73.68 s
gammaloop-nextest-integration> 6: gammaloop_integration_tests[cd7ce9928366268d]::build_cli_for_run_history <unknown>
73.68 s
gammaloop-nextest-integration> at <unknown source file> :<unknown line>
73.68 s
gammaloop-nextest-integration> 7: gammaloop_integration_tests[cd7ce9928366268d]::get_test_cli::<std[bcb96dfbba0ab899]::path::PathBuf> <unknown>
73.68 s
gammaloop-nextest-integration> at <unknown source file> :<unknown line>
73.68 s
gammaloop-nextest-integration> 8: <test_feyngen[68799b25537a09ff]::test_generate_sm_full_a_ddx::{closure#0} as core[940e698046960fd5]::ops::function::FnOnce<()>>::call_once <unknown>
73.68 s
gammaloop-nextest-integration> at <unknown source file> :<unknown line>
73.68 s
gammaloop-nextest-integration> 9: test[75d6903177b1d7e9]::__rust_begin_short_backtrace::<core[940e698046960fd5]::result::Result<(), alloc[2ea6bcb46fca0c42]::string::String>, fn() -> core[940e698046960fd5]::result::Result<(), alloc[2ea6bcb46fca0c42]::string::String>> <unknown>
73.68 s
gammaloop-nextest-integration> at <unknown source file> :<unknown line>
73.68 s
gammaloop-nextest-integration> 10: test[75d6903177b1d7e9]::run_test::{closure#0} <unknown>
73.68 s
gammaloop-nextest-integration> at <unknown source file> :<unknown line>
73.68 s
gammaloop-nextest-integration> 11: std[bcb96dfbba0ab899]::sys::backtrace::__rust_begin_short_backtrace::<test[75d6903177b1d7e9]::run_test::{closure#1}, ()> <unknown>
73.68 s
gammaloop-nextest-integration> at <unknown source file> :<unknown line>
73.68 s
gammaloop-nextest-integration> 12: <std[bcb96dfbba0ab899]::thread::lifecycle::spawn_unchecked<test[75d6903177b1d7e9]::run_test::{closure#1}, ()>::{closure#1} as core[940e698046960fd5]::ops::function::FnOnce<()>>::call_once::{shim:vtable#0} <unknown>
73.68 s
gammaloop-nextest-integration> at <unknown source file> :<unknown line>
73.68 s
gammaloop-nextest-integration> 13: <std[bcb96dfbba0ab899]::sys::thread::unix::Thread>::new::thread_start <unknown>
73.68 s
gammaloop-nextest-integration> at <unknown source file> :<unknown line>
73.68 s
gammaloop-nextest-integration> 14: start_thread <unknown>
73.68 s
gammaloop-nextest-integration> at <unknown source file> :<unknown line>
73.68 s
gammaloop-nextest-integration> 15: __clone3 <unknown>
73.68 s
gammaloop-nextest-integration> at <unknown source file> :<unknown line>
73.68 s
gammaloop-nextest-integration>
73.68 s
gammaloop-nextest-integration> Run with COLORBT_SHOW_HIDDEN=1 environment variable to disable frame filtering.
73.68 s
gammaloop-nextest-integration> Run with RUST_BACKTRACE=full to include source snippets.
73.68 s
gammaloop-nextest-integration>
197.56 s
gammaloop-nextest-integration> ------------
197.56 s
gammaloop-nextest-integration> Summary [ 124.884s] 106 tests run: 105 passed , 1 failed , 67 skipped
197.56 s
gammaloop-nextest-integration> FAIL [ 0.073s] ( 34/106) gammaloop-integration-tests::test_feyngen test_generate_sm_full_a_ddx
197.56 s
gammaloop-nextest-integration> stdout ---
197.56 s
gammaloop-nextest-integration>
197.56 s
gammaloop-nextest-integration> running 1 test
197.56 s
gammaloop-nextest-integration> test test_generate_sm_full_a_ddx ... FAILED
197.56 s
gammaloop-nextest-integration>
197.56 s
gammaloop-nextest-integration> failures:
197.56 s
gammaloop-nextest-integration>
197.56 s
gammaloop-nextest-integration> failures:
197.56 s
gammaloop-nextest-integration> test_generate_sm_full_a_ddx
197.56 s
gammaloop-nextest-integration>
197.56 s
gammaloop-nextest-integration> test result: FAILED. 0 passed; 1 failed; 0 ignored; 0 measured; 29 filtered out; finished in 0.06s
197.56 s
gammaloop-nextest-integration>
197.56 s
gammaloop-nextest-integration> stderr ---
197.56 s
gammaloop-nextest-integration> Error:
197.56 s
gammaloop-nextest-integration> 0: could not write model data to '/build/source/tests/artifacts/feyn_gen_generation_test/model.json': No such file or directory (os error 2)
197.56 s
gammaloop-nextest-integration> 1: No such file or directory (os error 2)
197.56 s
gammaloop-nextest-integration>
197.56 s
gammaloop-nextest-integration> Location:
197.56 s
gammaloop-nextest-integration> crates/gammaloop-api/src/state.rs :3281
197.56 s
gammaloop-nextest-integration>
197.56 s
gammaloop-nextest-integration> ━━━━━━━━━━━━━━━━━━━━━━━━━━━━━━━━━━ BACKTRACE ━━━━━━━━━━━━━━━━━━━━━━━━━━━━━━━━━━━
197.56 s
gammaloop-nextest-integration> 1: <color_eyre[51793ea62743adbd]::config::EyreHook>::into_eyre_hook::{closure#0} <unknown>
197.56 s
gammaloop-nextest-integration> at <unknown source file> :<unknown line>
197.56 s
gammaloop-nextest-integration> 2: eyre[cb2fd339c0c40fca]::capture_handler <unknown>
197.56 s
gammaloop-nextest-integration> at <unknown source file> :<unknown line>
197.56 s
gammaloop-nextest-integration> 3: <eyre[cb2fd339c0c40fca]::Report>::from_std::<feynkit_model[a2b643db882f5a57]::error::ModelError> <unknown>
197.56 s
gammaloop-nextest-integration> at <unknown source file> :<unknown line>
197.56 s
gammaloop-nextest-integration> 4: <gammaloop_api[bff55112c48008d0]::state::State>::save <unknown>
197.56 s
gammaloop-nextest-integration> at <unknown source file> :<unknown line>
197.56 s
gammaloop-nextest-integration> 5: <gammaloop_api[bff55112c48008d0]::commands::save::SaveState>::save <unknown>
197.56 s
gammaloop-nextest-integration> at <unknown source file> :<unknown line>
197.56 s
gammaloop-nextest-integration> 6: gammaloop_integration_tests[cd7ce9928366268d]::build_cli_for_run_history <unknown>
197.56 s
gammaloop-nextest-integration> at <unknown source file> :<unknown line>
197.56 s
gammaloop-nextest-integration> 7: gammaloop_integration_tests[cd7ce9928366268d]::get_test_cli::<std[bcb96dfbba0ab899]::path::PathBuf> <unknown>
197.56 s
gammaloop-nextest-integration> at <unknown source file> :<unknown line>
197.56 s
gammaloop-nextest-integration> 8: <test_feyngen[68799b25537a09ff]::test_generate_sm_full_a_ddx::{closure#0} as core[940e698046960fd5]::ops::function::FnOnce<()>>::call_once <unknown>
197.56 s
gammaloop-nextest-integration> at <unknown source file> :<unknown line>
197.56 s
gammaloop-nextest-integration> 9: test[75d6903177b1d7e9]::__rust_begin_short_backtrace::<core[940e698046960fd5]::result::Result<(), alloc[2ea6bcb46fca0c42]::string::String>, fn() -> core[940e698046960fd5]::result::Result<(), alloc[2ea6bcb46fca0c42]::string::String>> <unknown>
197.56 s
gammaloop-nextest-integration> at <unknown source file> :<unknown line>
197.56 s
gammaloop-nextest-integration> 10: test[75d6903177b1d7e9]::run_test::{closure#0} <unknown>
197.56 s
gammaloop-nextest-integration> at <unknown source file> :<unknown line>
197.56 s
gammaloop-nextest-integration> 11: std[bcb96dfbba0ab899]::sys::backtrace::__rust_begin_short_backtrace::<test[75d6903177b1d7e9]::run_test::{closure#1}, ()> <unknown>
197.56 s
gammaloop-nextest-integration> at <unknown source file> :<unknown line>
197.56 s
gammaloop-nextest-integration> 12: <std[bcb96dfbba0ab899]::thread::lifecycle::spawn_unchecked<test[75d6903177b1d7e9]::run_test::{closure#1}, ()>::{closure#1} as core[940e698046960fd5]::ops::function::FnOnce<()>>::call_once::{shim:vtable#0} <unknown>
197.56 s
gammaloop-nextest-integration> at <unknown source file> :<unknown line>
197.56 s
gammaloop-nextest-integration> 13: <std[bcb96dfbba0ab899]::sys::thread::unix::Thread>::new::thread_start <unknown>
197.56 s
gammaloop-nextest-integration> at <unknown source file> :<unknown line>
197.56 s
gammaloop-nextest-integration> 14: start_thread <unknown>
197.56 s
gammaloop-nextest-integration> at <unknown source file> :<unknown line>
197.56 s
gammaloop-nextest-integration> 15: __clone3 <unknown>
197.56 s
gammaloop-nextest-integration> at <unknown source file> :<unknown line>
197.56 s
gammaloop-nextest-integration>
197.56 s
gammaloop-nextest-integration> Run with COLORBT_SHOW_HIDDEN=1 environment variable to disable frame filtering.
197.56 s
gammaloop-nextest-integration> Run with RUST_BACKTRACE=full to include source snippets.
197.56 s
gammaloop-nextest-integration>
197.72 s
gammaloop-nextest-integration> error : test run failed
197.75 s
gammaloop-nextest-integration>
197.75 s
gammaloop-nextest-integration> ========== nextest test summary ==========
197.75 s
gammaloop-nextest-integration> report: target/nextest/ci_gammaloop/junit.xml
197.75 s
gammaloop-nextest-integration> tests: 106, failures: 1, errors: 0
197.75 s
gammaloop-nextest-integration>
197.75 s
gammaloop-nextest-integration> 1. gammaloop-integration-tests::test_feyngen::test_generate_sm_full_a_ddx
197.75 s
gammaloop-nextest-integration> failure: test failure with exit code 101
197.75 s
gammaloop-nextest-integration> Error:
197.75 s
gammaloop-nextest-integration> 0: could not write model data to '/build/source/tests/artifacts/feyn_gen_generation_test/model.json': No such file or directory (os error 2)
197.75 s
gammaloop-nextest-integration> 1: No such file or directory (os error 2)
197.75 s
gammaloop-nextest-integration>
197.75 s
gammaloop-nextest-integration> Location:
197.75 s
gammaloop-nextest-integration> crates/gammaloop-api/src/state.rs:3281
197.75 s
gammaloop-nextest-integration>
197.75 s
gammaloop-nextest-integration> ━━━━━━━━━━━━━━━━━━━━━━━━━━━━━━━━━━ BACKTRACE ━━━━━━━━━━━━━━━━━━━━━━━━━━━━━━━━━━━
197.75 s
gammaloop-nextest-integration> 1: <color_eyre[51793ea62743adbd]::config::EyreHook>::into_eyre_hook::{closure#0}<unknown>
197.75 s
gammaloop-nextest-integration> at <unknown source file>:<unknown line>
197.75 s
gammaloop-nextest-integration> 2: eyre[cb2fd339c0c40fca]::capture_handler<unknown>
197.75 s
gammaloop-nextest-integration> at <unknown source file>:<unknown line>
197.75 s
gammaloop-nextest-integration> 3: <eyre[cb2fd339c0c40fca]::Report>::from_std::<feynkit_model[a2b643db882f5a57]::error::ModelError><unknown>
197.75 s
gammaloop-nextest-integration> at <unknown source file>:<unknown line>
197.75 s
gammaloop-nextest-integration> 4: <gammaloop_api[bff55112c48008d0]::state::State>::save<unknown>
197.75 s
gammaloop-nextest-integration> at <unknown source file>:<unknown line>
197.75 s
gammaloop-nextest-integration> 5: <gammaloop_api[bff55112c48008d0]::commands::save::SaveState>::save<unknown>
197.75 s
gammaloop-nextest-integration> at <unknown source file>:<unknown line>
197.75 s
gammaloop-nextest-integration> 6: gammaloop_integration_tests[cd7ce9928366268d]::build_cli_for_run_history<unknown>
197.75 s
gammaloop-nextest-integration> at <unknown source file>:<unknown line>
197.75 s
gammaloop-nextest-integration> 7: gammaloop_integration_tests[cd7ce9928366268d]::get_test_cli::<std[bcb96dfbba0ab899]::path::PathBuf><unknown>
197.75 s
gammaloop-nextest-integration> at <unknown source file>:<unknown line>
197.75 s
gammaloop-nextest-integration> 8: <test_feyngen[68799b25537a09ff]::test_generate_sm_full_a_ddx::{closure#0} as core[940e698046960fd5]::ops::function::FnOnce<()>>::call_once<unknown>
197.75 s
gammaloop-nextest-integration> at <unknown source file>:<unknown line>
197.75 s
gammaloop-nextest-integration> 9: test[75d6903177b1d7e9]::__rust_begin_short_backtrace::<core[940e698046960fd5]::result::Result<(), alloc[2ea6bcb46fca0c42]::string::String>, fn() -> core[940e698046960fd5]::result::Result<(), alloc[2ea6bcb46fca0c42]::string::String>><unknown>
197.75 s
gammaloop-nextest-integration> at <unknown source file>:<unknown line>
197.75 s
gammaloop-nextest-integration> 10: test[75d6903177b1d7e9]::run_test::{closure#0}<unknown>
197.75 s
gammaloop-nextest-integration> at <unknown source file>:<unknown line>
197.75 s
gammaloop-nextest-integration> 11: std[bcb96dfbba0ab899]::sys::backtrace::__rust_begin_short_backtrace::<test[75d6903177b1d7e9]::run_test::{closure#1}, ()><unknown>
197.75 s
gammaloop-nextest-integration> at <unknown source file>:<unknown line>
197.75 s
gammaloop-nextest-integration> 12: <std[bcb96dfbba0ab899]::thread::lifecycle::spawn_unchecked<test[75d6903177b1d7e9]::run_test::{closure#1}, ()>::{closure#1} as core[940e698046960fd5]::ops::function::FnOnce<()>>::call_once::{shim:vtable#0}<unknown>
197.75 s
gammaloop-nextest-integration> at <unknown source file>:<unknown line>
197.75 s
gammaloop-nextest-integration> 13: <std[bcb96dfbba0ab899]::sys::thread::unix::Thread>::new::thread_start<unknown>
197.75 s
gammaloop-nextest-integration> at <unknown source file>:<unknown line>
197.75 s
gammaloop-nextest-integration> 14: start_thread<unknown>
197.75 s
gammaloop-nextest-integration> at <unknown source file>:<unknown line>
197.75 s
gammaloop-nextest-integration> 15: __clone3<unknown>
197.75 s
gammaloop-nextest-integration> at <unknown source file>:<unknown line>
197.75 s
gammaloop-nextest-integration>
197.75 s
gammaloop-nextest-integration> Run with COLORBT_SHOW_HIDDEN=1 environment variable to disable frame filtering.
197.75 s
gammaloop-nextest-integration> Run with RUST_BACKTRACE=full to include source snippets.
197.75 s
gammaloop-nextest-integration> system-out
197.75 s
gammaloop-nextest-integration> running 1 test
197.75 s
gammaloop-nextest-integration> test test_generate_sm_full_a_ddx ... FAILED
197.75 s
gammaloop-nextest-integration>
197.75 s
gammaloop-nextest-integration> failures:
197.75 s
gammaloop-nextest-integration>
197.75 s
gammaloop-nextest-integration> failures:
197.75 s
gammaloop-nextest-integration> test_generate_sm_full_a_ddx
197.75 s
gammaloop-nextest-integration>
197.75 s
gammaloop-nextest-integration> test result: FAILED. 0 passed; 1 failed; 0 ignored; 0 measured; 29 filtered out; finished in 0.06s
197.75 s
gammaloop-nextest-integration> system-err
197.75 s
gammaloop-nextest-integration> Error:
197.75 s
gammaloop-nextest-integration> 0: could not write model data to '/build/source/tests/artifacts/feyn_gen_generation_test/model.json': No such file or directory (os error 2)
197.75 s
gammaloop-nextest-integration> 1: No such file or directory (os error 2)
197.75 s
gammaloop-nextest-integration>
197.75 s
gammaloop-nextest-integration> Location:
197.75 s
gammaloop-nextest-integration> crates/gammaloop-api/src/state.rs:3281
197.75 s
gammaloop-nextest-integration>
197.75 s
gammaloop-nextest-integration> ━━━━━━━━━━━━━━━━━━━━━━━━━━━━━━━━━━ BACKTRACE ━━━━━━━━━━━━━━━━━━━━━━━━━━━━━━━━━━━
197.75 s
gammaloop-nextest-integration> 1: <color_eyre[51793ea62743adbd]::config::EyreHook>::into_eyre_hook::{closure#0}<unknown>
197.75 s
gammaloop-nextest-integration> at <unknown source file>:<unknown line>
197.75 s
gammaloop-nextest-integration> 2: eyre[cb2fd339c0c40fca]::capture_handler<unknown>
197.75 s
gammaloop-nextest-integration> at <unknown source file>:<unknown line>
197.75 s
gammaloop-nextest-integration> 3: <eyre[cb2fd339c0c40fca]::Report>::from_std::<feynkit_model[a2b643db882f5a57]::error::ModelError><unknown>
197.75 s
gammaloop-nextest-integration> at <unknown source file>:<unknown line>
197.75 s
gammaloop-nextest-integration> 4: <gammaloop_api[bff55112c48008d0]::state::State>::save<unknown>
197.75 s
gammaloop-nextest-integration> at <unknown source file>:<unknown line>
197.75 s
gammaloop-nextest-integration> 5: <gammaloop_api[bff55112c48008d0]::commands::save::SaveState>::save<unknown>
197.75 s
gammaloop-nextest-integration> at <unknown source file>:<unknown line>
197.75 s
gammaloop-nextest-integration> 6: gammaloop_integration_tests[cd7ce9928366268d]::build_cli_for_run_history<unknown>
197.75 s
gammaloop-nextest-integration> at <unknown source file>:<unknown line>
197.75 s
gammaloop-nextest-integration> 7: gammaloop_integration_tests[cd7ce9928366268d]::get_test_cli::<std[bcb96dfbba0ab899]::path::PathBuf><unknown>
197.75 s
gammaloop-nextest-integration> at <unknown source file>:<unknown line>
197.75 s
gammaloop-nextest-integration> 8: <test_feyngen[68799b25537a09ff]::test_generate_sm_full_a_ddx::{closure#0} as core[940e698046960fd5]::ops::function::FnOnce<()>>::call_once<unknown>
197.75 s
gammaloop-nextest-integration> at <unknown source file>:<unknown line>
197.75 s
gammaloop-nextest-integration> 9: test[75d6903177b1d7e9]::__rust_begin_short_backtrace::<core[940e698046960fd5]::result::Result<(), alloc[2ea6bcb46fca0c42]::string::String>, fn() -> core[940e698046960fd5]::result::Result<(), alloc[2ea6bcb46fca0c42]::string::String>><unknown>
197.75 s
gammaloop-nextest-integration> at <unknown source file>:<unknown line>
197.75 s
gammaloop-nextest-integration> 10: test[75d6903177b1d7e9]::run_test::{closure#0}<unknown>
197.75 s
gammaloop-nextest-integration> at <unknown source file>:<unknown line>
197.75 s
gammaloop-nextest-integration> 11: std[bcb96dfbba0ab899]::sys::backtrace::__rust_begin_short_backtrace::<test[75d6903177b1d7e9]::run_test::{closure#1}, ()><unknown>
197.75 s
gammaloop-nextest-integration> at <unknown source file>:<unknown line>
197.75 s
gammaloop-nextest-integration> 12: <std[bcb96dfbba0ab899]::thread::lifecycle::spawn_unchecked<test[75d6903177b1d7e9]::run_test::{closure#1}, ()>::{closure#1} as core[940e698046960fd5]::ops::function::FnOnce<()>>::call_once::{shim:vtable#0}<unknown>
197.75 s
gammaloop-nextest-integration> at <unknown source file>:<unknown line>
197.75 s
gammaloop-nextest-integration> 13: <std[bcb96dfbba0ab899]::sys::thread::unix::Thread>::new::thread_start<unknown>
197.75 s
gammaloop-nextest-integration> at <unknown source file>:<unknown line>
197.75 s
gammaloop-nextest-integration> 14: start_thread<unknown>
197.75 s
gammaloop-nextest-integration> at <unknown source file>:<unknown line>
197.75 s
gammaloop-nextest-integration> 15: __clone3<unknown>
197.75 s
gammaloop-nextest-integration> at <unknown source file>:<unknown line>
197.75 s
gammaloop-nextest-integration>
197.75 s
gammaloop-nextest-integration> Run with COLORBT_SHOW_HIDDEN=1 environment variable to disable frame filtering.
197.75 s
gammaloop-nextest-integration> Run with RUST_BACKTRACE=full to include source snippets.
197.75 s
gammaloop-nextest-integration> =========================================
197.83 s
error: Cannot build '/nix/store/7m8nfmjqgkp7pjsmsxq2m5k8wwc8zp7m-gammaloop-nextest-integration.drv '.
197.83 s
Reason: builder failed with exit code 100 .
197.83 s
Output paths:
197.83 s
/nix/store/alwx9kydi0bisplaq0bwsb9b3kbgpp3c-gammaloop-nextest-integration
197.83 s
Last 221 log lines:
197.83 s
> Extracting 10 binaries, 1 build script output directory, and 3 linked paths to /build/nextest-archive-0mlCHh
197.83 s
> Extracted 27 files to /build/nextest-archive-0mlCHh in 1.53s
197.83 s
> ------------
197.83 s
> Nextest run ID 0bd010be-245a-4c36-9b06-fd72a9729ed5 with nextest profile: ci_gammaloop
197.83 s
> Starting 106 tests across 10 binaries (67 tests skipped via profile.ci_gammaloop.default-filter )
197.83 s
> FAIL [ 0.073s] ( 34/106) gammaloop-integration-tests::test_feyngen test_generate_sm_full_a_ddx
197.83 s
> stdout ---
197.83 s
>
197.83 s
> running 1 test
197.83 s
> test test_generate_sm_full_a_ddx ... FAILED
197.83 s
>
197.83 s
> failures:
197.83 s
>
197.83 s
> failures:
197.83 s
> test_generate_sm_full_a_ddx
197.83 s
>
197.83 s
> test result: FAILED. 0 passed; 1 failed; 0 ignored; 0 measured; 29 filtered out; finished in 0.06s
197.83 s
>
197.83 s
> stderr ---
197.83 s
> Error:
197.83 s
> 0: could not write model data to '/build/source/tests/artifacts/feyn_gen_generation_test/model.json': No such file or directory (os error 2)
197.83 s
> 1: No such file or directory (os error 2)
197.83 s
>
197.83 s
> Location:
197.83 s
> crates/gammaloop-api/src/state.rs :3281
197.83 s
>
197.83 s
> ━━━━━━━━━━━━━━━━━━━━━━━━━━━━━━━━━━ BACKTRACE ━━━━━━━━━━━━━━━━━━━━━━━━━━━━━━━━━━━
197.83 s
> 1: <color_eyre[51793ea62743adbd]::config::EyreHook>::into_eyre_hook::{closure#0} <unknown>
197.83 s
> at <unknown source file> :<unknown line>
197.83 s
> 2: eyre[cb2fd339c0c40fca]::capture_handler <unknown>
197.83 s
> at <unknown source file> :<unknown line>
197.83 s
> 3: <eyre[cb2fd339c0c40fca]::Report>::from_std::<feynkit_model[a2b643db882f5a57]::error::ModelError> <unknown>
197.83 s
> at <unknown source file> :<unknown line>
197.83 s
> 4: <gammaloop_api[bff55112c48008d0]::state::State>::save <unknown>
197.83 s
> at <unknown source file> :<unknown line>
197.83 s
> 5: <gammaloop_api[bff55112c48008d0]::commands::save::SaveState>::save <unknown>
197.83 s
> at <unknown source file> :<unknown line>
197.83 s
> 6: gammaloop_integration_tests[cd7ce9928366268d]::build_cli_for_run_history <unknown>
197.83 s
> at <unknown source file> :<unknown line>
197.83 s
> 7: gammaloop_integration_tests[cd7ce9928366268d]::get_test_cli::<std[bcb96dfbba0ab899]::path::PathBuf> <unknown>
197.83 s
> at <unknown source file> :<unknown line>
197.83 s
> 8: <test_feyngen[68799b25537a09ff]::test_generate_sm_full_a_ddx::{closure#0} as core[940e698046960fd5]::ops::function::FnOnce<()>>::call_once <unknown>
197.83 s
> at <unknown source file> :<unknown line>
197.83 s
> 9: test[75d6903177b1d7e9]::__rust_begin_short_backtrace::<core[940e698046960fd5]::result::Result<(), alloc[2ea6bcb46fca0c42]::string::String>, fn() -> core[940e698046960fd5]::result::Result<(), alloc[2ea6bcb46fca0c42]::string::String>> <unknown>
197.83 s
> at <unknown source file> :<unknown line>
197.83 s
> 10: test[75d6903177b1d7e9]::run_test::{closure#0} <unknown>
197.83 s
> at <unknown source file> :<unknown line>
197.83 s
> 11: std[bcb96dfbba0ab899]::sys::backtrace::__rust_begin_short_backtrace::<test[75d6903177b1d7e9]::run_test::{closure#1}, ()> <unknown>
197.83 s
> at <unknown source file> :<unknown line>
197.83 s
> 12: <std[bcb96dfbba0ab899]::thread::lifecycle::spawn_unchecked<test[75d6903177b1d7e9]::run_test::{closure#1}, ()>::{closure#1} as core[940e698046960fd5]::ops::function::FnOnce<()>>::call_once::{shim:vtable#0} <unknown>
197.83 s
> at <unknown source file> :<unknown line>
197.83 s
> 13: <std[bcb96dfbba0ab899]::sys::thread::unix::Thread>::new::thread_start <unknown>
197.83 s
> at <unknown source file> :<unknown line>
197.83 s
> 14: start_thread <unknown>
197.83 s
> at <unknown source file> :<unknown line>
197.83 s
> 15: __clone3 <unknown>
197.83 s
> at <unknown source file> :<unknown line>
197.83 s
>
197.83 s
> Run with COLORBT_SHOW_HIDDEN=1 environment variable to disable frame filtering.
197.83 s
> Run with RUST_BACKTRACE=full to include source snippets.
197.83 s
>
197.83 s
> ------------
197.83 s
> Summary [ 124.884s] 106 tests run: 105 passed , 1 failed , 67 skipped
197.83 s
> FAIL [ 0.073s] ( 34/106) gammaloop-integration-tests::test_feyngen test_generate_sm_full_a_ddx
197.83 s
> stdout ---
197.83 s
>
197.83 s
> running 1 test
197.83 s
> test test_generate_sm_full_a_ddx ... FAILED
197.83 s
>
197.83 s
> failures:
197.83 s
>
197.83 s
> failures:
197.83 s
> test_generate_sm_full_a_ddx
197.83 s
>
197.83 s
> test result: FAILED. 0 passed; 1 failed; 0 ignored; 0 measured; 29 filtered out; finished in 0.06s
197.83 s
>
197.83 s
> stderr ---
197.83 s
> Error:
197.83 s
> 0: could not write model data to '/build/source/tests/artifacts/feyn_gen_generation_test/model.json': No such file or directory (os error 2)
197.83 s
> 1: No such file or directory (os error 2)
197.83 s
>
197.83 s
> Location:
197.83 s
> crates/gammaloop-api/src/state.rs :3281
197.83 s
>
197.83 s
> ━━━━━━━━━━━━━━━━━━━━━━━━━━━━━━━━━━ BACKTRACE ━━━━━━━━━━━━━━━━━━━━━━━━━━━━━━━━━━━
197.83 s
> 1: <color_eyre[51793ea62743adbd]::config::EyreHook>::into_eyre_hook::{closure#0} <unknown>
197.83 s
> at <unknown source file> :<unknown line>
197.83 s
> 2: eyre[cb2fd339c0c40fca]::capture_handler <unknown>
197.83 s
> at <unknown source file> :<unknown line>
197.83 s
> 3: <eyre[cb2fd339c0c40fca]::Report>::from_std::<feynkit_model[a2b643db882f5a57]::error::ModelError> <unknown>
197.83 s
> at <unknown source file> :<unknown line>
197.83 s
> 4: <gammaloop_api[bff55112c48008d0]::state::State>::save <unknown>
197.83 s
> at <unknown source file> :<unknown line>
197.83 s
> 5: <gammaloop_api[bff55112c48008d0]::commands::save::SaveState>::save <unknown>
197.83 s
> at <unknown source file> :<unknown line>
197.83 s
> 6: gammaloop_integration_tests[cd7ce9928366268d]::build_cli_for_run_history <unknown>
197.83 s
> at <unknown source file> :<unknown line>
197.83 s
> 7: gammaloop_integration_tests[cd7ce9928366268d]::get_test_cli::<std[bcb96dfbba0ab899]::path::PathBuf> <unknown>
197.83 s
> at <unknown source file> :<unknown line>
197.83 s
> 8: <test_feyngen[68799b25537a09ff]::test_generate_sm_full_a_ddx::{closure#0} as core[940e698046960fd5]::ops::function::FnOnce<()>>::call_once <unknown>
197.83 s
> at <unknown source file> :<unknown line>
197.83 s
> 9: test[75d6903177b1d7e9]::__rust_begin_short_backtrace::<core[940e698046960fd5]::result::Result<(), alloc[2ea6bcb46fca0c42]::string::String>, fn() -> core[940e698046960fd5]::result::Result<(), alloc[2ea6bcb46fca0c42]::string::String>> <unknown>
197.83 s
> at <unknown source file> :<unknown line>
197.83 s
> 10: test[75d6903177b1d7e9]::run_test::{closure#0} <unknown>
197.83 s
> at <unknown source file> :<unknown line>
197.83 s
> 11: std[bcb96dfbba0ab899]::sys::backtrace::__rust_begin_short_backtrace::<test[75d6903177b1d7e9]::run_test::{closure#1}, ()> <unknown>
197.83 s
> at <unknown source file> :<unknown line>
197.83 s
> 12: <std[bcb96dfbba0ab899]::thread::lifecycle::spawn_unchecked<test[75d6903177b1d7e9]::run_test::{closure#1}, ()>::{closure#1} as core[940e698046960fd5]::ops::function::FnOnce<()>>::call_once::{shim:vtable#0} <unknown>
197.83 s
> at <unknown source file> :<unknown line>
197.83 s
> 13: <std[bcb96dfbba0ab899]::sys::thread::unix::Thread>::new::thread_start <unknown>
197.83 s
> at <unknown source file> :<unknown line>
197.83 s
> 14: start_thread <unknown>
197.83 s
> at <unknown source file> :<unknown line>
197.83 s
> 15: __clone3 <unknown>
197.83 s
> at <unknown source file> :<unknown line>
197.83 s
>
197.83 s
> Run with COLORBT_SHOW_HIDDEN=1 environment variable to disable frame filtering.
197.83 s
> Run with RUST_BACKTRACE=full to include source snippets.
197.83 s
>
197.83 s
> error : test run failed
197.83 s
>
197.83 s
> ========== nextest test summary ==========
197.83 s
> report: target/nextest/ci_gammaloop/junit.xml
197.83 s
> tests: 106, failures: 1, errors: 0
197.83 s
>
197.83 s
> 1. gammaloop-integration-tests::test_feyngen::test_generate_sm_full_a_ddx
197.83 s
> failure: test failure with exit code 101
197.83 s
> Error:
197.83 s
> 0: could not write model data to '/build/source/tests/artifacts/feyn_gen_generation_test/model.json': No such file or directory (os error 2)
197.83 s
> 1: No such file or directory (os error 2)
197.83 s
>
197.83 s
> Location:
197.83 s
> crates/gammaloop-api/src/state.rs:3281
197.83 s
>
197.83 s
> ━━━━━━━━━━━━━━━━━━━━━━━━━━━━━━━━━━ BACKTRACE ━━━━━━━━━━━━━━━━━━━━━━━━━━━━━━━━━━━
197.83 s
> 1: <color_eyre[51793ea62743adbd]::config::EyreHook>::into_eyre_hook::{closure#0}<unknown>
197.83 s
> at <unknown source file>:<unknown line>
197.83 s
> 2: eyre[cb2fd339c0c40fca]::capture_handler<unknown>
197.83 s
> at <unknown source file>:<unknown line>
197.83 s
> 3: <eyre[cb2fd339c0c40fca]::Report>::from_std::<feynkit_model[a2b643db882f5a57]::error::ModelError><unknown>
197.83 s
> at <unknown source file>:<unknown line>
197.83 s
> 4: <gammaloop_api[bff55112c48008d0]::state::State>::save<unknown>
197.83 s
> at <unknown source file>:<unknown line>
197.83 s
> 5: <gammaloop_api[bff55112c48008d0]::commands::save::SaveState>::save<unknown>
197.83 s
> at <unknown source file>:<unknown line>
197.83 s
> 6: gammaloop_integration_tests[cd7ce9928366268d]::build_cli_for_run_history<unknown>
197.83 s
> at <unknown source file>:<unknown line>
197.83 s
> 7: gammaloop_integration_tests[cd7ce9928366268d]::get_test_cli::<std[bcb96dfbba0ab899]::path::PathBuf><unknown>
197.83 s
> at <unknown source file>:<unknown line>
197.83 s
> 8: <test_feyngen[68799b25537a09ff]::test_generate_sm_full_a_ddx::{closure#0} as core[940e698046960fd5]::ops::function::FnOnce<()>>::call_once<unknown>
197.83 s
> at <unknown source file>:<unknown line>
197.83 s
> 9: test[75d6903177b1d7e9]::__rust_begin_short_backtrace::<core[940e698046960fd5]::result::Result<(), alloc[2ea6bcb46fca0c42]::string::String>, fn() -> core[940e698046960fd5]::result::Result<(), alloc[2ea6bcb46fca0c42]::string::String>><unknown>
197.83 s
> at <unknown source file>:<unknown line>
197.83 s
> 10: test[75d6903177b1d7e9]::run_test::{closure#0}<unknown>
197.83 s
> at <unknown source file>:<unknown line>
197.83 s
> 11: std[bcb96dfbba0ab899]::sys::backtrace::__rust_begin_short_backtrace::<test[75d6903177b1d7e9]::run_test::{closure#1}, ()><unknown>
197.83 s
> at <unknown source file>:<unknown line>
197.83 s
> 12: <std[bcb96dfbba0ab899]::thread::lifecycle::spawn_unchecked<test[75d6903177b1d7e9]::run_test::{closure#1}, ()>::{closure#1} as core[940e698046960fd5]::ops::function::FnOnce<()>>::call_once::{shim:vtable#0}<unknown>
197.83 s
> at <unknown source file>:<unknown line>
197.83 s
> 13: <std[bcb96dfbba0ab899]::sys::thread::unix::Thread>::new::thread_start<unknown>
197.83 s
> at <unknown source file>:<unknown line>
197.83 s
> 14: start_thread<unknown>
197.83 s
> at <unknown source file>:<unknown line>
197.83 s
> 15: __clone3<unknown>
197.83 s
> at <unknown source file>:<unknown line>
197.83 s
>
197.83 s
> Run with COLORBT_SHOW_HIDDEN=1 environment variable to disable frame filtering.
197.83 s
> Run with RUST_BACKTRACE=full to include source snippets.
197.83 s
> system-out
197.83 s
> running 1 test
197.83 s
> test test_generate_sm_full_a_ddx ... FAILED
197.83 s
>
197.83 s
> failures:
197.83 s
>
197.83 s
> failures:
197.83 s
> test_generate_sm_full_a_ddx
197.83 s
>
197.83 s
> test result: FAILED. 0 passed; 1 failed; 0 ignored; 0 measured; 29 filtered out; finished in 0.06s
197.83 s
> system-err
197.83 s
> Error:
197.83 s
> 0: could not write model data to '/build/source/tests/artifacts/feyn_gen_generation_test/model.json': No such file or directory (os error 2)
197.83 s
> 1: No such file or directory (os error 2)
197.83 s
>
197.83 s
> Location:
197.83 s
> crates/gammaloop-api/src/state.rs:3281
197.83 s
>
197.83 s
> ━━━━━━━━━━━━━━━━━━━━━━━━━━━━━━━━━━ BACKTRACE ━━━━━━━━━━━━━━━━━━━━━━━━━━━━━━━━━━━
197.83 s
> 1: <color_eyre[51793ea62743adbd]::config::EyreHook>::into_eyre_hook::{closure#0}<unknown>
197.83 s
> at <unknown source file>:<unknown line>
197.83 s
> 2: eyre[cb2fd339c0c40fca]::capture_handler<unknown>
197.84 s
> at <unknown source file>:<unknown line>
197.84 s
> 3: <eyre[cb2fd339c0c40fca]::Report>::from_std::<feynkit_model[a2b643db882f5a57]::error::ModelError><unknown>
197.84 s
> at <unknown source file>:<unknown line>
197.84 s
> 4: <gammaloop_api[bff55112c48008d0]::state::State>::save<unknown>
197.84 s
> at <unknown source file>:<unknown line>
197.84 s
> 5: <gammaloop_api[bff55112c48008d0]::commands::save::SaveState>::save<unknown>
197.84 s
> at <unknown source file>:<unknown line>
197.84 s
> 6: gammaloop_integration_tests[cd7ce9928366268d]::build_cli_for_run_history<unknown>
197.84 s
> at <unknown source file>:<unknown line>
197.84 s
> 7: gammaloop_integration_tests[cd7ce9928366268d]::get_test_cli::<std[bcb96dfbba0ab899]::path::PathBuf><unknown>
197.84 s
> at <unknown source file>:<unknown line>
197.84 s
> 8: <test_feyngen[68799b25537a09ff]::test_generate_sm_full_a_ddx::{closure#0} as core[940e698046960fd5]::ops::function::FnOnce<()>>::call_once<unknown>
197.84 s
> at <unknown source file>:<unknown line>
197.84 s
> 9: test[75d6903177b1d7e9]::__rust_begin_short_backtrace::<core[940e698046960fd5]::result::Result<(), alloc[2ea6bcb46fca0c42]::string::String>, fn() -> core[940e698046960fd5]::result::Result<(), alloc[2ea6bcb46fca0c42]::string::String>><unknown>
197.84 s
> at <unknown source file>:<unknown line>
197.84 s
> 10: test[75d6903177b1d7e9]::run_test::{closure#0}<unknown>
197.84 s
> at <unknown source file>:<unknown line>
197.84 s
> 11: std[bcb96dfbba0ab899]::sys::backtrace::__rust_begin_short_backtrace::<test[75d6903177b1d7e9]::run_test::{closure#1}, ()><unknown>
197.84 s
> at <unknown source file>:<unknown line>
197.84 s
> 12: <std[bcb96dfbba0ab899]::thread::lifecycle::spawn_unchecked<test[75d6903177b1d7e9]::run_test::{closure#1}, ()>::{closure#1} as core[940e698046960fd5]::ops::function::FnOnce<()>>::call_once::{shim:vtable#0}<unknown>
197.84 s
> at <unknown source file>:<unknown line>
197.84 s
> 13: <std[bcb96dfbba0ab899]::sys::thread::unix::Thread>::new::thread_start<unknown>
197.84 s
> at <unknown source file>:<unknown line>
197.84 s
> 14: start_thread<unknown>
197.84 s
> at <unknown source file>:<unknown line>
197.84 s
> 15: __clone3<unknown>
197.84 s
> at <unknown source file>:<unknown line>
197.84 s
>
197.84 s
> Run with COLORBT_SHOW_HIDDEN=1 environment variable to disable frame filtering.
197.84 s
> Run with RUST_BACKTRACE=full to include source snippets.
197.84 s
> =========================================
197.84 s
For full logs, run:
197.84 s
nix log /nix/store/7m8nfmjqgkp7pjsmsxq2m5k8wwc8zp7m-gammaloop-nextest-integration.drv
197.94 s
[5 built (1 failed ), 63 Run failed.