1. 0.01 s $ /nix/store/9ypz3flqsrl5xl495mm8h645gadjsxi1-coreutils-9.11/bin/timeout --kill-after=15s 7200s /nix/store/23zk8sgzamrbmj1fday15szf7f2279s8-nix-2.34.7/bin/nix --extra-experimental-features nix-command --extra-experimental-features flakes flake clone git+https://github.com/alphal00p/gammaloop --dest /tmp/nix-ci-worker/stable-pwd/repo/
  2. 0.32 s Cloning into '/tmp/nix-ci-worker/stable-pwd/repo'...
  3. 1.46 s remote: Enumerating objects: 87989, done.
  4. 1.57 s remote: Counting objects: 0% (1/10587) remote: Counting objects: 1% (106/10587) remote: Counting objects: 2% (212/10587) remote: Counting objects: 3% (318/10587) remote: Counting objects: 4% (424/10587) remote: Counting objects: 5% (530/10587) remote: Counting objects: 6% (636/10587) remote: Counting objects: 7% (742/10587) remote: Counting objects: 8% (847/10587) remote: Counting objects: 9% (953/10587) remote: Counting objects: 10% (1059/10587) remote: Counting objects: 11% (1165/10587) remote: Counting objects: 12% (1271/10587) remote: Counting objects: 13% (1377/10587) remote: Counting objects: 14% (1483/10587) remote: Counting objects: 15% (1589/10587) remote: Counting objects: 16% (1694/10587) remote: Counting objects: 17% (1800/10587) remote: Counting objects: 18% (1906/10587) remote: Counting objects: 19% (2012/10587) remote: Counting objects: 20% (2118/10587) remote: Counting objects: 21% (2224/10587) remote: Counting objects: 22% (2330/10587) remote: Counting objects: 23% (2436/10587) remote: Counting objects: 24% (2541/10587) remote: Counting objects: 25% (2647/10587) remote: Counting objects: 26% (2753/10587) remote: Counting objects: 27% (2859/10587) remote: Counting objects: 28% (2965/10587) remote: Counting objects: 29% (3071/10587) remote: Counting objects: 30% (3177/10587) remote: Counting objects: 31% (3282/10587) remote: Counting objects: 32% (3388/10587) remote: Counting objects: 33% (3494/10587) remote: Counting objects: 34% (3600/10587) remote: Counting objects: 35% (3706/10587) remote: Counting objects: 36% (3812/10587) remote: Counting objects: 37% (3918/10587) remote: Counting objects: 38% (4024/10587) remote: Counting objects: 39% (4129/10587) remote: Counting objects: 40% (4235/10587) remote: Counting objects: 41% (4341/10587) remote: Counting objects: 42% (4447/10587) remote: Counting objects: 43% (4553/10587) remote: Counting objects: 44% (4659/10587) remote: Counting objects: 45% (4765/10587) remote: Counting objects: 46% (4871/10587) remote: Counting objects: 47% (4976/10587) remote: Counting objects: 48% (5082/10587) remote: Counting objects: 49% (5188/10587) remote: Counting objects: 50% (5294/10587) remote: Counting objects: 51% (5400/10587) remote: Counting objects: 52% (5506/10587) remote: Counting objects: 53% (5612/10587) remote: Counting objects: 54% (5717/10587) remote: Counting objects: 55% (5823/10587) remote: Counting objects: 56% (5929/10587) remote: Counting objects: 57% (6035/10587) remote: Counting objects: 58% (6141/10587) remote: Counting objects: 59% (6247/10587) remote: Counting objects: 60% (6353/10587) remote: Counting objects: 61% (6459/10587) remote: Counting objects: 62% (6564/10587) remote: Counting objects: 63% (6670/10587) remote: Counting objects: 64% (6776/10587) remote: Counting objects: 65% (6882/10587) remote: Counting objects: 66% (6988/10587) remote: Counting objects: 67% (7094/10587) remote: Counting objects: 68% (7200/10587) remote: Counting objects: 69% (7306/10587) remote: Counting objects: 70% (7411/10587) remote: Counting objects: 71% (7517/10587) remote: Counting objects: 72% (7623/10587) remote: Counting objects: 73% (7729/10587) remote: Counting objects: 74% (7835/10587) remote: Counting objects: 75% (7941/10587) remote: Counting objects: 76% (8047/10587) remote: Counting objects: 77% (8152/10587) remote: Counting objects: 78% (8258/10587) remote: Counting objects: 79% (8364/10587) remote: Counting objects: 80% (8470/10587) remote: Counting objects: 81% (8576/10587) remote: Counting objects: 82% (8682/10587) remote: Counting objects: 83% (8788/10587) remote: Counting objects: 84% (8894/10587) remote: Counting objects: 85% (8999/10587) remote: Counting objects: 86% (9105/10587) remote: Counting objects: 87% (9211/10587) remote: Counting objects: 88% (9317/10587) remote: Counting objects: 89% (9423/10587) remote: Counting objects: 90% (9529/10587) remote: Counting objects: 91% (9635/10587) remote: Counting objects: 92% (9741/10587) remote: Counting objects: 93% (9846/10587) remote: Counting objects: 94% (9952/10587) remote: Counting objects: 95% (10058/10587) remote: Counting objects: 96% (10164/10587) remote: Counting objects: 97% (10270/10587) remote: Counting objects: 98% (10376/10587) remote: Counting objects: 99% (10482/10587) remote: Counting objects: 100% (10587/10587) remote: Counting objects: 100% (10587/10587), done.
  5. 4.59 s remote: Compressing objects: 0% (1/2956) remote: Compressing objects: 1% (30/2956) remote: Compressing objects: 2% (60/2956) remote: Compressing objects: 3% (89/2956) remote: Compressing objects: 4% (119/2956) remote: Compressing objects: 5% (148/2956) remote: Compressing objects: 6% (178/2956) remote: Compressing objects: 7% (207/2956) remote: Compressing objects: 8% (237/2956) remote: Compressing objects: 9% (267/2956) remote: Compressing objects: 10% (296/2956) remote: Compressing objects: 11% (326/2956) remote: Compressing objects: 12% (355/2956) remote: Compressing objects: 13% (385/2956) remote: Compressing objects: 14% (414/2956) remote: Compressing objects: 15% (444/2956) remote: Compressing objects: 15% (445/2956) remote: Compressing objects: 16% (473/2956) remote: Compressing objects: 17% (503/2956) remote: Compressing objects: 18% (533/2956) remote: Compressing objects: 19% (562/2956) remote: Compressing objects: 20% (592/2956) remote: Compressing objects: 21% (621/2956) remote: Compressing objects: 22% (651/2956) remote: Compressing objects: 23% (680/2956) remote: Compressing objects: 24% (710/2956) remote: Compressing objects: 25% (739/2956) remote: Compressing objects: 26% (769/2956) remote: Compressing objects: 26% (771/2956) remote: Compressing objects: 27% (799/2956) remote: Compressing objects: 28% (828/2956) remote: Compressing objects: 29% (858/2956) remote: Compressing objects: 30% (887/2956) remote: Compressing objects: 31% (917/2956) remote: Compressing objects: 32% (946/2956) remote: Compressing objects: 33% (976/2956) remote: Compressing objects: 34% (1006/2956) remote: Compressing objects: 35% (1035/2956) remote: Compressing objects: 36% (1065/2956) remote: Compressing objects: 37% (1094/2956) remote: Compressing objects: 38% (1124/2956) remote: Compressing objects: 39% (1153/2956) remote: Compressing objects: 40% (1183/2956) remote: Compressing objects: 41% (1212/2956) remote: Compressing objects: 41% (1221/2956) remote: Compressing objects: 42% (1242/2956) remote: Compressing objects: 43% (1272/2956) remote: Compressing objects: 44% (1301/2956) remote: Compressing objects: 45% (1331/2956) remote: Compressing objects: 46% (1360/2956) remote: Compressing objects: 47% (1390/2956) remote: Compressing objects: 48% (1419/2956) remote: Compressing objects: 49% (1449/2956) remote: Compressing objects: 50% (1478/2956) remote: Compressing objects: 51% (1508/2956) remote: Compressing objects: 52% (1538/2956) remote: Compressing objects: 53% (1567/2956) remote: Compressing objects: 54% (1597/2956) remote: Compressing objects: 55% (1626/2956) remote: Compressing objects: 56% (1656/2956) remote: Compressing objects: 57% (1685/2956) remote: Compressing objects: 58% (1715/2956) remote: Compressing objects: 59% (1745/2956) remote: Compressing objects: 60% (1774/2956) remote: Compressing objects: 61% (1804/2956) remote: Compressing objects: 62% (1833/2956) remote: Compressing objects: 63% (1863/2956) remote: Compressing objects: 64% (1892/2956) remote: Compressing objects: 65% (1922/2956) remote: Compressing objects: 66% (1951/2956) remote: Compressing objects: 67% (1981/2956) remote: Compressing objects: 68% (2011/2956) remote: Compressing objects: 69% (2040/2956) remote: Compressing objects: 70% (2070/2956) remote: Compressing objects: 71% (2099/2956) remote: Compressing objects: 72% (2129/2956) remote: Compressing objects: 73% (2158/2956) remote: Compressing objects: 74% (2188/2956) remote: Compressing objects: 75% (2217/2956) remote: Compressing objects: 76% (2247/2956) remote: Compressing objects: 77% (2277/2956) remote: Compressing objects: 78% (2306/2956) remote: Compressing objects: 79% (2336/2956) remote: Compressing objects: 80% (2365/2956) remote: Compressing objects: 81% (2395/2956) remote: Compressing objects: 82% (2424/2956) remote: Compressing objects: 83% (2454/2956) remote: Compressing objects: 84% (2484/2956) remote: Compressing objects: 85% (2513/2956) remote: Compressing objects: 86% (2543/2956) remote: Compressing objects: 87% (2572/2956) remote: Compressing objects: 88% (2602/2956) remote: Compressing objects: 89% (2631/2956) remote: Compressing objects: 90% (2661/2956) remote: Compressing objects: 91% (2690/2956) remote: Compressing objects: 92% (2720/2956) remote: Compressing objects: 93% (2750/2956) remote: Compressing objects: 94% (2779/2956) remote: Compressing objects: 95% (2809/2956) remote: Compressing objects: 96% (2838/2956) remote: Compressing objects: 97% (2868/2956) remote: Compressing objects: 98% (2897/2956) remote: Compressing objects: 99% (2927/2956) remote: Compressing objects: 100% (2956/2956) remote: Compressing objects: 100% (2956/2956), done.
  6. 10.14 s Receiving objects: 0% (1/87989) Receiving objects: 1% (880/87989) Receiving objects: 2% (1760/87989) Receiving objects: 3% (2640/87989) Receiving objects: 4% (3520/87989) Receiving objects: 5% (4400/87989), 7.95 MiB | 15.89 MiB/s Receiving objects: 6% (5280/87989), 7.95 MiB | 15.89 MiB/s Receiving objects: 7% (6160/87989), 7.95 MiB | 15.89 MiB/s Receiving objects: 8% (7040/87989), 7.95 MiB | 15.89 MiB/s Receiving objects: 8% (7251/87989), 16.42 MiB | 16.41 MiB/s Receiving objects: 9% (7920/87989), 16.42 MiB | 16.41 MiB/s Receiving objects: 10% (8799/87989), 16.42 MiB | 16.41 MiB/s Receiving objects: 11% (9679/87989), 16.42 MiB | 16.41 MiB/s Receiving objects: 12% (10559/87989), 16.42 MiB | 16.41 MiB/s Receiving objects: 13% (11439/87989), 16.42 MiB | 16.41 MiB/s Receiving objects: 14% (12319/87989), 16.42 MiB | 16.41 MiB/s Receiving objects: 15% (13199/87989), 16.42 MiB | 16.41 MiB/s Receiving objects: 16% (14079/87989), 16.42 MiB | 16.41 MiB/s Receiving objects: 17% (14959/87989), 16.42 MiB | 16.41 MiB/s Receiving objects: 18% (15839/87989), 16.42 MiB | 16.41 MiB/s Receiving objects: 19% (16718/87989), 16.42 MiB | 16.41 MiB/s Receiving objects: 20% (17598/87989), 16.42 MiB | 16.41 MiB/s Receiving objects: 21% (18478/87989), 16.42 MiB | 16.41 MiB/s Receiving objects: 22% (19358/87989), 16.42 MiB | 16.41 MiB/s Receiving objects: 23% (20238/87989), 16.42 MiB | 16.41 MiB/s Receiving objects: 24% (21118/87989), 16.42 MiB | 16.41 MiB/s Receiving objects: 25% (21998/87989), 16.42 MiB | 16.41 MiB/s Receiving objects: 26% (22878/87989), 16.42 MiB | 16.41 MiB/s Receiving objects: 27% (23758/87989), 16.42 MiB | 16.41 MiB/s Receiving objects: 28% (24637/87989), 16.42 MiB | 16.41 MiB/s Receiving objects: 29% (25517/87989), 16.42 MiB | 16.41 MiB/s Receiving objects: 30% (26397/87989), 16.42 MiB | 16.41 MiB/s Receiving objects: 31% (27277/87989), 16.42 MiB | 16.41 MiB/s Receiving objects: 32% (28157/87989), 16.42 MiB | 16.41 MiB/s Receiving objects: 33% (29037/87989), 16.42 MiB | 16.41 MiB/s Receiving objects: 34% (29917/87989), 16.42 MiB | 16.41 MiB/s Receiving objects: 35% (30797/87989), 16.42 MiB | 16.41 MiB/s Receiving objects: 36% (31677/87989), 16.42 MiB | 16.41 MiB/s Receiving objects: 37% (32556/87989), 16.42 MiB | 16.41 MiB/s Receiving objects: 38% (33436/87989), 30.61 MiB | 20.40 MiB/s Receiving objects: 39% (34316/87989), 30.61 MiB | 20.40 MiB/s Receiving objects: 40% (35196/87989), 30.61 MiB | 20.40 MiB/s Receiving objects: 41% (36076/87989), 30.61 MiB | 20.40 MiB/s Receiving objects: 42% (36956/87989), 30.61 MiB | 20.40 MiB/s Receiving objects: 43% (37836/87989), 30.61 MiB | 20.40 MiB/s Receiving objects: 44% (38716/87989), 30.61 MiB | 20.40 MiB/s Receiving objects: 45% (39596/87989), 30.61 MiB | 20.40 MiB/s Receiving objects: 46% (40475/87989), 30.61 MiB | 20.40 MiB/s Receiving objects: 47% (41355/87989), 30.61 MiB | 20.40 MiB/s Receiving objects: 48% (42235/87989), 30.61 MiB | 20.40 MiB/s Receiving objects: 49% (43115/87989), 30.61 MiB | 20.40 MiB/s Receiving objects: 49% (43133/87989), 30.61 MiB | 20.40 MiB/s Receiving objects: 50% (43995/87989), 51.46 MiB | 25.73 MiB/s Receiving objects: 51% (44875/87989), 51.46 MiB | 25.73 MiB/s Receiving objects: 52% (45755/87989), 51.46 MiB | 25.73 MiB/s Receiving objects: 53% (46635/87989), 51.46 MiB | 25.73 MiB/s Receiving objects: 54% (47515/87989), 51.46 MiB | 25.73 MiB/s Receiving objects: 55% (48394/87989), 51.46 MiB | 25.73 MiB/s Receiving objects: 56% (49274/87989), 51.46 MiB | 25.73 MiB/s Receiving objects: 57% (50154/87989), 68.16 MiB | 27.26 MiB/s Receiving objects: 58% (51034/87989), 68.16 MiB | 27.26 MiB/s Receiving objects: 59% (51914/87989), 68.16 MiB | 27.26 MiB/s Receiving objects: 60% (52794/87989), 68.16 MiB | 27.26 MiB/s Receiving objects: 61% (53674/87989), 68.16 MiB | 27.26 MiB/s Receiving objects: 62% (54554/87989), 68.16 MiB | 27.26 MiB/s Receiving objects: 63% (55434/87989), 68.16 MiB | 27.26 MiB/s Receiving objects: 64% (56313/87989), 68.16 MiB | 27.26 MiB/s Receiving objects: 65% (57193/87989), 68.16 MiB | 27.26 MiB/s Receiving objects: 65% (57319/87989), 88.71 MiB | 29.57 MiB/s Receiving objects: 66% (58073/87989), 103.66 MiB | 29.61 MiB/s Receiving objects: 67% (58953/87989), 103.66 MiB | 29.61 MiB/s Receiving objects: 68% (59833/87989), 103.66 MiB | 29.61 MiB/s Receiving objects: 69% (60713/87989), 103.66 MiB | 29.61 MiB/s Receiving objects: 70% (61593/87989), 103.66 MiB | 29.61 MiB/s Receiving objects: 71% (62473/87989), 103.66 MiB | 29.61 MiB/s Receiving objects: 71% (63191/87989), 118.99 MiB | 29.74 MiB/s Receiving objects: 72% (63353/87989), 118.99 MiB | 29.74 MiB/s Receiving objects: 73% (64232/87989), 118.99 MiB | 29.74 MiB/s Receiving objects: 74% (65112/87989), 118.99 MiB | 29.74 MiB/s Receiving objects: 75% (65992/87989), 118.99 MiB | 29.74 MiB/s Receiving objects: 76% (66872/87989), 118.99 MiB | 29.74 MiB/s Receiving objects: 77% (67752/87989), 118.99 MiB | 29.74 MiB/s Receiving objects: 78% (68632/87989), 118.99 MiB | 29.74 MiB/s Receiving objects: 79% (69512/87989), 118.99 MiB | 29.74 MiB/s Receiving objects: 80% (70392/87989), 118.99 MiB | 29.74 MiB/s Receiving objects: 81% (71272/87989), 118.99 MiB | 29.74 MiB/s Receiving objects: 82% (72151/87989), 118.99 MiB | 29.74 MiB/s Receiving objects: 83% (73031/87989), 118.99 MiB | 29.74 MiB/s Receiving objects: 84% (73911/87989), 118.99 MiB | 29.74 MiB/s Receiving objects: 85% (74791/87989), 140.86 MiB | 31.24 MiB/s Receiving objects: 86% (75671/87989), 140.86 MiB | 31.24 MiB/s Receiving objects: 87% (76551/87989), 140.86 MiB | 31.24 MiB/s Receiving objects: 88% (77431/87989), 140.86 MiB | 31.24 MiB/s Receiving objects: 89% (78311/87989), 140.86 MiB | 31.24 MiB/s Receiving objects: 90% (79191/87989), 140.86 MiB | 31.24 MiB/s Receiving objects: 91% (80070/87989), 140.86 MiB | 31.24 MiB/s Receiving objects: 92% (80950/87989), 140.86 MiB | 31.24 MiB/s Receiving objects: 93% (81830/87989), 140.86 MiB | 31.24 MiB/s Receiving objects: 94% (82710/87989), 140.86 MiB | 31.24 MiB/s Receiving objects: 95% (83590/87989), 140.86 MiB | 31.24 MiB/s Receiving objects: 96% (84470/87989), 140.86 MiB | 31.24 MiB/s Receiving objects: 97% (85350/87989), 140.86 MiB | 31.24 MiB/s Receiving objects: 97% (86090/87989), 156.23 MiB | 32.88 MiB/s Receiving objects: 98% (86230/87989), 156.23 MiB | 32.88 MiB/s Receiving objects: 99% (87110/87989), 175.59 MiB | 35.31 MiB/s remote: Total 87989 (delta 8644), reused 8407 (delta 7605), pack-reused 77402 (from 3)
  7. 10.14 s Receiving objects: 100% (87989/87989), 175.59 MiB | 35.31 MiB/s Receiving objects: 100% (87989/87989), 176.53 MiB | 31.79 MiB/s, done.
  8. 12.87 s Resolving deltas: 0% (0/59509) Resolving deltas: 1% (596/59509) Resolving deltas: 2% (1191/59509) Resolving deltas: 3% (1788/59509) Resolving deltas: 4% (2381/59509) Resolving deltas: 5% (2976/59509) Resolving deltas: 6% (3571/59509) Resolving deltas: 7% (4166/59509) Resolving deltas: 8% (4761/59509) Resolving deltas: 9% (5357/59509) Resolving deltas: 10% (5952/59509) Resolving deltas: 11% (6546/59509) Resolving deltas: 12% (7142/59509) Resolving deltas: 13% (7737/59509) Resolving deltas: 14% (8332/59509) Resolving deltas: 15% (8927/59509) Resolving deltas: 16% (9522/59509) Resolving deltas: 17% (10117/59509) Resolving deltas: 18% (10712/59509) Resolving deltas: 19% (11307/59509) Resolving deltas: 20% (11902/59509) Resolving deltas: 21% (12497/59509) Resolving deltas: 22% (13092/59509) Resolving deltas: 23% (13688/59509) Resolving deltas: 24% (14283/59509) Resolving deltas: 25% (14878/59509) Resolving deltas: 26% (15473/59509) Resolving deltas: 27% (16068/59509) Resolving deltas: 28% (16663/59509) Resolving deltas: 29% (17258/59509) Resolving deltas: 30% (17853/59509) Resolving deltas: 31% (18448/59509) Resolving deltas: 32% (19043/59509) Resolving deltas: 33% (19638/59509) Resolving deltas: 34% (20234/59509) Resolving deltas: 35% (20829/59509) Resolving deltas: 36% (21425/59509) Resolving deltas: 37% (22019/59509) Resolving deltas: 38% (22614/59509) Resolving deltas: 39% (23209/59509) Resolving deltas: 40% (23804/59509) Resolving deltas: 41% (24399/59509) Resolving deltas: 42% (24995/59509) Resolving deltas: 43% (25589/59509) Resolving deltas: 44% (26184/59509) Resolving deltas: 45% (26780/59509) Resolving deltas: 46% (27375/59509) Resolving deltas: 47% (27970/59509) Resolving deltas: 48% (28565/59509) Resolving deltas: 49% (29160/59509) Resolving deltas: 50% (29756/59509) Resolving deltas: 50% (29875/59509) Resolving deltas: 51% (30350/59509) Resolving deltas: 52% (30945/59509) Resolving deltas: 53% (31540/59509) Resolving deltas: 54% (32135/59509) Resolving deltas: 55% (32730/59509) Resolving deltas: 56% (33326/59509) Resolving deltas: 57% (33921/59509) Resolving deltas: 58% (34516/59509) Resolving deltas: 59% (35111/59509) Resolving deltas: 60% (35706/59509) Resolving deltas: 61% (36302/59509) Resolving deltas: 62% (36896/59509) Resolving deltas: 63% (37491/59509) Resolving deltas: 64% (38086/59509) Resolving deltas: 65% (38681/59509) Resolving deltas: 66% (39276/59509) Resolving deltas: 67% (39872/59509) Resolving deltas: 68% (40467/59509) Resolving deltas: 69% (41062/59509) Resolving deltas: 70% (41657/59509) Resolving deltas: 70% (41678/59509) Resolving deltas: 71% (42252/59509) Resolving deltas: 72% (42847/59509) Resolving deltas: 73% (43442/59509) Resolving deltas: 74% (44037/59509) Resolving deltas: 75% (44632/59509) Resolving deltas: 76% (45227/59509) Resolving deltas: 77% (45822/59509) Resolving deltas: 78% (46418/59509) Resolving deltas: 79% (47013/59509) Resolving deltas: 80% (47608/59509) Resolving deltas: 81% (48203/59509) Resolving deltas: 82% (48798/59509) Resolving deltas: 83% (49393/59509) Resolving deltas: 84% (49988/59509) Resolving deltas: 85% (50583/59509) Resolving deltas: 86% (51178/59509) Resolving deltas: 87% (51773/59509) Resolving deltas: 88% (52368/59509) Resolving deltas: 89% (52964/59509) Resolving deltas: 90% (53559/59509) Resolving deltas: 91% (54155/59509) Resolving deltas: 92% (54749/59509) Resolving deltas: 93% (55345/59509) Resolving deltas: 94% (55939/59509) Resolving deltas: 95% (56534/59509) Resolving deltas: 96% (57129/59509) Resolving deltas: 97% (57724/59509) Resolving deltas: 98% (58319/59509) Resolving deltas: 99% (58914/59509) Resolving deltas: 100% (59509/59509) Resolving deltas: 100% (59509/59509), done.
  9. 13.55 s Fetching commit 891dec7c25b5d9026c099da021ec7ae3b757dee9 for codex/docs-before-consolidation-20260914 ...
  10. 13.55 s $ /nix/store/bcnisk3ydfgv26v2gw3zlky24g00yww2-git-2.54.0/bin/git fetch origin 891dec7c25b5d9026c099da021ec7ae3b757dee9
  11. 14.02 s From https://github.com/alphal00p/gammaloop
  12. 14.02 s * branch 891dec7c25b5d9026c099da021ec7ae3b757dee9 -> FETCH_HEAD
  13. 14.04 s $ /nix/store/9ypz3flqsrl5xl495mm8h645gadjsxi1-coreutils-9.11/bin/timeout --kill-after=15s 7200s /nix/store/bcnisk3ydfgv26v2gw3zlky24g00yww2-git-2.54.0/bin/git -c advice.detachedHead=false checkout 891dec7c25b5d9026c099da021ec7ae3b757dee9
  14. 14.44 s HEAD is now at 891dec7c2 change photos
  15. 14.45 s $ /nix/store/9ypz3flqsrl5xl495mm8h645gadjsxi1-coreutils-9.11/bin/timeout --kill-after=15s 7200s /nix/store/23zk8sgzamrbmj1fday15szf7f2279s8-nix-2.34.7/bin/nix --extra-experimental-features nix-command --extra-experimental-features flakes --log-format internal-json run .#packages.x86_64-linux.nix-ci-check-gammaloop-nextest-core --print-build-logs
  16. 14.69 s
  17. 23.92 s evaluating derivation 'g copying '/nix/store/bgss evaluating derivation 'g copying '/nix/store/bgss evaluating derivation 'g copying '/nix/store/bgss evaluating derivation 'g copying '/nix/store/bgss evaluating derivation 'g copying '/nix/store/bgss evaluating derivation 'g copying '/nix/store/bgss evaluating derivation 'g copying '/nix/store/bgss evaluating derivation 'g copying '/nix/store/bgss evaluating derivation 'g copying '/nix/store/bgss evaluating derivation 'g [0/1 built] [1/0/1 built] [1/0/1 built] building ggammaloop-nextest-core> Extracting 4 binaries (including 2 non-test binaries), 1 build script output directory, and 2 linked paths to /build/source
  18. 24.68 s gammaloop-nextest-core> Extracted 20 files to /build/source in 0.76s
  19. 24.72 s gammaloop-nextest-core> ------------
  20. 24.72 s gammaloop-nextest-core> Nextest run ID 4c4b4a27-1f45-400d-8ed2-c5e69e0b2d75 with nextest profile: ci_gammaloop
  21. 24.72 s gammaloop-nextest-core> Starting 339 tests across 2 binaries (1 test skipped)
  22. 25.52 s gammaloop-nextest-core> FAIL [ 0.068s] (252/339) gammaloop-api repl::tests::completion_shows_type_hint_for_non_boolean_settings_leaf
  23. 25.52 s gammaloop-nextest-core> stdout ---
  24. 25.52 s gammaloop-nextest-core>
  25. 25.52 s gammaloop-nextest-core> running 1 test
  26. 25.52 s gammaloop-nextest-core> test repl::tests::completion_shows_type_hint_for_non_boolean_settings_leaf ... FAILED
  27. 25.52 s gammaloop-nextest-core>
  28. 25.52 s gammaloop-nextest-core> failures:
  29. 25.52 s gammaloop-nextest-core>
  30. 25.52 s gammaloop-nextest-core> failures:
  31. 25.52 s gammaloop-nextest-core> repl::tests::completion_shows_type_hint_for_non_boolean_settings_leaf
  32. 25.52 s gammaloop-nextest-core>
  33. 25.52 s gammaloop-nextest-core> test result: FAILED. 0 passed; 1 failed; 0 ignored; 0 measured; 339 filtered out; finished in 0.04s
  34. 25.52 s gammaloop-nextest-core>
  35. 25.52 s gammaloop-nextest-core> stderr ---
  36. 25.52 s gammaloop-nextest-core>
  37. 25.52 s gammaloop-nextest-core> thread 'repl::tests::completion_shows_type_hint_for_non_boolean_settings_leaf' (784) panicked at crates/gammaloop-api/src/repl.rs:5772:9:
  38. 25.52 s gammaloop-nextest-core> [Suggestion { value: "", description: Some("expects an integer"), style: None, extra: None, span: Span { start: 42, end: 42 }, append_whitespace: false }]
  39. 25.52 s gammaloop-nextest-core> stack backtrace:
  40. 25.52 s gammaloop-nextest-core> 0: __rustc::rust_begin_unwind
  41. 25.52 s gammaloop-nextest-core> 1: core::panicking::panic_fmt
  42. 25.52 s gammaloop-nextest-core> 2: gammaloop_api::repl::tests::completion_shows_type_hint_for_non_boolean_settings_leaf
  43. 25.52 s gammaloop-nextest-core> 3: <gammaloop_api::repl::tests::completion_shows_type_hint_for_non_boolean_settings_leaf::{closure#0} as core::ops::function::FnOnce<()>>::call_once
  44. 25.52 s gammaloop-nextest-core> note: Some details are omitted, run with `RUST_BACKTRACE=full` for a verbose backtrace.
  45. 25.52 s gammaloop-nextest-core>
  46. 25.83 s gammaloop-nextest-core> ------------
  47. 25.83 s gammaloop-nextest-core> Summary [ 1.094s] 339 tests run: 338 passed, 1 failed, 1 skipped
  48. 25.83 s gammaloop-nextest-core> FAIL [ 0.068s] (252/339) gammaloop-api repl::tests::completion_shows_type_hint_for_non_boolean_settings_leaf
  49. 25.83 s gammaloop-nextest-core> stdout ---
  50. 25.83 s gammaloop-nextest-core>
  51. 25.83 s gammaloop-nextest-core> running 1 test
  52. 25.83 s gammaloop-nextest-core> test repl::tests::completion_shows_type_hint_for_non_boolean_settings_leaf ... FAILED
  53. 25.83 s gammaloop-nextest-core>
  54. 25.83 s gammaloop-nextest-core> failures:
  55. 25.83 s gammaloop-nextest-core>
  56. 25.83 s gammaloop-nextest-core> failures:
  57. 25.83 s gammaloop-nextest-core> repl::tests::completion_shows_type_hint_for_non_boolean_settings_leaf
  58. 25.83 s gammaloop-nextest-core>
  59. 25.83 s gammaloop-nextest-core> test result: FAILED. 0 passed; 1 failed; 0 ignored; 0 measured; 339 filtered out; finished in 0.04s
  60. 25.83 s gammaloop-nextest-core>
  61. 25.83 s gammaloop-nextest-core> stderr ---
  62. 25.83 s gammaloop-nextest-core>
  63. 25.83 s gammaloop-nextest-core> thread 'repl::tests::completion_shows_type_hint_for_non_boolean_settings_leaf' (784) panicked at crates/gammaloop-api/src/repl.rs:5772:9:
  64. 25.83 s gammaloop-nextest-core> [Suggestion { value: "", description: Some("expects an integer"), style: None, extra: None, span: Span { start: 42, end: 42 }, append_whitespace: false }]
  65. 25.83 s gammaloop-nextest-core> stack backtrace:
  66. 25.83 s gammaloop-nextest-core> 0: __rustc::rust_begin_unwind
  67. 25.83 s gammaloop-nextest-core> 1: core::panicking::panic_fmt
  68. 25.83 s gammaloop-nextest-core> 2: gammaloop_api::repl::tests::completion_shows_type_hint_for_non_boolean_settings_leaf
  69. 25.83 s gammaloop-nextest-core> 3: <gammaloop_api::repl::tests::completion_shows_type_hint_for_non_boolean_settings_leaf::{closure#0} as core::ops::function::FnOnce<()>>::call_once
  70. 25.83 s gammaloop-nextest-core> note: Some details are omitted, run with `RUST_BACKTRACE=full` for a verbose backtrace.
  71. 25.83 s gammaloop-nextest-core>
  72. 25.83 s gammaloop-nextest-core> error: test run failed
  73. 25.90 s gammaloop-nextest-core>
  74. 25.90 s gammaloop-nextest-core> ========== nextest test summary ==========
  75. 25.90 s gammaloop-nextest-core> report: target/nextest/ci_gammaloop/junit.xml
  76. 25.90 s gammaloop-nextest-core> tests: 339, failures: 1, errors: 0
  77. 25.90 s gammaloop-nextest-core>
  78. 25.90 s gammaloop-nextest-core> 1. gammaloop-api::repl::tests::completion_shows_type_hint_for_non_boolean_settings_leaf
  79. 25.90 s gammaloop-nextest-core> failure: test failure with exit code 101
  80. 25.90 s gammaloop-nextest-core> thread 'repl::tests::completion_shows_type_hint_for_non_boolean_settings_leaf' (784) panicked at crates/gammaloop-api/src/repl.rs:5772:9:
  81. 25.90 s gammaloop-nextest-core> [Suggestion { value: "", description: Some("expects an integer"), style: None, extra: None, span: Span { start: 42, end: 42 }, append_whitespace: false }]
  82. 25.90 s gammaloop-nextest-core> stack backtrace:
  83. 25.90 s gammaloop-nextest-core> 0: __rustc::rust_begin_unwind
  84. 25.90 s gammaloop-nextest-core> 1: core::panicking::panic_fmt
  85. 25.90 s gammaloop-nextest-core> 2: gammaloop_api::repl::tests::completion_shows_type_hint_for_non_boolean_settings_leaf
  86. 25.90 s gammaloop-nextest-core> 3: <gammaloop_api::repl::tests::completion_shows_type_hint_for_non_boolean_settings_leaf::{closure#0} as core::ops::function::FnOnce<()>>::call_once
  87. 25.90 s gammaloop-nextest-core> note: Some details are omitted, run with `RUST_BACKTRACE=full` for a verbose backtrace.
  88. 25.90 s gammaloop-nextest-core> system-out
  89. 25.90 s gammaloop-nextest-core> running 1 test
  90. 25.90 s gammaloop-nextest-core> test repl::tests::completion_shows_type_hint_for_non_boolean_settings_leaf ... FAILED
  91. 25.90 s gammaloop-nextest-core>
  92. 25.90 s gammaloop-nextest-core> failures:
  93. 25.90 s gammaloop-nextest-core>
  94. 25.90 s gammaloop-nextest-core> failures:
  95. 25.90 s gammaloop-nextest-core> repl::tests::completion_shows_type_hint_for_non_boolean_settings_leaf
  96. 25.90 s gammaloop-nextest-core>
  97. 25.90 s gammaloop-nextest-core> test result: FAILED. 0 passed; 1 failed; 0 ignored; 0 measured; 339 filtered out; finished in 0.04s
  98. 25.90 s gammaloop-nextest-core> system-err
  99. 25.90 s gammaloop-nextest-core> thread 'repl::tests::completion_shows_type_hint_for_non_boolean_settings_leaf' (784) panicked at crates/gammaloop-api/src/repl.rs:5772:9:
  100. 25.90 s gammaloop-nextest-core> [Suggestion { value: "", description: Some("expects an integer"), style: None, extra: None, span: Span { start: 42, end: 42 }, append_whitespace: false }]
  101. 25.90 s gammaloop-nextest-core> stack backtrace:
  102. 25.90 s gammaloop-nextest-core> 0: __rustc::rust_begin_unwind
  103. 25.90 s gammaloop-nextest-core> 1: core::panicking::panic_fmt
  104. 25.90 s gammaloop-nextest-core> 2: gammaloop_api::repl::tests::completion_shows_type_hint_for_non_boolean_settings_leaf
  105. 25.90 s gammaloop-nextest-core> 3: <gammaloop_api::repl::tests::completion_shows_type_hint_for_non_boolean_settings_leaf::{closure#0} as core::ops::function::FnOnce<()>>::call_once
  106. 25.90 s gammaloop-nextest-core> note: Some details are omitted, run with `RUST_BACKTRACE=full` for a verbose backtrace.
  107. 25.90 s gammaloop-nextest-core> =========================================
  108. 25.93 s gammaloop-nextest-core> Extracting 1 binary and 1 linked path to /build/source
  109. 26.07 s gammaloop-nextest-core> Extracted 7 files to /build/source in 0.14s
  110. 26.10 s gammaloop-nextest-core> ------------
  111. 26.10 s gammaloop-nextest-core> Nextest run ID d4c7a55b-679e-4ec1-ac67-ecd56959d643 with nextest profile: ci_gammaloop
  112. 26.10 s gammaloop-nextest-core> Starting 19 tests across 1 binary
  113. 26.16 s gammaloop-nextest-core> ------------
  114. 26.16 s gammaloop-nextest-core> Summary [ 0.056s] 19 tests run: 19 passed, 0 skipped
  115. 26.23 s gammaloop-nextest-core>
  116. 26.23 s gammaloop-nextest-core> ========== nextest test summary ==========
  117. 26.23 s gammaloop-nextest-core> report: target/nextest/ci_gammaloop/junit.xml
  118. 26.23 s gammaloop-nextest-core> tests: 19, failures: 0, errors: 0
  119. 26.23 s gammaloop-nextest-core> No failing testcases found.
  120. 26.23 s gammaloop-nextest-core> =========================================
  121. 26.26 s gammaloop-nextest-core> Extracting 1 binary to /build/source
  122. 26.31 s gammaloop-nextest-core> Extracted 4 files to /build/source in 0.05s
  123. 26.34 s gammaloop-nextest-core> ------------
  124. 26.34 s gammaloop-nextest-core> Nextest run ID d2ad9d8c-8ea7-4c25-886c-c761de4faaa7 with nextest profile: ci_gammaloop
  125. 26.34 s gammaloop-nextest-core> Starting 0 tests across 1 binary
  126. 26.35 s gammaloop-nextest-core> ------------
  127. 26.35 s gammaloop-nextest-core> Summary [ 0.007s] 0 tests run: 0 passed, 0 skipped
  128. 26.43 s gammaloop-nextest-core>
  129. 26.43 s gammaloop-nextest-core> ========== nextest test summary ==========
  130. 26.43 s gammaloop-nextest-core> report: target/nextest/ci_gammaloop/junit.xml
  131. 26.43 s gammaloop-nextest-core> tests: 0, failures: 0, errors: 0
  132. 26.43 s gammaloop-nextest-core> No failing testcases found.
  133. 26.43 s gammaloop-nextest-core> =========================================
  134. 26.47 s gammaloop-nextest-core> Extracting 5 binaries (including 1 non-test binary), 1 build script output directory, and 2 linked paths to /build/source
  135. 27.30 s gammaloop-nextest-core> Extracted 20 files to /build/source in 0.84s
  136. 27.37 s gammaloop-nextest-core> ------------
  137. 27.37 s gammaloop-nextest-core> Nextest run ID 2ae02504-1bfe-4d1c-894a-cb64a4ddf613 with nextest profile: ci_gammaloop
  138. 27.37 s gammaloop-nextest-core> Starting 456 tests across 4 binaries (61 tests skipped, including 60 tests via profile.ci_gammaloop.default-filter)
  139. 41.47 s gammaloop-nextest-core> ------------
  140. 41.47 s gammaloop-nextest-core> Summary [ 14.106s] 456 tests run: 456 passed, 61 skipped
  141. 41.51 s gammaloop-nextest-core>
  142. 41.51 s gammaloop-nextest-core> ========== nextest test summary ==========
  143. 41.51 s gammaloop-nextest-core> report: target/nextest/ci_gammaloop/junit.xml
  144. 41.51 s gammaloop-nextest-core> tests: 456, failures: 0, errors: 0
  145. 41.51 s gammaloop-nextest-core> No failing testcases found.
  146. 41.51 s gammaloop-nextest-core> =========================================
  147. 41.73 s [0 built (1 failed)]error: Cannot build '/nix/store/02car8gk7i8dx2vfklks1bn8vxkmhh2r-gammaloop-nextest-core.drv'.
  148. 41.73 s Reason: builder failed with exit code 100.
  149. 41.73 s Output paths:
  150. 41.73 s /nix/store/mmzjp7789sw5r7w83acrb3ly0aj0pkbl-gammaloop-nextest-core
  151. 41.73 s Last 130 log lines:
  152. 41.73 s > Extracting 4 binaries (including 2 non-test binaries), 1 build script output directory, and 2 linked paths to /build/source
  153. 41.73 s > Extracted 20 files to /build/source in 0.76s
  154. 41.73 s > ------------
  155. 41.73 s > Nextest run ID 4c4b4a27-1f45-400d-8ed2-c5e69e0b2d75 with nextest profile: ci_gammaloop
  156. 41.73 s > Starting 339 tests across 2 binaries (1 test skipped)
  157. 41.73 s > FAIL [ 0.068s] (252/339) gammaloop-api repl::tests::completion_shows_type_hint_for_non_boolean_settings_leaf
  158. 41.73 s > stdout ---
  159. 41.73 s >
  160. 41.73 s > running 1 test
  161. 41.73 s > test repl::tests::completion_shows_type_hint_for_non_boolean_settings_leaf ... FAILED
  162. 41.73 s >
  163. 41.73 s > failures:
  164. 41.73 s >
  165. 41.73 s > failures:
  166. 41.73 s > repl::tests::completion_shows_type_hint_for_non_boolean_settings_leaf
  167. 41.73 s >
  168. 41.73 s > test result: FAILED. 0 passed; 1 failed; 0 ignored; 0 measured; 339 filtered out; finished in 0.04s
  169. 41.73 s >
  170. 41.73 s > stderr ---
  171. 41.73 s >
  172. 41.73 s > thread 'repl::tests::completion_shows_type_hint_for_non_boolean_settings_leaf' (784) panicked at crates/gammaloop-api/src/repl.rs:5772:9:
  173. 41.73 s > [Suggestion { value: "", description: Some("expects an integer"), style: None, extra: None, span: Span { start: 42, end: 42 }, append_whitespace: false }]
  174. 41.73 s > stack backtrace:
  175. 41.73 s > 0: __rustc::rust_begin_unwind
  176. 41.73 s > 1: core::panicking::panic_fmt
  177. 41.73 s > 2: gammaloop_api::repl::tests::completion_shows_type_hint_for_non_boolean_settings_leaf
  178. 41.73 s > 3: <gammaloop_api::repl::tests::completion_shows_type_hint_for_non_boolean_settings_leaf::{closure#0} as core::ops::function::FnOnce<()>>::call_once
  179. 41.73 s > note: Some details are omitted, run with `RUST_BACKTRACE=full` for a verbose backtrace.
  180. 41.73 s >
  181. 41.73 s > ------------
  182. 41.73 s > Summary [ 1.094s] 339 tests run: 338 passed, 1 failed, 1 skipped
  183. 41.73 s > FAIL [ 0.068s] (252/339) gammaloop-api repl::tests::completion_shows_type_hint_for_non_boolean_settings_leaf
  184. 41.73 s > stdout ---
  185. 41.73 s >
  186. 41.73 s > running 1 test
  187. 41.73 s > test repl::tests::completion_shows_type_hint_for_non_boolean_settings_leaf ... FAILED
  188. 41.73 s >
  189. 41.73 s > failures:
  190. 41.73 s >
  191. 41.73 s > failures:
  192. 41.73 s > repl::tests::completion_shows_type_hint_for_non_boolean_settings_leaf
  193. 41.73 s >
  194. 41.73 s > test result: FAILED. 0 passed; 1 failed; 0 ignored; 0 measured; 339 filtered out; finished in 0.04s
  195. 41.73 s >
  196. 41.73 s > stderr ---
  197. 41.73 s >
  198. 41.73 s > thread 'repl::tests::completion_shows_type_hint_for_non_boolean_settings_leaf' (784) panicked at crates/gammaloop-api/src/repl.rs:5772:9:
  199. 41.73 s > [Suggestion { value: "", description: Some("expects an integer"), style: None, extra: None, span: Span { start: 42, end: 42 }, append_whitespace: false }]
  200. 41.73 s > stack backtrace:
  201. 41.73 s > 0: __rustc::rust_begin_unwind
  202. 41.73 s > 1: core::panicking::panic_fmt
  203. 41.73 s > 2: gammaloop_api::repl::tests::completion_shows_type_hint_for_non_boolean_settings_leaf
  204. 41.73 s > 3: <gammaloop_api::repl::tests::completion_shows_type_hint_for_non_boolean_settings_leaf::{closure#0} as core::ops::function::FnOnce<()>>::call_once
  205. 41.73 s > note: Some details are omitted, run with `RUST_BACKTRACE=full` for a verbose backtrace.
  206. 41.73 s >
  207. 41.73 s > error: test run failed
  208. 41.73 s >
  209. 41.73 s > ========== nextest test summary ==========
  210. 41.73 s > report: target/nextest/ci_gammaloop/junit.xml
  211. 41.73 s > tests: 339, failures: 1, errors: 0
  212. 41.73 s >
  213. 41.73 s > 1. gammaloop-api::repl::tests::completion_shows_type_hint_for_non_boolean_settings_leaf
  214. 41.73 s > failure: test failure with exit code 101
  215. 41.73 s > thread 'repl::tests::completion_shows_type_hint_for_non_boolean_settings_leaf' (784) panicked at crates/gammaloop-api/src/repl.rs:5772:9:
  216. 41.73 s > [Suggestion { value: "", description: Some("expects an integer"), style: None, extra: None, span: Span { start: 42, end: 42 }, append_whitespace: false }]
  217. 41.73 s > stack backtrace:
  218. 41.73 s > 0: __rustc::rust_begin_unwind
  219. 41.73 s > 1: core::panicking::panic_fmt
  220. 41.73 s > 2: gammaloop_api::repl::tests::completion_shows_type_hint_for_non_boolean_settings_leaf
  221. 41.73 s > 3: <gammaloop_api::repl::tests::completion_shows_type_hint_for_non_boolean_settings_leaf::{closure#0} as core::ops::function::FnOnce<()>>::call_once
  222. 41.73 s > note: Some details are omitted, run with `RUST_BACKTRACE=full` for a verbose backtrace.
  223. 41.73 s > system-out
  224. 41.73 s > running 1 test
  225. 41.73 s > test repl::tests::completion_shows_type_hint_for_non_boolean_settings_leaf ... FAILED
  226. 41.73 s >
  227. 41.73 s > failures:
  228. 41.73 s >
  229. 41.73 s > failures:
  230. 41.73 s > repl::tests::completion_shows_type_hint_for_non_boolean_settings_leaf
  231. 41.73 s >
  232. 41.73 s > test result: FAILED. 0 passed; 1 failed; 0 ignored; 0 measured; 339 filtered out; finished in 0.04s
  233. 41.73 s > system-err
  234. 41.73 s > thread 'repl::tests::completion_shows_type_hint_for_non_boolean_settings_leaf' (784) panicked at crates/gammaloop-api/src/repl.rs:5772:9:
  235. 41.73 s > [Suggestion { value: "", description: Some("expects an integer"), style: None, extra: None, span: Span { start: 42, end: 42 }, append_whitespace: false }]
  236. 41.73 s > stack backtrace:
  237. 41.73 s > 0: __rustc::rust_begin_unwind
  238. 41.73 s > 1: core::panicking::panic_fmt
  239. 41.73 s > 2: gammaloop_api::repl::tests::completion_shows_type_hint_for_non_boolean_settings_leaf
  240. 41.73 s > 3: <gammaloop_api::repl::tests::completion_shows_type_hint_for_non_boolean_settings_leaf::{closure#0} as core::ops::function::FnOnce<()>>::call_once
  241. 41.73 s > note: Some details are omitted, run with `RUST_BACKTRACE=full` for a verbose backtrace.
  242. 41.73 s > =========================================
  243. 41.73 s > Extracting 1 binary and 1 linked path to /build/source
  244. 41.73 s > Extracted 7 files to /build/source in 0.14s
  245. 41.73 s > ------------
  246. 41.73 s > Nextest run ID d4c7a55b-679e-4ec1-ac67-ecd56959d643 with nextest profile: ci_gammaloop
  247. 41.73 s > Starting 19 tests across 1 binary
  248. 41.73 s > ------------
  249. 41.73 s > Summary [ 0.056s] 19 tests run: 19 passed, 0 skipped
  250. 41.73 s >
  251. 41.73 s > ========== nextest test summary ==========
  252. 41.73 s > report: target/nextest/ci_gammaloop/junit.xml
  253. 41.73 s > tests: 19, failures: 0, errors: 0
  254. 41.73 s > No failing testcases found.
  255. 41.73 s > =========================================
  256. 41.73 s > Extracting 1 binary to /build/source
  257. 41.73 s > Extracted 4 files to /build/source in 0.05s
  258. 41.73 s > ------------
  259. 41.73 s > Nextest run ID d2ad9d8c-8ea7-4c25-886c-c761de4faaa7 with nextest profile: ci_gammaloop
  260. 41.73 s > Starting 0 tests across 1 binary
  261. 41.73 s > ------------
  262. 41.73 s > Summary [ 0.007s] 0 tests run: 0 passed, 0 skipped
  263. 41.73 s >
  264. 41.73 s > ========== nextest test summary ==========
  265. 41.73 s > report: target/nextest/ci_gammaloop/junit.xml
  266. 41.73 s > tests: 0, failures: 0, errors: 0
  267. 41.73 s > No failing testcases found.
  268. 41.73 s > =========================================
  269. 41.73 s > Extracting 5 binaries (including 1 non-test binary), 1 build script output directory, and 2 linked paths to /build/source
  270. 41.73 s > Extracted 20 files to /build/source in 0.84s
  271. 41.73 s > ------------
  272. 41.73 s > Nextest run ID 2ae02504-1bfe-4d1c-894a-cb64a4ddf613 with nextest profile: ci_gammaloop
  273. 41.73 s > Starting 456 tests across 4 binaries (61 tests skipped, including 60 tests via profile.ci_gammaloop.default-filter)
  274. 41.73 s > ------------
  275. 41.73 s > Summary [ 14.106s] 456 tests run: 456 passed, 61 skipped
  276. 41.73 s >
  277. 41.73 s > ========== nextest test summary ==========
  278. 41.73 s > report: target/nextest/ci_gammaloop/junit.xml
  279. 41.73 s > tests: 456, failures: 0, errors: 0
  280. 41.73 s > No failing testcases found.
  281. 41.73 s > =========================================
  282. 41.73 s For full logs, run:
  283. 41.73 s nix log /nix/store/02car8gk7i8dx2vfklks1bn8vxkmhh2r-gammaloop-nextest-core.drv
  284. 41.88 s Run failed.