test packages.x86_64-linux.nix-ci-check-gammaloop-nextest-docs

Reproduce this run
Retry Run
  1. 0.00 s $ /nix/store/9ypz3flqsrl5xl495mm8h645gadjsxi1-coreutils-9.11/bin/timeout --kill-after=15s 7200s /nix/store/23zk8sgzamrbmj1fday15szf7f2279s8-nix-2.34.7/bin/nix --extra-experimental-features nix-command --extra-experimental-features flakes flake clone git+https://github.com/alphal00p/gammaloop --dest /tmp/nix-ci-worker/stable-pwd/repo/
  2. 0.07 s Cloning into '/tmp/nix-ci-worker/stable-pwd/repo'...
  3. 0.86 s remote: Enumerating objects: 87989, done.
  4. 0.98 s remote: Counting objects: 0% (1/10587) remote: Counting objects: 1% (106/10587) remote: Counting objects: 2% (212/10587) remote: Counting objects: 3% (318/10587) remote: Counting objects: 4% (424/10587) remote: Counting objects: 5% (530/10587) remote: Counting objects: 6% (636/10587) remote: Counting objects: 7% (742/10587) remote: Counting objects: 8% (847/10587) remote: Counting objects: 9% (953/10587) remote: Counting objects: 10% (1059/10587) remote: Counting objects: 11% (1165/10587) remote: Counting objects: 12% (1271/10587) remote: Counting objects: 13% (1377/10587) remote: Counting objects: 14% (1483/10587) remote: Counting objects: 15% (1589/10587) remote: Counting objects: 16% (1694/10587) remote: Counting objects: 17% (1800/10587) remote: Counting objects: 18% (1906/10587) remote: Counting objects: 19% (2012/10587) remote: Counting objects: 20% (2118/10587) remote: Counting objects: 21% (2224/10587) remote: Counting objects: 22% (2330/10587) remote: Counting objects: 23% (2436/10587) remote: Counting objects: 24% (2541/10587) remote: Counting objects: 25% (2647/10587) remote: Counting objects: 26% (2753/10587) remote: Counting objects: 27% (2859/10587) remote: Counting objects: 28% (2965/10587) remote: Counting objects: 29% (3071/10587) remote: Counting objects: 30% (3177/10587) remote: Counting objects: 31% (3282/10587) remote: Counting objects: 32% (3388/10587) remote: Counting objects: 33% (3494/10587) remote: Counting objects: 34% (3600/10587) remote: Counting objects: 35% (3706/10587) remote: Counting objects: 36% (3812/10587) remote: Counting objects: 37% (3918/10587) remote: Counting objects: 38% (4024/10587) remote: Counting objects: 39% (4129/10587) remote: Counting objects: 40% (4235/10587) remote: Counting objects: 41% (4341/10587) remote: Counting objects: 42% (4447/10587) remote: Counting objects: 43% (4553/10587) remote: Counting objects: 44% (4659/10587) remote: Counting objects: 45% (4765/10587) remote: Counting objects: 46% (4871/10587) remote: Counting objects: 47% (4976/10587) remote: Counting objects: 48% (5082/10587) remote: Counting objects: 49% (5188/10587) remote: Counting objects: 50% (5294/10587) remote: Counting objects: 51% (5400/10587) remote: Counting objects: 52% (5506/10587) remote: Counting objects: 53% (5612/10587) remote: Counting objects: 54% (5717/10587) remote: Counting objects: 55% (5823/10587) remote: Counting objects: 56% (5929/10587) remote: Counting objects: 57% (6035/10587) remote: Counting objects: 58% (6141/10587) remote: Counting objects: 59% (6247/10587) remote: Counting objects: 60% (6353/10587) remote: Counting objects: 61% (6459/10587) remote: Counting objects: 62% (6564/10587) remote: Counting objects: 63% (6670/10587) remote: Counting objects: 64% (6776/10587) remote: Counting objects: 65% (6882/10587) remote: Counting objects: 66% (6988/10587) remote: Counting objects: 67% (7094/10587) remote: Counting objects: 68% (7200/10587) remote: Counting objects: 69% (7306/10587) remote: Counting objects: 70% (7411/10587) remote: Counting objects: 71% (7517/10587) remote: Counting objects: 72% (7623/10587) remote: Counting objects: 73% (7729/10587) remote: Counting objects: 74% (7835/10587) remote: Counting objects: 75% (7941/10587) remote: Counting objects: 76% (8047/10587) remote: Counting objects: 77% (8152/10587) remote: Counting objects: 78% (8258/10587) remote: Counting objects: 79% (8364/10587) remote: Counting objects: 80% (8470/10587) remote: Counting objects: 81% (8576/10587) remote: Counting objects: 82% (8682/10587) remote: Counting objects: 83% (8788/10587) remote: Counting objects: 84% (8894/10587) remote: Counting objects: 85% (8999/10587) remote: Counting objects: 86% (9105/10587) remote: Counting objects: 87% (9211/10587) remote: Counting objects: 88% (9317/10587) remote: Counting objects: 89% (9423/10587) remote: Counting objects: 90% (9529/10587) remote: Counting objects: 91% (9635/10587) remote: Counting objects: 92% (9741/10587) remote: Counting objects: 93% (9846/10587) remote: Counting objects: 94% (9952/10587) remote: Counting objects: 95% (10058/10587) remote: Counting objects: 96% (10164/10587) remote: Counting objects: 97% (10270/10587) remote: Counting objects: 98% (10376/10587) remote: Counting objects: 99% (10482/10587) remote: Counting objects: 100% (10587/10587) remote: Counting objects: 100% (10587/10587), done.
  5. 3.81 s remote: Compressing objects: 0% (1/2956) remote: Compressing objects: 1% (30/2956) remote: Compressing objects: 2% (60/2956) remote: Compressing objects: 3% (89/2956) remote: Compressing objects: 4% (119/2956) remote: Compressing objects: 5% (148/2956) remote: Compressing objects: 6% (178/2956) remote: Compressing objects: 7% (207/2956) remote: Compressing objects: 8% (237/2956) remote: Compressing objects: 9% (267/2956) remote: Compressing objects: 10% (296/2956) remote: Compressing objects: 11% (326/2956) remote: Compressing objects: 12% (355/2956) remote: Compressing objects: 13% (385/2956) remote: Compressing objects: 14% (414/2956) remote: Compressing objects: 15% (444/2956) remote: Compressing objects: 16% (473/2956) remote: Compressing objects: 17% (503/2956) remote: Compressing objects: 17% (510/2956) remote: Compressing objects: 18% (533/2956) remote: Compressing objects: 19% (562/2956) remote: Compressing objects: 20% (592/2956) remote: Compressing objects: 21% (621/2956) remote: Compressing objects: 22% (651/2956) remote: Compressing objects: 23% (680/2956) remote: Compressing objects: 24% (710/2956) remote: Compressing objects: 25% (739/2956) remote: Compressing objects: 26% (769/2956) remote: Compressing objects: 26% (790/2956) remote: Compressing objects: 27% (799/2956) remote: Compressing objects: 28% (828/2956) remote: Compressing objects: 29% (858/2956) remote: Compressing objects: 30% (887/2956) remote: Compressing objects: 31% (917/2956) remote: Compressing objects: 32% (946/2956) remote: Compressing objects: 33% (976/2956) remote: Compressing objects: 34% (1006/2956) remote: Compressing objects: 35% (1035/2956) remote: Compressing objects: 36% (1065/2956) remote: Compressing objects: 37% (1094/2956) remote: Compressing objects: 38% (1124/2956) remote: Compressing objects: 39% (1153/2956) remote: Compressing objects: 40% (1183/2956) remote: Compressing objects: 41% (1212/2956) remote: Compressing objects: 42% (1242/2956) remote: Compressing objects: 43% (1272/2956) remote: Compressing objects: 44% (1301/2956) remote: Compressing objects: 45% (1331/2956) remote: Compressing objects: 46% (1360/2956) remote: Compressing objects: 47% (1390/2956) remote: Compressing objects: 48% (1419/2956) remote: Compressing objects: 49% (1449/2956) remote: Compressing objects: 50% (1478/2956) remote: Compressing objects: 51% (1508/2956) remote: Compressing objects: 52% (1538/2956) remote: Compressing objects: 53% (1567/2956) remote: Compressing objects: 54% (1597/2956) remote: Compressing objects: 55% (1626/2956) remote: Compressing objects: 56% (1656/2956) remote: Compressing objects: 57% (1685/2956) remote: Compressing objects: 58% (1715/2956) remote: Compressing objects: 59% (1745/2956) remote: Compressing objects: 60% (1774/2956) remote: Compressing objects: 61% (1804/2956) remote: Compressing objects: 62% (1833/2956) remote: Compressing objects: 63% (1863/2956) remote: Compressing objects: 64% (1892/2956) remote: Compressing objects: 65% (1922/2956) remote: Compressing objects: 66% (1951/2956) remote: Compressing objects: 67% (1981/2956) remote: Compressing objects: 68% (2011/2956) remote: Compressing objects: 69% (2040/2956) remote: Compressing objects: 70% (2070/2956) remote: Compressing objects: 71% (2099/2956) remote: Compressing objects: 72% (2129/2956) remote: Compressing objects: 73% (2158/2956) remote: Compressing objects: 74% (2188/2956) remote: Compressing objects: 75% (2217/2956) remote: Compressing objects: 76% (2247/2956) remote: Compressing objects: 77% (2277/2956) remote: Compressing objects: 78% (2306/2956) remote: Compressing objects: 79% (2336/2956) remote: Compressing objects: 80% (2365/2956) remote: Compressing objects: 81% (2395/2956) remote: Compressing objects: 82% (2424/2956) remote: Compressing objects: 83% (2454/2956) remote: Compressing objects: 84% (2484/2956) remote: Compressing objects: 85% (2513/2956) remote: Compressing objects: 86% (2543/2956) remote: Compressing objects: 87% (2572/2956) remote: Compressing objects: 88% (2602/2956) remote: Compressing objects: 89% (2631/2956) remote: Compressing objects: 90% (2661/2956) remote: Compressing objects: 91% (2690/2956) remote: Compressing objects: 92% (2720/2956) remote: Compressing objects: 93% (2750/2956) remote: Compressing objects: 94% (2779/2956) remote: Compressing objects: 95% (2809/2956) remote: Compressing objects: 96% (2838/2956) remote: Compressing objects: 97% (2868/2956) remote: Compressing objects: 98% (2897/2956) remote: Compressing objects: 99% (2927/2956) remote: Compressing objects: 100% (2956/2956) remote: Compressing objects: 100% (2956/2956), done.
  6. 11.00 s Receiving objects: 0% (1/87989) Receiving objects: 1% (880/87989) Receiving objects: 2% (1760/87989) Receiving objects: 3% (2640/87989) Receiving objects: 4% (3520/87989) Receiving objects: 5% (4400/87989) Receiving objects: 6% (5280/87989), 9.30 MiB | 18.59 MiB/s Receiving objects: 7% (6160/87989), 9.30 MiB | 18.59 MiB/s Receiving objects: 8% (7040/87989), 9.30 MiB | 18.59 MiB/s Receiving objects: 9% (7920/87989), 9.30 MiB | 18.59 MiB/s Receiving objects: 10% (8799/87989), 9.30 MiB | 18.59 MiB/s Receiving objects: 11% (9679/87989), 9.30 MiB | 18.59 MiB/s Receiving objects: 12% (10559/87989), 9.30 MiB | 18.59 MiB/s Receiving objects: 13% (11439/87989), 9.30 MiB | 18.59 MiB/s Receiving objects: 14% (12319/87989), 9.30 MiB | 18.59 MiB/s Receiving objects: 15% (13199/87989), 9.30 MiB | 18.59 MiB/s Receiving objects: 16% (14079/87989), 9.30 MiB | 18.59 MiB/s Receiving objects: 17% (14959/87989), 9.30 MiB | 18.59 MiB/s Receiving objects: 18% (15839/87989), 9.30 MiB | 18.59 MiB/s Receiving objects: 19% (16718/87989), 9.30 MiB | 18.59 MiB/s Receiving objects: 20% (17598/87989), 9.30 MiB | 18.59 MiB/s Receiving objects: 21% (18478/87989), 9.30 MiB | 18.59 MiB/s Receiving objects: 22% (19358/87989), 9.30 MiB | 18.59 MiB/s Receiving objects: 23% (20238/87989), 9.30 MiB | 18.59 MiB/s Receiving objects: 24% (21118/87989), 9.30 MiB | 18.59 MiB/s Receiving objects: 25% (21998/87989), 9.30 MiB | 18.59 MiB/s Receiving objects: 26% (22878/87989), 9.30 MiB | 18.59 MiB/s Receiving objects: 27% (23758/87989), 9.30 MiB | 18.59 MiB/s Receiving objects: 28% (24637/87989), 9.30 MiB | 18.59 MiB/s Receiving objects: 29% (25517/87989), 9.30 MiB | 18.59 MiB/s Receiving objects: 30% (26397/87989), 9.30 MiB | 18.59 MiB/s Receiving objects: 31% (27277/87989), 9.30 MiB | 18.59 MiB/s Receiving objects: 32% (28157/87989), 9.30 MiB | 18.59 MiB/s Receiving objects: 33% (29037/87989), 9.30 MiB | 18.59 MiB/s Receiving objects: 34% (29917/87989), 9.30 MiB | 18.59 MiB/s Receiving objects: 35% (30797/87989), 9.30 MiB | 18.59 MiB/s Receiving objects: 35% (31444/87989), 28.61 MiB | 28.58 MiB/s Receiving objects: 36% (31677/87989), 28.61 MiB | 28.58 MiB/s Receiving objects: 37% (32556/87989), 28.61 MiB | 28.58 MiB/s Receiving objects: 38% (33436/87989), 28.61 MiB | 28.58 MiB/s Receiving objects: 39% (34316/87989), 28.61 MiB | 28.58 MiB/s Receiving objects: 40% (35196/87989), 28.61 MiB | 28.58 MiB/s Receiving objects: 41% (36076/87989), 28.61 MiB | 28.58 MiB/s Receiving objects: 42% (36956/87989), 28.61 MiB | 28.58 MiB/s Receiving objects: 43% (37836/87989), 28.61 MiB | 28.58 MiB/s Receiving objects: 44% (38716/87989), 28.61 MiB | 28.58 MiB/s Receiving objects: 45% (39596/87989), 44.89 MiB | 29.81 MiB/s Receiving objects: 46% (40475/87989), 44.89 MiB | 29.81 MiB/s Receiving objects: 47% (41355/87989), 44.89 MiB | 29.81 MiB/s Receiving objects: 48% (42235/87989), 44.89 MiB | 29.81 MiB/s Receiving objects: 49% (43115/87989), 44.89 MiB | 29.81 MiB/s Receiving objects: 50% (43995/87989), 44.89 MiB | 29.81 MiB/s Receiving objects: 51% (44875/87989), 44.89 MiB | 29.81 MiB/s Receiving objects: 52% (45755/87989), 44.89 MiB | 29.81 MiB/s Receiving objects: 53% (46635/87989), 44.89 MiB | 29.81 MiB/s Receiving objects: 53% (47462/87989), 44.89 MiB | 29.81 MiB/s Receiving objects: 54% (47515/87989), 44.89 MiB | 29.81 MiB/s Receiving objects: 55% (48394/87989), 60.21 MiB | 30.01 MiB/s Receiving objects: 56% (49274/87989), 60.21 MiB | 30.01 MiB/s Receiving objects: 57% (50154/87989), 60.21 MiB | 30.01 MiB/s Receiving objects: 58% (51034/87989), 60.21 MiB | 30.01 MiB/s Receiving objects: 59% (51914/87989), 60.21 MiB | 30.01 MiB/s Receiving objects: 60% (52794/87989), 75.32 MiB | 30.05 MiB/s Receiving objects: 61% (53674/87989), 75.32 MiB | 30.05 MiB/s Receiving objects: 62% (54554/87989), 75.32 MiB | 30.05 MiB/s Receiving objects: 63% (55434/87989), 75.32 MiB | 30.05 MiB/s Receiving objects: 64% (56313/87989), 75.32 MiB | 30.05 MiB/s Receiving objects: 65% (57193/87989), 75.32 MiB | 30.05 MiB/s Receiving objects: 65% (57319/87989), 86.82 MiB | 28.88 MiB/s Receiving objects: 66% (58073/87989), 96.54 MiB | 27.53 MiB/s Receiving objects: 66% (58501/87989), 96.54 MiB | 27.53 MiB/s Receiving objects: 67% (58953/87989), 106.71 MiB | 26.63 MiB/s Receiving objects: 68% (59833/87989), 106.71 MiB | 26.63 MiB/s Receiving objects: 69% (60713/87989), 106.71 MiB | 26.63 MiB/s Receiving objects: 70% (61593/87989), 106.71 MiB | 26.63 MiB/s Receiving objects: 71% (62473/87989), 106.71 MiB | 26.63 MiB/s Receiving objects: 72% (63353/87989), 117.25 MiB | 26.01 MiB/s Receiving objects: 73% (64232/87989), 117.25 MiB | 26.01 MiB/s Receiving objects: 73% (64272/87989), 127.89 MiB | 26.31 MiB/s Receiving objects: 74% (65112/87989), 127.89 MiB | 26.31 MiB/s Receiving objects: 75% (65992/87989), 127.89 MiB | 26.31 MiB/s Receiving objects: 76% (66872/87989), 127.89 MiB | 26.31 MiB/s Receiving objects: 77% (67752/87989), 127.89 MiB | 26.31 MiB/s Receiving objects: 78% (68632/87989), 127.89 MiB | 26.31 MiB/s Receiving objects: 79% (69512/87989), 127.89 MiB | 26.31 MiB/s Receiving objects: 80% (70392/87989), 127.89 MiB | 26.31 MiB/s Receiving objects: 81% (71272/87989), 127.89 MiB | 26.31 MiB/s Receiving objects: 82% (72151/87989), 127.89 MiB | 26.31 MiB/s Receiving objects: 83% (73031/87989), 127.89 MiB | 26.31 MiB/s Receiving objects: 84% (73911/87989), 139.03 MiB | 24.50 MiB/s Receiving objects: 85% (74791/87989), 139.03 MiB | 24.50 MiB/s Receiving objects: 86% (75671/87989), 139.03 MiB | 24.50 MiB/s Receiving objects: 87% (76551/87989), 139.03 MiB | 24.50 MiB/s Receiving objects: 87% (77339/87989), 139.03 MiB | 24.50 MiB/s Receiving objects: 88% (77431/87989), 149.92 MiB | 23.33 MiB/s Receiving objects: 89% (78311/87989), 149.92 MiB | 23.33 MiB/s Receiving objects: 90% (79191/87989), 149.92 MiB | 23.33 MiB/s Receiving objects: 91% (80070/87989), 149.92 MiB | 23.33 MiB/s Receiving objects: 92% (80950/87989), 149.92 MiB | 23.33 MiB/s Receiving objects: 93% (81830/87989), 149.92 MiB | 23.33 MiB/s Receiving objects: 94% (82710/87989), 149.92 MiB | 23.33 MiB/s Receiving objects: 95% (83590/87989), 149.92 MiB | 23.33 MiB/s Receiving objects: 96% (84470/87989), 149.92 MiB | 23.33 MiB/s Receiving objects: 97% (85350/87989), 149.92 MiB | 23.33 MiB/s Receiving objects: 98% (86230/87989), 149.92 MiB | 23.33 MiB/s Receiving objects: 98% (86800/87989), 173.09 MiB | 21.72 MiB/s Receiving objects: 99% (87110/87989), 173.09 MiB | 21.72 MiB/s remote: Total 87989 (delta 8644), reused 8407 (delta 7605), pack-reused 77402 (from 3)
  7. 11.00 s Receiving objects: 100% (87989/87989), 173.09 MiB | 21.72 MiB/s Receiving objects: 100% (87989/87989), 176.53 MiB | 24.67 MiB/s, done.
  8. 12.00 s Resolving deltas: 0% (0/59509) Resolving deltas: 1% (596/59509) Resolving deltas: 2% (1191/59509) Resolving deltas: 3% (1786/59509) Resolving deltas: 4% (2381/59509) Resolving deltas: 5% (2976/59509) Resolving deltas: 6% (3571/59509) Resolving deltas: 7% (4166/59509) Resolving deltas: 8% (4762/59509) Resolving deltas: 9% (5356/59509) Resolving deltas: 10% (5951/59509) Resolving deltas: 11% (6546/59509) Resolving deltas: 12% (7142/59509) Resolving deltas: 13% (7737/59509) Resolving deltas: 14% (8332/59509) Resolving deltas: 15% (8927/59509) Resolving deltas: 16% (9523/59509) Resolving deltas: 17% (10117/59509) Resolving deltas: 18% (10712/59509) Resolving deltas: 19% (11310/59509) Resolving deltas: 20% (11902/59509) Resolving deltas: 21% (12497/59509) Resolving deltas: 22% (13092/59509) Resolving deltas: 23% (13688/59509) Resolving deltas: 24% (14283/59509) Resolving deltas: 25% (14878/59509) Resolving deltas: 26% (15473/59509) Resolving deltas: 27% (16068/59509) Resolving deltas: 28% (16663/59509) Resolving deltas: 29% (17258/59509) Resolving deltas: 30% (17853/59509) Resolving deltas: 31% (18448/59509) Resolving deltas: 32% (19043/59509) Resolving deltas: 33% (19638/59509) Resolving deltas: 34% (20234/59509) Resolving deltas: 35% (20829/59509) Resolving deltas: 36% (21424/59509) Resolving deltas: 37% (22020/59509) Resolving deltas: 38% (22616/59509) Resolving deltas: 39% (23209/59509) Resolving deltas: 40% (23804/59509) Resolving deltas: 41% (24399/59509) Resolving deltas: 42% (24996/59509) Resolving deltas: 43% (25589/59509) Resolving deltas: 44% (26184/59509) Resolving deltas: 45% (26780/59509) Resolving deltas: 46% (27375/59509) Resolving deltas: 47% (27970/59509) Resolving deltas: 48% (28566/59509) Resolving deltas: 49% (29160/59509) Resolving deltas: 50% (29755/59509) Resolving deltas: 51% (30350/59509) Resolving deltas: 52% (30948/59509) Resolving deltas: 53% (31541/59509) Resolving deltas: 54% (32135/59509) Resolving deltas: 55% (32730/59509) Resolving deltas: 56% (33326/59509) Resolving deltas: 57% (33921/59509) Resolving deltas: 58% (34516/59509) Resolving deltas: 59% (35111/59509) Resolving deltas: 60% (35706/59509) Resolving deltas: 61% (36301/59509) Resolving deltas: 62% (36896/59509) Resolving deltas: 63% (37491/59509) Resolving deltas: 64% (38086/59509) Resolving deltas: 65% (38681/59509) Resolving deltas: 66% (39276/59509) Resolving deltas: 67% (39873/59509) Resolving deltas: 68% (40467/59509) Resolving deltas: 69% (41064/59509) Resolving deltas: 70% (41658/59509) Resolving deltas: 71% (42252/59509) Resolving deltas: 72% (42847/59509) Resolving deltas: 73% (43443/59509) Resolving deltas: 74% (44037/59509) Resolving deltas: 75% (44633/59509) Resolving deltas: 76% (45228/59509) Resolving deltas: 77% (45822/59509) Resolving deltas: 78% (46420/59509) Resolving deltas: 79% (47013/59509) Resolving deltas: 80% (47608/59509) Resolving deltas: 81% (48203/59509) Resolving deltas: 82% (48798/59509) Resolving deltas: 83% (49394/59509) Resolving deltas: 84% (49988/59509) Resolving deltas: 85% (50584/59509) Resolving deltas: 86% (51178/59509) Resolving deltas: 87% (51773/59509) Resolving deltas: 88% (52368/59509) Resolving deltas: 89% (52965/59509) Resolving deltas: 90% (53559/59509) Resolving deltas: 91% (54154/59509) Resolving deltas: 92% (54749/59509) Resolving deltas: 93% (55344/59509) Resolving deltas: 94% (55939/59509) Resolving deltas: 95% (56534/59509) Resolving deltas: 96% (57129/59509) Resolving deltas: 97% (57724/59509) Resolving deltas: 98% (58319/59509) Resolving deltas: 99% (58914/59509) Resolving deltas: 100% (59509/59509) Resolving deltas: 100% (59509/59509), done.
  9. 12.43 s Fetching commit 891dec7c25b5d9026c099da021ec7ae3b757dee9 for codex/docs-before-consolidation-20260914 ...
  10. 12.43 s $ /nix/store/bcnisk3ydfgv26v2gw3zlky24g00yww2-git-2.54.0/bin/git fetch origin 891dec7c25b5d9026c099da021ec7ae3b757dee9
  11. 12.92 s From https://github.com/alphal00p/gammaloop
  12. 12.92 s * branch 891dec7c25b5d9026c099da021ec7ae3b757dee9 -> FETCH_HEAD
  13. 12.93 s $ /nix/store/9ypz3flqsrl5xl495mm8h645gadjsxi1-coreutils-9.11/bin/timeout --kill-after=15s 7200s /nix/store/bcnisk3ydfgv26v2gw3zlky24g00yww2-git-2.54.0/bin/git -c advice.detachedHead=false checkout 891dec7c25b5d9026c099da021ec7ae3b757dee9
  14. 13.14 s HEAD is now at 891dec7c2 change photos
  15. 13.14 s $ /nix/store/9ypz3flqsrl5xl495mm8h645gadjsxi1-coreutils-9.11/bin/timeout --kill-after=15s 7200s /nix/store/23zk8sgzamrbmj1fday15szf7f2279s8-nix-2.34.7/bin/nix --extra-experimental-features nix-command --extra-experimental-features flakes --log-format internal-json run .#packages.x86_64-linux.nix-ci-check-gammaloop-nextest-docs --print-build-logs
  16. 17.32 s
  17. 17.63 s Downloading cached gammaloop-nextest-binaries-docs-alphal00p-docs-builder from https://cache.nix-ci.com
  18. 17.63 s Downloading cached gammaloop-nextest-binaries-docs-alphal00p-docs-catalogs from https://cache.nix-ci.com
  19. 17.63 s Downloading cached gammaloop-nextest-binaries-docs-alphal00p-docs-examples from https://cache.nix-ci.com
  20. 17.63 s Downloading cached gammaloop-nextest-binaries-docs-alphal00p-docs-macros from https://cache.nix-ci.com
  21. 17.63 s Downloading cached gammaloop-nextest-binaries-docs-alphal00p-docs-python-exporter from https://cache.nix-ci.com
  22. 17.63 s Downloading cached gammaloop-nextest-binaries-docs-alphal00p-docs-schema from https://cache.nix-ci.com
  23. 18.70 s Downloaded cached gammaloop-nextest-binaries-docs-alphal00p-docs-macros (3.7 MiB) in 1.0s
  24. 18.70 s Progress: 0 of 1 built, 1 of 8 downloaded from cache (5 downloading)
  25. 19.38 s Downloaded cached gammaloop-nextest-binaries-docs-alphal00p-docs-python-exporter (2.2 MiB) in 1.7s
  26. 19.38 s Progress: 0 of 1 built, 2 of 8 downloaded from cache (4 downloading)
  27. 19.39 s Downloaded cached gammaloop-nextest-binaries-docs-alphal00p-docs-schema (2.4 MiB) in 1.7s
  28. 19.39 s Progress: 0 of 1 built, 3 of 8 downloaded from cache (3 downloading)
  29. 19.42 s Downloaded cached gammaloop-nextest-binaries-docs-alphal00p-docs-catalogs (2.8 MiB) in 1.7s
  30. 19.42 s Progress: 0 of 1 built, 4 of 8 downloaded from cache (2 downloading)
  31. 19.47 s Downloaded cached gammaloop-nextest-binaries-docs-alphal00p-docs-builder (4.9 MiB) in 1.8s
  32. 19.47 s Progress: 0 of 1 built, 5 of 8 downloaded from cache (1 downloading)
  33. 20.12 s Downloaded cached gammaloop-nextest-binaries-docs-alphal00p-docs-examples (34.2 MiB) in 2.4s
  34. 20.12 s Progress: 0 of 1 built, 6 of 8 downloaded from cache
  35. 20.12 s Downloading cached gammaloop-nextest-binaries-docs from https://cache.nix-ci.com
  36. 20.79 s Downloaded cached gammaloop-nextest-binaries-docs (2472 B) in 667ms
  37. 20.79 s Progress: 0 of 1 built, 7 of 8 downloaded from cache
  38. 20.79 s Downloading cached nix-ci-check-gammaloop-nextest-docs from https://cache.nix-ci.com
  39. 21.81 s Downloaded cached nix-ci-check-gammaloop-nextest-docs (1016 B) in 1.0s
  40. 21.81 s Progress: 0 of 1 built, 8 of 8 downloaded from cache
  41. 29.45 s evaluating derivation 'g copying '/nix/store/bgss evaluating derivation 'g copying '/nix/store/bgss evaluating derivation 'g copying '/nix/store/bgss evaluating derivation 'g copying '/nix/store/bgss evaluating derivation 'g copying '/nix/store/bgss evaluating derivation 'g querying gammaloop-nexte querying info about miss querying gammaloop-nexte [0.0 KiB DL] querying in [3.4 KiB DL] querying bl [8.6 KiB DL] querying pe [27.0 KiB DL] querying l [0/4 built, 16/0/52 copi [0/4 built, 16/4/48 copi [0/4 built, 13/15/48 cop [0/4 built, 6/27/48 copi [0/4 built, 4/33/48 copi [0/4 built, 6/35/48 copi [0/4 built, 4/39/48 copi [0/4 built, 3/41/48 copi [0/4 built, 3/42/48 copi [0/4 built, 3/44/48 copi [0/4 built, 2/45/48 copi [0/4 built, 2/46/48 copi [0/3 built, 1/47/48 copipython3> structuredAttrs is enabled
  42. 29.52 s [1/0/2 built, 48 copied python3> created 227 symlinks in user environment
  43. 30.39 s python3 (post)> Uploading to the NixCI cache: /nix/store/v67wpyflacy0i2gvzasrxvw2gkz4mr12-python3-3.13.15-env
  44. 30.43 s python3 (post)> warning: 'warn-short-path-literals' is deprecated, use 'lint-short-path-literals = ignore' instead
  45. 30.55 s python3 (post)> copying 0 paths...
  46. 30.60 s python3 (post)> warning: 'warn-short-path-literals' is deprecated, use 'lint-short-path-literals = ignore' instead
  47. 30.86 s python3 (post)> copying 0 paths...
  48. 31.35 s [1/3 built, 48 copied (2 [1/1/2 built, 48 copied gammaloop-nextest-docs> Extracting 2 binaries to /build/source
  49. 31.39 s gammaloop-nextest-docs> Extracted 5 files to /build/source in 0.04s
  50. 31.40 s gammaloop-nextest-docs> ------------
  51. 31.40 s gammaloop-nextest-docs> Nextest run ID 9357db49-7b2d-4f5e-8842-dc003f134bb4 with nextest profile: ci_gammaloop
  52. 31.40 s gammaloop-nextest-docs> Starting 129 tests across 2 binaries
  53. 57.87 s gammaloop-nextest-docs> FAIL [ 26.469s] (128/129) alphal00p-docs-builder provenance_tests::each_build_captures_one_revision_before_rendering
  54. 57.87 s gammaloop-nextest-docs> stdout ---
  55. 57.87 s gammaloop-nextest-docs>
  56. 57.87 s gammaloop-nextest-docs> running 1 test
  57. 57.87 s gammaloop-nextest-docs>
  58. 57.87 s gammaloop-nextest-docs> running 1 test
  59. 57.87 s gammaloop-nextest-docs> test provenance_tests::each_build_captures_one_revision_before_rendering ... FAILED
  60. 57.87 s gammaloop-nextest-docs>
  61. 57.87 s gammaloop-nextest-docs> failures:
  62. 57.87 s gammaloop-nextest-docs>
  63. 57.87 s gammaloop-nextest-docs> failures:
  64. 57.87 s gammaloop-nextest-docs> provenance_tests::each_build_captures_one_revision_before_rendering
  65. 57.87 s gammaloop-nextest-docs>
  66. 57.87 s gammaloop-nextest-docs> test result: FAILED. 0 passed; 1 failed; 0 ignored; 0 measured; 128 filtered out; finished in 26.42s
  67. 57.87 s gammaloop-nextest-docs>
  68. 57.87 s gammaloop-nextest-docs> test provenance_tests::each_build_captures_one_revision_before_rendering ... FAILED
  69. 57.87 s gammaloop-nextest-docs>
  70. 57.87 s gammaloop-nextest-docs> failures:
  71. 57.87 s gammaloop-nextest-docs>
  72. 57.87 s gammaloop-nextest-docs> failures:
  73. 57.87 s gammaloop-nextest-docs> provenance_tests::each_build_captures_one_revision_before_rendering
  74. 57.87 s gammaloop-nextest-docs>
  75. 57.87 s gammaloop-nextest-docs> test result: FAILED. 0 passed; 1 failed; 0 ignored; 0 measured; 128 filtered out; finished in 26.46s
  76. 57.87 s gammaloop-nextest-docs>
  77. 57.87 s gammaloop-nextest-docs> stderr ---
  78. 57.87 s gammaloop-nextest-docs> warning: bundle export is experimental
  79. 57.87 s gammaloop-nextest-docs> = hint: its behaviour may change at any time
  80. 57.87 s gammaloop-nextest-docs> = hint: do not rely on this feature for production use cases
  81. 57.87 s gammaloop-nextest-docs>
  82. 57.87 s gammaloop-nextest-docs> warning: unknown font family: roboto
  83. 57.87 s gammaloop-nextest-docs> ┌─ crates/linnest/typst/docs/manual.typ:11:28
  84. 57.87 s gammaloop-nextest-docs> │
  85. 57.87 s gammaloop-nextest-docs> 11 │ #set text(size: 10pt, font: "Roboto")
  86. 57.87 s gammaloop-nextest-docs> │ ^^^^^^^^
  87. 57.87 s gammaloop-nextest-docs>
  88. 57.87 s gammaloop-nextest-docs> warning: unknown font family: roboto
  89. 57.87 s gammaloop-nextest-docs> ┌─ crates/linnest/typst/docs/manual.typ:14:29
  90. 57.87 s gammaloop-nextest-docs> │
  91. 57.87 s gammaloop-nextest-docs> 14 │ #set text(size: 3em, font: "Roboto")
  92. 57.87 s gammaloop-nextest-docs> │ ^^^^^^^^
  93. 57.87 s gammaloop-nextest-docs>
  94. 57.87 s gammaloop-nextest-docs> warning: unknown font family: roboto
  95. 57.87 s gammaloop-nextest-docs> ┌─ crates/linnest/typst/docs/manual.typ:16:31
  96. 57.87 s gammaloop-nextest-docs> │
  97. 57.87 s gammaloop-nextest-docs> 16 │ #set text(size: 0.3em, font: "Roboto")
  98. 57.87 s gammaloop-nextest-docs> │ ^^^^^^^^
  99. 57.87 s gammaloop-nextest-docs>
  100. 57.87 s gammaloop-nextest-docs> warning: overline was ignored during MathML export
  101. 57.87 s gammaloop-nextest-docs> ┌─ crates/linnest/typst/docs/manual.typ:949:55
  102. 57.87 s gammaloop-nextest-docs> │
  103. 57.87 s gammaloop-nextest-docs> 949 │ + sum_("dangling" e) c_("dangling-centroid") / (d(e, overline(v)) + epsilon)
  104. 57.87 s gammaloop-nextest-docs> │ ^^^^^^^^^^^
  105. 57.87 s gammaloop-nextest-docs>
  106. 57.87 s gammaloop-nextest-docs> warning: overline was ignored during MathML export
  107. 57.87 s gammaloop-nextest-docs> ┌─ crates/linnest/typst/docs/manual.typ:953:8
  108. 57.87 s gammaloop-nextest-docs> │
  109. 57.87 s gammaloop-nextest-docs> 953 │ Here $overline(v)$ is the mean node position. The centroid term pushes every
  110. 57.87 s gammaloop-nextest-docs> │ ^^^^^^^^^^^
  111. 57.87 s gammaloop-nextest-docs>
  112. 57.87 s gammaloop-nextest-docs>
  113. 57.87 s gammaloop-nextest-docs> thread 'provenance_tests::each_build_captures_one_revision_before_rendering' (247) panicked at crates/alphal00p-docs-builder/src/provenance_tests.rs:297:14:
  114. 57.87 s gammaloop-nextest-docs> called `Result::unwrap()` on an `Err` value: generated site has broken links:
  115. 57.87 s gammaloop-nextest-docs> products/linnet/latest/reference/interfaces/index.html -> https://github.com/alphal00p/gammaloop/blob/1111111111111111111111111111111111111111/crates/linnet-py/examples/physics_render_settings.py (missing repository source file crates/linnet-py/examples/physics_render_settings.py)
  116. 57.87 s gammaloop-nextest-docs> products/linnet/latest/reference/interfaces/index.html -> https://github.com/alphal00p/gammaloop/blob/1111111111111111111111111111111111111111/crates/linnet-py/examples/layout_stream.py (missing repository source file crates/linnet-py/examples/layout_stream.py)
  117. 57.87 s gammaloop-nextest-docs> products/linnet/latest/playground/index.html -> https://github.com/alphal00p/gammaloop/blob/1111111111111111111111111111111111111111/crates/linnet-py/examples/layout_stream.py (missing repository source file crates/linnet-py/examples/layout_stream.py)
  118. 57.87 s gammaloop-nextest-docs> products/linnet/latest/guides/python-rendering/index.html -> https://github.com/alphal00p/gammaloop/blob/1111111111111111111111111111111111111111/crates/linnet-py/examples/rendering_api.py (missing repository source file crates/linnet-py/examples/rendering_api.py)
  119. 57.87 s gammaloop-nextest-docs>
  120. 57.87 s gammaloop-nextest-docs> Location:
  121. 57.87 s gammaloop-nextest-docs> crates/alphal00p-docs-builder/src/lib.rs:4940:9
  122. 57.87 s gammaloop-nextest-docs> stack backtrace:
  123. 57.87 s gammaloop-nextest-docs> 0: __rustc::rust_begin_unwind
  124. 57.87 s gammaloop-nextest-docs> 1: core::panicking::panic_fmt
  125. 57.87 s gammaloop-nextest-docs> 2: core::result::unwrap_failed
  126. 57.87 s gammaloop-nextest-docs> 3: alphal00p_docs_builder::provenance_tests::each_build_captures_one_revision_before_rendering
  127. 57.87 s gammaloop-nextest-docs> 4: <alphal00p_docs_builder::provenance_tests::each_build_captures_one_revision_before_rendering::{closure#0} as core::ops::function::FnOnce<()>>::call_once
  128. 57.87 s gammaloop-nextest-docs> note: Some details are omitted, run with `RUST_BACKTRACE=full` for a verbose backtrace.
  129. 57.87 s gammaloop-nextest-docs>
  130. 57.87 s gammaloop-nextest-docs> thread 'provenance_tests::each_build_captures_one_revision_before_rendering' (182) panicked at crates/alphal00p-docs-builder/src/provenance_tests.rs:274:9:
  131. 57.87 s gammaloop-nextest-docs> assertion failed: command.status().unwrap().success()
  132. 57.87 s gammaloop-nextest-docs> stack backtrace:
  133. 57.87 s gammaloop-nextest-docs> 0: __rustc::rust_begin_unwind
  134. 57.87 s gammaloop-nextest-docs> 1: core::panicking::panic_fmt
  135. 57.87 s gammaloop-nextest-docs> 2: core::panicking::panic
  136. 57.87 s gammaloop-nextest-docs> 3: alphal00p_docs_builder::provenance_tests::each_build_captures_one_revision_before_rendering
  137. 57.87 s gammaloop-nextest-docs> 4: <alphal00p_docs_builder::provenance_tests::each_build_captures_one_revision_before_rendering::{closure#0} as core::ops::function::FnOnce<()>>::call_once
  138. 57.87 s gammaloop-nextest-docs> note: Some details are omitted, run with `RUST_BACKTRACE=full` for a verbose backtrace.
  139. 57.87 s gammaloop-nextest-docs>
  140. 63.35 s gammaloop-nextest-docs> ------------
  141. 63.35 s gammaloop-nextest-docs> Summary [ 31.946s] 129 tests run: 128 passed, 1 failed, 0 skipped
  142. 63.35 s gammaloop-nextest-docs> FAIL [ 26.469s] (128/129) alphal00p-docs-builder provenance_tests::each_build_captures_one_revision_before_rendering
  143. 63.35 s gammaloop-nextest-docs> stdout ---
  144. 63.35 s gammaloop-nextest-docs>
  145. 63.35 s gammaloop-nextest-docs> running 1 test
  146. 63.35 s gammaloop-nextest-docs>
  147. 63.35 s gammaloop-nextest-docs> running 1 test
  148. 63.35 s gammaloop-nextest-docs> test provenance_tests::each_build_captures_one_revision_before_rendering ... FAILED
  149. 63.35 s gammaloop-nextest-docs>
  150. 63.35 s gammaloop-nextest-docs> failures:
  151. 63.35 s gammaloop-nextest-docs>
  152. 63.35 s gammaloop-nextest-docs> failures:
  153. 63.35 s gammaloop-nextest-docs> provenance_tests::each_build_captures_one_revision_before_rendering
  154. 63.35 s gammaloop-nextest-docs>
  155. 63.35 s gammaloop-nextest-docs> test result: FAILED. 0 passed; 1 failed; 0 ignored; 0 measured; 128 filtered out; finished in 26.42s
  156. 63.35 s gammaloop-nextest-docs>
  157. 63.35 s gammaloop-nextest-docs> test provenance_tests::each_build_captures_one_revision_before_rendering ... FAILED
  158. 63.35 s gammaloop-nextest-docs>
  159. 63.35 s gammaloop-nextest-docs> failures:
  160. 63.35 s gammaloop-nextest-docs>
  161. 63.35 s gammaloop-nextest-docs> failures:
  162. 63.35 s gammaloop-nextest-docs> provenance_tests::each_build_captures_one_revision_before_rendering
  163. 63.35 s gammaloop-nextest-docs>
  164. 63.35 s gammaloop-nextest-docs> test result: FAILED. 0 passed; 1 failed; 0 ignored; 0 measured; 128 filtered out; finished in 26.46s
  165. 63.35 s gammaloop-nextest-docs>
  166. 63.35 s gammaloop-nextest-docs> stderr ---
  167. 63.35 s gammaloop-nextest-docs> warning: bundle export is experimental
  168. 63.35 s gammaloop-nextest-docs> = hint: its behaviour may change at any time
  169. 63.35 s gammaloop-nextest-docs> = hint: do not rely on this feature for production use cases
  170. 63.35 s gammaloop-nextest-docs>
  171. 63.35 s gammaloop-nextest-docs> warning: unknown font family: roboto
  172. 63.35 s gammaloop-nextest-docs> ┌─ crates/linnest/typst/docs/manual.typ:11:28
  173. 63.35 s gammaloop-nextest-docs> │
  174. 63.35 s gammaloop-nextest-docs> 11 │ #set text(size: 10pt, font: "Roboto")
  175. 63.35 s gammaloop-nextest-docs> │ ^^^^^^^^
  176. 63.35 s gammaloop-nextest-docs>
  177. 63.35 s gammaloop-nextest-docs> warning: unknown font family: roboto
  178. 63.35 s gammaloop-nextest-docs> ┌─ crates/linnest/typst/docs/manual.typ:14:29
  179. 63.35 s gammaloop-nextest-docs> │
  180. 63.35 s gammaloop-nextest-docs> 14 │ #set text(size: 3em, font: "Roboto")
  181. 63.35 s gammaloop-nextest-docs> │ ^^^^^^^^
  182. 63.35 s gammaloop-nextest-docs>
  183. 63.35 s gammaloop-nextest-docs> warning: unknown font family: roboto
  184. 63.35 s gammaloop-nextest-docs> ┌─ crates/linnest/typst/docs/manual.typ:16:31
  185. 63.35 s gammaloop-nextest-docs> │
  186. 63.35 s gammaloop-nextest-docs> 16 │ #set text(size: 0.3em, font: "Roboto")
  187. 63.35 s gammaloop-nextest-docs> │ ^^^^^^^^
  188. 63.35 s gammaloop-nextest-docs>
  189. 63.35 s gammaloop-nextest-docs> warning: overline was ignored during MathML export
  190. 63.35 s gammaloop-nextest-docs> ┌─ crates/linnest/typst/docs/manual.typ:949:55
  191. 63.35 s gammaloop-nextest-docs> │
  192. 63.35 s gammaloop-nextest-docs> 949 │ + sum_("dangling" e) c_("dangling-centroid") / (d(e, overline(v)) + epsilon)
  193. 63.35 s gammaloop-nextest-docs> │ ^^^^^^^^^^^
  194. 63.35 s gammaloop-nextest-docs>
  195. 63.35 s gammaloop-nextest-docs> warning: overline was ignored during MathML export
  196. 63.35 s gammaloop-nextest-docs> ┌─ crates/linnest/typst/docs/manual.typ:953:8
  197. 63.35 s gammaloop-nextest-docs> │
  198. 63.35 s gammaloop-nextest-docs> 953 │ Here $overline(v)$ is the mean node position. The centroid term pushes every
  199. 63.35 s gammaloop-nextest-docs> │ ^^^^^^^^^^^
  200. 63.35 s gammaloop-nextest-docs>
  201. 63.35 s gammaloop-nextest-docs>
  202. 63.35 s gammaloop-nextest-docs> thread 'provenance_tests::each_build_captures_one_revision_before_rendering' (247) panicked at crates/alphal00p-docs-builder/src/provenance_tests.rs:297:14:
  203. 63.35 s gammaloop-nextest-docs> called `Result::unwrap()` on an `Err` value: generated site has broken links:
  204. 63.35 s gammaloop-nextest-docs> products/linnet/latest/reference/interfaces/index.html -> https://github.com/alphal00p/gammaloop/blob/1111111111111111111111111111111111111111/crates/linnet-py/examples/physics_render_settings.py (missing repository source file crates/linnet-py/examples/physics_render_settings.py)
  205. 63.35 s gammaloop-nextest-docs> products/linnet/latest/reference/interfaces/index.html -> https://github.com/alphal00p/gammaloop/blob/1111111111111111111111111111111111111111/crates/linnet-py/examples/layout_stream.py (missing repository source file crates/linnet-py/examples/layout_stream.py)
  206. 63.35 s gammaloop-nextest-docs> products/linnet/latest/playground/index.html -> https://github.com/alphal00p/gammaloop/blob/1111111111111111111111111111111111111111/crates/linnet-py/examples/layout_stream.py (missing repository source file crates/linnet-py/examples/layout_stream.py)
  207. 63.35 s gammaloop-nextest-docs> products/linnet/latest/guides/python-rendering/index.html -> https://github.com/alphal00p/gammaloop/blob/1111111111111111111111111111111111111111/crates/linnet-py/examples/rendering_api.py (missing repository source file crates/linnet-py/examples/rendering_api.py)
  208. 63.35 s gammaloop-nextest-docs>
  209. 63.35 s gammaloop-nextest-docs> Location:
  210. 63.35 s gammaloop-nextest-docs> crates/alphal00p-docs-builder/src/lib.rs:4940:9
  211. 63.35 s gammaloop-nextest-docs> stack backtrace:
  212. 63.35 s gammaloop-nextest-docs> 0: __rustc::rust_begin_unwind
  213. 63.35 s gammaloop-nextest-docs> 1: core::panicking::panic_fmt
  214. 63.35 s gammaloop-nextest-docs> 2: core::result::unwrap_failed
  215. 63.35 s gammaloop-nextest-docs> 3: alphal00p_docs_builder::provenance_tests::each_build_captures_one_revision_before_rendering
  216. 63.35 s gammaloop-nextest-docs> 4: <alphal00p_docs_builder::provenance_tests::each_build_captures_one_revision_before_rendering::{closure#0} as core::ops::function::FnOnce<()>>::call_once
  217. 63.35 s gammaloop-nextest-docs> note: Some details are omitted, run with `RUST_BACKTRACE=full` for a verbose backtrace.
  218. 63.35 s gammaloop-nextest-docs>
  219. 63.35 s gammaloop-nextest-docs> thread 'provenance_tests::each_build_captures_one_revision_before_rendering' (182) panicked at crates/alphal00p-docs-builder/src/provenance_tests.rs:274:9:
  220. 63.35 s gammaloop-nextest-docs> assertion failed: command.status().unwrap().success()
  221. 63.35 s gammaloop-nextest-docs> stack backtrace:
  222. 63.35 s gammaloop-nextest-docs> 0: __rustc::rust_begin_unwind
  223. 63.35 s gammaloop-nextest-docs> 1: core::panicking::panic_fmt
  224. 63.35 s gammaloop-nextest-docs> 2: core::panicking::panic
  225. 63.35 s gammaloop-nextest-docs> 3: alphal00p_docs_builder::provenance_tests::each_build_captures_one_revision_before_rendering
  226. 63.35 s gammaloop-nextest-docs> 4: <alphal00p_docs_builder::provenance_tests::each_build_captures_one_revision_before_rendering::{closure#0} as core::ops::function::FnOnce<()>>::call_once
  227. 63.35 s gammaloop-nextest-docs> note: Some details are omitted, run with `RUST_BACKTRACE=full` for a verbose backtrace.
  228. 63.35 s gammaloop-nextest-docs>
  229. 63.35 s gammaloop-nextest-docs> error: test run failed
  230. 63.38 s gammaloop-nextest-docs>
  231. 63.38 s gammaloop-nextest-docs> ========== nextest test summary ==========
  232. 63.38 s gammaloop-nextest-docs> report: target/nextest/ci_gammaloop/junit.xml
  233. 63.38 s gammaloop-nextest-docs> tests: 129, failures: 1, errors: 0
  234. 63.38 s gammaloop-nextest-docs>
  235. 63.38 s gammaloop-nextest-docs> 1. alphal00p-docs-builder::provenance_tests::each_build_captures_one_revision_before_rendering
  236. 63.38 s gammaloop-nextest-docs> failure: test failure with exit code 101
  237. 63.38 s gammaloop-nextest-docs> thread 'provenance_tests::each_build_captures_one_revision_before_rendering' (182) panicked at crates/alphal00p-docs-builder/src/provenance_tests.rs:274:9:
  238. 63.38 s gammaloop-nextest-docs> assertion failed: command.status().unwrap().success()
  239. 63.38 s gammaloop-nextest-docs> stack backtrace:
  240. 63.38 s gammaloop-nextest-docs> 0: __rustc::rust_begin_unwind
  241. 63.38 s gammaloop-nextest-docs> 1: core::panicking::panic_fmt
  242. 63.38 s gammaloop-nextest-docs> 2: core::panicking::panic
  243. 63.38 s gammaloop-nextest-docs> 3: alphal00p_docs_builder::provenance_tests::each_build_captures_one_revision_before_rendering
  244. 63.38 s gammaloop-nextest-docs> 4: <alphal00p_docs_builder::provenance_tests::each_build_captures_one_revision_before_rendering::{closure#0} as core::ops::function::FnOnce<()>>::call_once
  245. 63.38 s gammaloop-nextest-docs> note: Some details are omitted, run with `RUST_BACKTRACE=full` for a verbose backtrace.
  246. 63.38 s gammaloop-nextest-docs> system-out
  247. 63.38 s gammaloop-nextest-docs> running 1 test
  248. 63.38 s gammaloop-nextest-docs>
  249. 63.38 s gammaloop-nextest-docs> running 1 test
  250. 63.38 s gammaloop-nextest-docs> test provenance_tests::each_build_captures_one_revision_before_rendering ... FAILED
  251. 63.38 s gammaloop-nextest-docs>
  252. 63.38 s gammaloop-nextest-docs> failures:
  253. 63.38 s gammaloop-nextest-docs>
  254. 63.38 s gammaloop-nextest-docs> failures:
  255. 63.38 s gammaloop-nextest-docs> provenance_tests::each_build_captures_one_revision_before_rendering
  256. 63.38 s gammaloop-nextest-docs>
  257. 63.38 s gammaloop-nextest-docs> test result: FAILED. 0 passed; 1 failed; 0 ignored; 0 measured; 128 filtered out; finished in 26.42s
  258. 63.38 s gammaloop-nextest-docs>
  259. 63.38 s gammaloop-nextest-docs> test provenance_tests::each_build_captures_one_revision_before_rendering ... FAILED
  260. 63.38 s gammaloop-nextest-docs>
  261. 63.38 s gammaloop-nextest-docs> failures:
  262. 63.38 s gammaloop-nextest-docs>
  263. 63.38 s gammaloop-nextest-docs> failures:
  264. 63.38 s gammaloop-nextest-docs> provenance_tests::each_build_captures_one_revision_before_rendering
  265. 63.38 s gammaloop-nextest-docs>
  266. 63.38 s gammaloop-nextest-docs> test result: FAILED. 0 passed; 1 failed; 0 ignored; 0 measured; 128 filtered out; finished in 26.46s
  267. 63.38 s gammaloop-nextest-docs> system-err
  268. 63.38 s gammaloop-nextest-docs> warning: bundle export is experimental
  269. 63.38 s gammaloop-nextest-docs> = hint: its behaviour may change at any time
  270. 63.38 s gammaloop-nextest-docs> = hint: do not rely on this feature for production use cases
  271. 63.38 s gammaloop-nextest-docs>
  272. 63.38 s gammaloop-nextest-docs> warning: unknown font family: roboto
  273. 63.38 s gammaloop-nextest-docs> ┌─ crates/linnest/typst/docs/manual.typ:11:28
  274. 63.38 s gammaloop-nextest-docs> │
  275. 63.38 s gammaloop-nextest-docs> 11 │ #set text(size: 10pt, font: "Roboto")
  276. 63.38 s gammaloop-nextest-docs> │ ^^^^^^^^
  277. 63.38 s gammaloop-nextest-docs>
  278. 63.38 s gammaloop-nextest-docs> warning: unknown font family: roboto
  279. 63.38 s gammaloop-nextest-docs> ┌─ crates/linnest/typst/docs/manual.typ:14:29
  280. 63.38 s gammaloop-nextest-docs> │
  281. 63.38 s gammaloop-nextest-docs> 14 │ #set text(size: 3em, font: "Roboto")
  282. 63.38 s gammaloop-nextest-docs> │ ^^^^^^^^
  283. 63.38 s gammaloop-nextest-docs>
  284. 63.38 s gammaloop-nextest-docs> warning: unknown font family: roboto
  285. 63.38 s gammaloop-nextest-docs> ┌─ crates/linnest/typst/docs/manual.typ:16:31
  286. 63.38 s gammaloop-nextest-docs> │
  287. 63.38 s gammaloop-nextest-docs> 16 │ #set text(size: 0.3em, font: "Roboto")
  288. 63.38 s gammaloop-nextest-docs> │ ^^^^^^^^
  289. 63.38 s gammaloop-nextest-docs>
  290. 63.38 s gammaloop-nextest-docs> warning: overline was ignored during MathML export
  291. 63.38 s gammaloop-nextest-docs> ┌─ crates/linnest/typst/docs/manual.typ:949:55
  292. 63.38 s gammaloop-nextest-docs> │
  293. 63.38 s gammaloop-nextest-docs> 949 │ + sum_("dangling" e) c_("dangling-centroid") / (d(e, overline(v)) + epsilon)
  294. 63.38 s gammaloop-nextest-docs> │ ^^^^^^^^^^^
  295. 63.38 s gammaloop-nextest-docs>
  296. 63.38 s gammaloop-nextest-docs> warning: overline was ignored during MathML export
  297. 63.38 s gammaloop-nextest-docs> ┌─ crates/linnest/typst/docs/manual.typ:953:8
  298. 63.38 s gammaloop-nextest-docs> │
  299. 63.38 s gammaloop-nextest-docs> 953 │ Here $overline(v)$ is the mean node position. The centroid term pushes every
  300. 63.38 s gammaloop-nextest-docs> │ ^^^^^^^^^^^
  301. 63.38 s gammaloop-nextest-docs>
  302. 63.38 s gammaloop-nextest-docs>
  303. 63.38 s gammaloop-nextest-docs> thread 'provenance_tests::each_build_captures_one_revision_before_rendering' (247) panicked at crates/alphal00p-docs-builder/src/provenance_tests.rs:297:14:
  304. 63.38 s gammaloop-nextest-docs> called `Result::unwrap()` on an `Err` value: generated site has broken links:
  305. 63.38 s gammaloop-nextest-docs> products/linnet/latest/reference/interfaces/index.html -> https://github.com/alphal00p/gammaloop/blob/1111111111111111111111111111111111111111/crates/linnet-py/examples/physics_render_settings.py (missing repository source file crates/linnet-py/examples/physics_render_settings.py)
  306. 63.38 s gammaloop-nextest-docs> products/linnet/latest/reference/interfaces/index.html -> https://github.com/alphal00p/gammaloop/blob/1111111111111111111111111111111111111111/crates/linnet-py/examples/layout_stream.py (missing repository source file crates/linnet-py/examples/layout_stream.py)
  307. 63.38 s gammaloop-nextest-docs> products/linnet/latest/playground/index.html -> https://github.com/alphal00p/gammaloop/blob/1111111111111111111111111111111111111111/crates/linnet-py/examples/layout_stream.py (missing repository source file crates/linnet-py/examples/layout_stream.py)
  308. 63.38 s gammaloop-nextest-docs> products/linnet/latest/guides/python-rendering/index.html -> https://github.com/alphal00p/gammaloop/blob/1111111111111111111111111111111111111111/crates/linnet-py/examples/rendering_api.py (missing repository source file crates/linnet-py/examples/rendering_api.py)
  309. 63.38 s gammaloop-nextest-docs>
  310. 63.38 s gammaloop-nextest-docs> Location:
  311. 63.38 s gammaloop-nextest-docs> crates/alphal00p-docs-builder/src/lib.rs:4940:9
  312. 63.38 s gammaloop-nextest-docs> stack backtrace:
  313. 63.38 s gammaloop-nextest-docs> 0: __rustc::rust_begin_unwind
  314. 63.38 s gammaloop-nextest-docs> 1: core::panicking::panic_fmt
  315. 63.38 s gammaloop-nextest-docs> 2: core::result::unwrap_failed
  316. 63.38 s gammaloop-nextest-docs> 3: alphal00p_docs_builder::provenance_tests::each_build_captures_one_revision_before_rendering
  317. 63.38 s gammaloop-nextest-docs> 4: <alphal00p_docs_builder::provenance_tests::each_build_captures_one_revision_before_rendering::{closure#0} as core::ops::function::FnOnce<()>>::call_once
  318. 63.38 s gammaloop-nextest-docs> note: Some details are omitted, run with `RUST_BACKTRACE=full` for a verbose backtrace.
  319. 63.38 s gammaloop-nextest-docs>
  320. 63.38 s gammaloop-nextest-docs> thread 'provenance_tests::each_build_captures_one_revision_before_rendering' (182) panicked at crates/alphal00p-docs-builder/src/provenance_tests.rs:274:9:
  321. 63.38 s gammaloop-nextest-docs> assertion failed: command.status().unwrap().success()
  322. 63.38 s gammaloop-nextest-docs> stack backtrace:
  323. 63.38 s gammaloop-nextest-docs> 0: __rustc::rust_begin_unwind
  324. 63.38 s gammaloop-nextest-docs> 1: core::panicking::panic_fmt
  325. 63.38 s gammaloop-nextest-docs> 2: core::panicking::panic
  326. 63.38 s gammaloop-nextest-docs> 3: alphal00p_docs_builder::provenance_tests::each_build_captures_one_revision_before_rendering
  327. 63.38 s gammaloop-nextest-docs> 4: <alphal00p_docs_builder::provenance_tests::each_build_captures_one_revision_before_rendering::{closure#0} as core::ops::function::FnOnce<()>>::call_once
  328. 63.38 s gammaloop-nextest-docs> note: Some details are omitted, run with `RUST_BACKTRACE=full` for a verbose backtrace.
  329. 63.38 s gammaloop-nextest-docs> =========================================
  330. 63.39 s gammaloop-nextest-docs> Extracting 2 binaries to /build/source
  331. 63.42 s gammaloop-nextest-docs> Extracted 5 files to /build/source in 0.03s
  332. 63.43 s gammaloop-nextest-docs> ------------
  333. 63.43 s gammaloop-nextest-docs> Nextest run ID 6f4f9331-a8b2-454c-85f0-dda13c0ad24b with nextest profile: ci_gammaloop
  334. 63.43 s gammaloop-nextest-docs> Starting 22 tests across 2 binaries
  335. 63.45 s gammaloop-nextest-docs> ------------
  336. 63.45 s gammaloop-nextest-docs> Summary [ 0.013s] 22 tests run: 22 passed, 0 skipped
  337. 63.47 s gammaloop-nextest-docs>
  338. 63.47 s gammaloop-nextest-docs> ========== nextest test summary ==========
  339. 63.47 s gammaloop-nextest-docs> report: target/nextest/ci_gammaloop/junit.xml
  340. 63.47 s gammaloop-nextest-docs> tests: 22, failures: 0, errors: 0
  341. 63.47 s gammaloop-nextest-docs> No failing testcases found.
  342. 63.47 s gammaloop-nextest-docs> =========================================
  343. 63.49 s gammaloop-nextest-docs> Extracting 3 binaries (including 2 non-test binaries), 1 build script output directory, and 2 linked paths to /build/source
  344. 63.74 s gammaloop-nextest-docs> Extracted 22 files to /build/source in 0.25s
  345. 63.75 s gammaloop-nextest-docs> ------------
  346. 63.75 s gammaloop-nextest-docs> Nextest run ID f50be83c-1e5e-4d93-b2c1-8de08b66bdd8 with nextest profile: ci_gammaloop
  347. 63.75 s gammaloop-nextest-docs> Starting 89 tests across 1 binary
  348. 63.79 s gammaloop-nextest-docs> ------------
  349. 63.79 s gammaloop-nextest-docs> Summary [ 0.045s] 89 tests run: 89 passed, 0 skipped
  350. 63.82 s gammaloop-nextest-docs>
  351. 63.82 s gammaloop-nextest-docs> ========== nextest test summary ==========
  352. 63.82 s gammaloop-nextest-docs> report: target/nextest/ci_gammaloop/junit.xml
  353. 63.82 s gammaloop-nextest-docs> tests: 89, failures: 0, errors: 0
  354. 63.82 s gammaloop-nextest-docs> No failing testcases found.
  355. 63.82 s gammaloop-nextest-docs> =========================================
  356. 63.84 s gammaloop-nextest-docs> Extracting 2 binaries to /build/source
  357. 63.87 s gammaloop-nextest-docs> Extracted 5 files to /build/source in 0.04s
  358. 63.88 s gammaloop-nextest-docs> ------------
  359. 63.88 s gammaloop-nextest-docs> Nextest run ID 00e2dff6-f08d-432d-a310-0e070b0b92f5 with nextest profile: ci_gammaloop
  360. 63.88 s gammaloop-nextest-docs> Starting 10 tests across 2 binaries
  361. 76.11 s gammaloop-nextest-docs> ------------
  362. 76.11 s gammaloop-nextest-docs> Summary [ 12.231s] 10 tests run: 10 passed, 0 skipped
  363. 76.15 s gammaloop-nextest-docs>
  364. 76.15 s gammaloop-nextest-docs> ========== nextest test summary ==========
  365. 76.15 s gammaloop-nextest-docs> report: target/nextest/ci_gammaloop/junit.xml
  366. 76.15 s gammaloop-nextest-docs> tests: 10, failures: 0, errors: 0
  367. 76.15 s gammaloop-nextest-docs> No failing testcases found.
  368. 76.15 s gammaloop-nextest-docs> =========================================
  369. 76.16 s gammaloop-nextest-docs> Extracting 1 binary to /build/source
  370. 76.19 s gammaloop-nextest-docs> Extracted 4 files to /build/source in 0.03s
  371. 76.20 s gammaloop-nextest-docs> ------------
  372. 76.20 s gammaloop-nextest-docs> Nextest run ID df5a64c9-df8a-4fcc-be3e-85fdfc67bc2a with nextest profile: ci_gammaloop
  373. 76.20 s gammaloop-nextest-docs> Starting 0 tests across 1 binary
  374. 76.20 s gammaloop-nextest-docs> ------------
  375. 76.20 s gammaloop-nextest-docs> Summary [ 0.000s] 0 tests run: 0 passed, 0 skipped
  376. 76.23 s gammaloop-nextest-docs>
  377. 76.23 s gammaloop-nextest-docs> ========== nextest test summary ==========
  378. 76.23 s gammaloop-nextest-docs> report: target/nextest/ci_gammaloop/junit.xml
  379. 76.23 s gammaloop-nextest-docs> tests: 0, failures: 0, errors: 0
  380. 76.23 s gammaloop-nextest-docs> No failing testcases found.
  381. 76.23 s gammaloop-nextest-docs> =========================================
  382. 76.24 s gammaloop-nextest-docs> Extracting 1 binary to /build/source
  383. 76.28 s gammaloop-nextest-docs> Extracted 4 files to /build/source in 0.03s
  384. 76.28 s gammaloop-nextest-docs> ------------
  385. 76.28 s gammaloop-nextest-docs> Nextest run ID 2135c76e-cb79-423d-ba3c-e9bc8795b6b1 with nextest profile: ci_gammaloop
  386. 76.28 s gammaloop-nextest-docs> Starting 5 tests across 1 binary
  387. 76.29 s gammaloop-nextest-docs> ------------
  388. 76.29 s gammaloop-nextest-docs> Summary [ 0.005s] 5 tests run: 5 passed, 0 skipped
  389. 76.31 s gammaloop-nextest-docs>
  390. 76.31 s gammaloop-nextest-docs> ========== nextest test summary ==========
  391. 76.31 s gammaloop-nextest-docs> report: target/nextest/ci_gammaloop/junit.xml
  392. 76.31 s gammaloop-nextest-docs> tests: 5, failures: 0, errors: 0
  393. 76.31 s gammaloop-nextest-docs> No failing testcases found.
  394. 76.31 s gammaloop-nextest-docs> =========================================
  395. 76.50 s error: Cannot build '/nix/store/9rs74w2crrwhaq7f0dxdi11wd515i6dj-gammaloop-nextest-docs.drv'.
  396. 76.50 s Reason: builder failed with exit code 100.
  397. 76.50 s Output paths:
  398. 76.50 s /nix/store/1jyipvscqlj4v0h7qjznydlgdlc4bjy7-gammaloop-nextest-docs
  399. 76.50 s Last 347 log lines:
  400. 76.50 s > Extracting 2 binaries to /build/source
  401. 76.50 s > Extracted 5 files to /build/source in 0.04s
  402. 76.50 s > ------------
  403. 76.50 s > Nextest run ID 9357db49-7b2d-4f5e-8842-dc003f134bb4 with nextest profile: ci_gammaloop
  404. 76.50 s > Starting 129 tests across 2 binaries
  405. 76.50 s > FAIL [ 26.469s] (128/129) alphal00p-docs-builder provenance_tests::each_build_captures_one_revision_before_rendering
  406. 76.50 s > stdout ---
  407. 76.50 s >
  408. 76.50 s > running 1 test
  409. 76.50 s >
  410. 76.50 s > running 1 test
  411. 76.50 s > test provenance_tests::each_build_captures_one_revision_before_rendering ... FAILED
  412. 76.50 s >
  413. 76.50 s > failures:
  414. 76.50 s >
  415. 76.50 s > failures:
  416. 76.50 s > provenance_tests::each_build_captures_one_revision_before_rendering
  417. 76.50 s >
  418. 76.50 s > test result: FAILED. 0 passed; 1 failed; 0 ignored; 0 measured; 128 filtered out; finished in 26.42s
  419. 76.50 s >
  420. 76.50 s > test provenance_tests::each_build_captures_one_revision_before_rendering ... FAILED
  421. 76.50 s >
  422. 76.50 s > failures:
  423. 76.50 s >
  424. 76.50 s > failures:
  425. 76.50 s > provenance_tests::each_build_captures_one_revision_before_rendering
  426. 76.50 s >
  427. 76.50 s > test result: FAILED. 0 passed; 1 failed; 0 ignored; 0 measured; 128 filtered out; finished in 26.46s
  428. 76.50 s >
  429. 76.50 s > stderr ---
  430. 76.50 s > warning: bundle export is experimental
  431. 76.50 s > = hint: its behaviour may change at any time
  432. 76.50 s > = hint: do not rely on this feature for production use cases
  433. 76.50 s >
  434. 76.50 s > warning: unknown font family: roboto
  435. 76.50 s > ┌─ crates/linnest/typst/docs/manual.typ:11:28
  436. 76.50 s > │
  437. 76.50 s > 11 │ #set text(size: 10pt, font: "Roboto")
  438. 76.50 s > │ ^^^^^^^^
  439. 76.50 s >
  440. 76.50 s > warning: unknown font family: roboto
  441. 76.50 s > ┌─ crates/linnest/typst/docs/manual.typ:14:29
  442. 76.50 s > │
  443. 76.50 s > 14 │ #set text(size: 3em, font: "Roboto")
  444. 76.50 s > │ ^^^^^^^^
  445. 76.50 s >
  446. 76.50 s > warning: unknown font family: roboto
  447. 76.50 s > ┌─ crates/linnest/typst/docs/manual.typ:16:31
  448. 76.50 s > │
  449. 76.50 s > 16 │ #set text(size: 0.3em, font: "Roboto")
  450. 76.50 s > │ ^^^^^^^^
  451. 76.50 s >
  452. 76.50 s > warning: overline was ignored during MathML export
  453. 76.50 s > ┌─ crates/linnest/typst/docs/manual.typ:949:55
  454. 76.50 s > │
  455. 76.50 s > 949 │ + sum_("dangling" e) c_("dangling-centroid") / (d(e, overline(v)) + epsilon)
  456. 76.50 s > │ ^^^^^^^^^^^
  457. 76.50 s >
  458. 76.50 s > warning: overline was ignored during MathML export
  459. 76.50 s > ┌─ crates/linnest/typst/docs/manual.typ:953:8
  460. 76.50 s > │
  461. 76.50 s > 953 │ Here $overline(v)$ is the mean node position. The centroid term pushes every
  462. 76.50 s > │ ^^^^^^^^^^^
  463. 76.50 s >
  464. 76.50 s >
  465. 76.50 s > thread 'provenance_tests::each_build_captures_one_revision_before_rendering' (247) panicked at crates/alphal00p-docs-builder/src/provenance_tests.rs:297:14:
  466. 76.50 s > called `Result::unwrap()` on an `Err` value: generated site has broken links:
  467. 76.50 s > products/linnet/latest/reference/interfaces/index.html -> https://github.com/alphal00p/gammaloop/blob/1111111111111111111111111111111111111111/crates/linnet-py/examples/physics_render_settings.py (missing repository source file crates/linnet-py/examples/physics_render_settings.py)
  468. 76.50 s > products/linnet/latest/reference/interfaces/index.html -> https://github.com/alphal00p/gammaloop/blob/1111111111111111111111111111111111111111/crates/linnet-py/examples/layout_stream.py (missing repository source file crates/linnet-py/examples/layout_stream.py)
  469. 76.50 s > products/linnet/latest/playground/index.html -> https://github.com/alphal00p/gammaloop/blob/1111111111111111111111111111111111111111/crates/linnet-py/examples/layout_stream.py (missing repository source file crates/linnet-py/examples/layout_stream.py)
  470. 76.50 s > products/linnet/latest/guides/python-rendering/index.html -> https://github.com/alphal00p/gammaloop/blob/1111111111111111111111111111111111111111/crates/linnet-py/examples/rendering_api.py (missing repository source file crates/linnet-py/examples/rendering_api.py)
  471. 76.50 s >
  472. 76.50 s > Location:
  473. 76.50 s > crates/alphal00p-docs-builder/src/lib.rs:4940:9
  474. 76.50 s > stack backtrace:
  475. 76.50 s > 0: __rustc::rust_begin_unwind
  476. 76.50 s > 1: core::panicking::panic_fmt
  477. 76.50 s > 2: core::result::unwrap_failed
  478. 76.50 s > 3: alphal00p_docs_builder::provenance_tests::each_build_captures_one_revision_before_rendering
  479. 76.50 s > 4: <alphal00p_docs_builder::provenance_tests::each_build_captures_one_revision_before_rendering::{closure#0} as core::ops::function::FnOnce<()>>::call_once
  480. 76.50 s > note: Some details are omitted, run with `RUST_BACKTRACE=full` for a verbose backtrace.
  481. 76.50 s >
  482. 76.50 s > thread 'provenance_tests::each_build_captures_one_revision_before_rendering' (182) panicked at crates/alphal00p-docs-builder/src/provenance_tests.rs:274:9:
  483. 76.50 s > assertion failed: command.status().unwrap().success()
  484. 76.50 s > stack backtrace:
  485. 76.50 s > 0: __rustc::rust_begin_unwind
  486. 76.50 s > 1: core::panicking::panic_fmt
  487. 76.50 s > 2: core::panicking::panic
  488. 76.50 s > 3: alphal00p_docs_builder::provenance_tests::each_build_captures_one_revision_before_rendering
  489. 76.50 s > 4: <alphal00p_docs_builder::provenance_tests::each_build_captures_one_revision_before_rendering::{closure#0} as core::ops::function::FnOnce<()>>::call_once
  490. 76.50 s > note: Some details are omitted, run with `RUST_BACKTRACE=full` for a verbose backtrace.
  491. 76.50 s >
  492. 76.50 s > ------------
  493. 76.50 s > Summary [ 31.946s] 129 tests run: 128 passed, 1 failed, 0 skipped
  494. 76.50 s > FAIL [ 26.469s] (128/129) alphal00p-docs-builder provenance_tests::each_build_captures_one_revision_before_rendering
  495. 76.50 s > stdout ---
  496. 76.50 s >
  497. 76.50 s > running 1 test
  498. 76.50 s >
  499. 76.50 s > running 1 test
  500. 76.50 s > test provenance_tests::each_build_captures_one_revision_before_rendering ... FAILED
  501. 76.50 s >
  502. 76.50 s > failures:
  503. 76.50 s >
  504. 76.50 s > failures:
  505. 76.50 s > provenance_tests::each_build_captures_one_revision_before_rendering
  506. 76.50 s >
  507. 76.50 s > test result: FAILED. 0 passed; 1 failed; 0 ignored; 0 measured; 128 filtered out; finished in 26.42s
  508. 76.50 s >
  509. 76.50 s > test provenance_tests::each_build_captures_one_revision_before_rendering ... FAILED
  510. 76.50 s >
  511. 76.50 s > failures:
  512. 76.50 s >
  513. 76.50 s > failures:
  514. 76.50 s > provenance_tests::each_build_captures_one_revision_before_rendering
  515. 76.50 s >
  516. 76.50 s > test result: FAILED. 0 passed; 1 failed; 0 ignored; 0 measured; 128 filtered out; finished in 26.46s
  517. 76.50 s >
  518. 76.50 s > stderr ---
  519. 76.50 s > warning: bundle export is experimental
  520. 76.50 s > = hint: its behaviour may change at any time
  521. 76.50 s > = hint: do not rely on this feature for production use cases
  522. 76.50 s >
  523. 76.50 s > warning: unknown font family: roboto
  524. 76.50 s > ┌─ crates/linnest/typst/docs/manual.typ:11:28
  525. 76.50 s > │
  526. 76.50 s > 11 │ #set text(size: 10pt, font: "Roboto")
  527. 76.50 s > │ ^^^^^^^^
  528. 76.50 s >
  529. 76.50 s > warning: unknown font family: roboto
  530. 76.50 s > ┌─ crates/linnest/typst/docs/manual.typ:14:29
  531. 76.50 s > │
  532. 76.50 s > 14 │ #set text(size: 3em, font: "Roboto")
  533. 76.50 s > │ ^^^^^^^^
  534. 76.50 s >
  535. 76.50 s > warning: unknown font family: roboto
  536. 76.50 s > ┌─ crates/linnest/typst/docs/manual.typ:16:31
  537. 76.50 s > │
  538. 76.50 s > 16 │ #set text(size: 0.3em, font: "Roboto")
  539. 76.50 s > │ ^^^^^^^^
  540. 76.50 s >
  541. 76.50 s > warning: overline was ignored during MathML export
  542. 76.50 s > ┌─ crates/linnest/typst/docs/manual.typ:949:55
  543. 76.50 s > │
  544. 76.50 s > 949 │ + sum_("dangling" e) c_("dangling-centroid") / (d(e, overline(v)) + epsilon)
  545. 76.50 s > │ ^^^^^^^^^^^
  546. 76.50 s >
  547. 76.50 s > warning: overline was ignored during MathML export
  548. 76.50 s > ┌─ crates/linnest/typst/docs/manual.typ:953:8
  549. 76.50 s > │
  550. 76.50 s > 953 │ Here $overline(v)$ is the mean node position. The centroid term pushes every
  551. 76.50 s > │ ^^^^^^^^^^^
  552. 76.50 s >
  553. 76.50 s >
  554. 76.50 s > thread 'provenance_tests::each_build_captures_one_revision_before_rendering' (247) panicked at crates/alphal00p-docs-builder/src/provenance_tests.rs:297:14:
  555. 76.50 s > called `Result::unwrap()` on an `Err` value: generated site has broken links:
  556. 76.50 s > products/linnet/latest/reference/interfaces/index.html -> https://github.com/alphal00p/gammaloop/blob/1111111111111111111111111111111111111111/crates/linnet-py/examples/physics_render_settings.py (missing repository source file crates/linnet-py/examples/physics_render_settings.py)
  557. 76.50 s > products/linnet/latest/reference/interfaces/index.html -> https://github.com/alphal00p/gammaloop/blob/1111111111111111111111111111111111111111/crates/linnet-py/examples/layout_stream.py (missing repository source file crates/linnet-py/examples/layout_stream.py)
  558. 76.50 s > products/linnet/latest/playground/index.html -> https://github.com/alphal00p/gammaloop/blob/1111111111111111111111111111111111111111/crates/linnet-py/examples/layout_stream.py (missing repository source file crates/linnet-py/examples/layout_stream.py)
  559. 76.50 s > products/linnet/latest/guides/python-rendering/index.html -> https://github.com/alphal00p/gammaloop/blob/1111111111111111111111111111111111111111/crates/linnet-py/examples/rendering_api.py (missing repository source file crates/linnet-py/examples/rendering_api.py)
  560. 76.50 s >
  561. 76.50 s > Location:
  562. 76.50 s > crates/alphal00p-docs-builder/src/lib.rs:4940:9
  563. 76.50 s > stack backtrace:
  564. 76.50 s > 0: __rustc::rust_begin_unwind
  565. 76.50 s > 1: core::panicking::panic_fmt
  566. 76.50 s > 2: core::result::unwrap_failed
  567. 76.50 s > 3: alphal00p_docs_builder::provenance_tests::each_build_captures_one_revision_before_rendering
  568. 76.50 s > 4: <alphal00p_docs_builder::provenance_tests::each_build_captures_one_revision_before_rendering::{closure#0} as core::ops::function::FnOnce<()>>::call_once
  569. 76.50 s > note: Some details are omitted, run with `RUST_BACKTRACE=full` for a verbose backtrace.
  570. 76.50 s >
  571. 76.50 s > thread 'provenance_tests::each_build_captures_one_revision_before_rendering' (182) panicked at crates/alphal00p-docs-builder/src/provenance_tests.rs:274:9:
  572. 76.50 s > assertion failed: command.status().unwrap().success()
  573. 76.50 s > stack backtrace:
  574. 76.50 s > 0: __rustc::rust_begin_unwind
  575. 76.50 s > 1: core::panicking::panic_fmt
  576. 76.50 s > 2: core::panicking::panic
  577. 76.50 s > 3: alphal00p_docs_builder::provenance_tests::each_build_captures_one_revision_before_rendering
  578. 76.50 s > 4: <alphal00p_docs_builder::provenance_tests::each_build_captures_one_revision_before_rendering::{closure#0} as core::ops::function::FnOnce<()>>::call_once
  579. 76.50 s > note: Some details are omitted, run with `RUST_BACKTRACE=full` for a verbose backtrace.
  580. 76.50 s >
  581. 76.50 s > error: test run failed
  582. 76.50 s >
  583. 76.50 s > ========== nextest test summary ==========
  584. 76.50 s > report: target/nextest/ci_gammaloop/junit.xml
  585. 76.50 s > tests: 129, failures: 1, errors: 0
  586. 76.50 s >
  587. 76.50 s > 1. alphal00p-docs-builder::provenance_tests::each_build_captures_one_revision_before_rendering
  588. 76.50 s > failure: test failure with exit code 101
  589. 76.50 s > thread 'provenance_tests::each_build_captures_one_revision_before_rendering' (182) panicked at crates/alphal00p-docs-builder/src/provenance_tests.rs:274:9:
  590. 76.50 s > assertion failed: command.status().unwrap().success()
  591. 76.50 s > stack backtrace:
  592. 76.50 s > 0: __rustc::rust_begin_unwind
  593. 76.50 s > 1: core::panicking::panic_fmt
  594. 76.50 s > 2: core::panicking::panic
  595. 76.50 s > 3: alphal00p_docs_builder::provenance_tests::each_build_captures_one_revision_before_rendering
  596. 76.50 s > 4: <alphal00p_docs_builder::provenance_tests::each_build_captures_one_revision_before_rendering::{closure#0} as core::ops::function::FnOnce<()>>::call_once
  597. 76.50 s > note: Some details are omitted, run with `RUST_BACKTRACE=full` for a verbose backtrace.
  598. 76.50 s > system-out
  599. 76.50 s > running 1 test
  600. 76.50 s >
  601. 76.50 s > running 1 test
  602. 76.50 s > test provenance_tests::each_build_captures_one_revision_before_rendering ... FAILED
  603. 76.50 s >
  604. 76.50 s > failures:
  605. 76.50 s >
  606. 76.50 s > failures:
  607. 76.50 s > provenance_tests::each_build_captures_one_revision_before_rendering
  608. 76.50 s >
  609. 76.50 s > test result: FAILED. 0 passed; 1 failed; 0 ignored; 0 measured; 128 filtered out; finished in 26.42s
  610. 76.50 s >
  611. 76.50 s > test provenance_tests::each_build_captures_one_revision_before_rendering ... FAILED
  612. 76.50 s >
  613. 76.50 s > failures:
  614. 76.50 s >
  615. 76.50 s > failures:
  616. 76.50 s > provenance_tests::each_build_captures_one_revision_before_rendering
  617. 76.50 s >
  618. 76.50 s > test result: FAILED. 0 passed; 1 failed; 0 ignored; 0 measured; 128 filtered out; finished in 26.46s
  619. 76.50 s > system-err
  620. 76.50 s > warning: bundle export is experimental
  621. 76.50 s > = hint: its behaviour may change at any time
  622. 76.50 s > = hint: do not rely on this feature for production use cases
  623. 76.50 s >
  624. 76.50 s > warning: unknown font family: roboto
  625. 76.50 s > ┌─ crates/linnest/typst/docs/manual.typ:11:28
  626. 76.50 s > │
  627. 76.50 s > 11 │ #set text(size: 10pt, font: "Roboto")
  628. 76.50 s > │ ^^^^^^^^
  629. 76.50 s >
  630. 76.50 s > warning: unknown font family: roboto
  631. 76.50 s > ┌─ crates/linnest/typst/docs/manual.typ:14:29
  632. 76.50 s > │
  633. 76.50 s > 14 │ #set text(size: 3em, font: "Roboto")
  634. 76.50 s > │ ^^^^^^^^
  635. 76.50 s >
  636. 76.50 s > warning: unknown font family: roboto
  637. 76.50 s > ┌─ crates/linnest/typst/docs/manual.typ:16:31
  638. 76.50 s > │
  639. 76.50 s > 16 │ #set text(size: 0.3em, font: "Roboto")
  640. 76.50 s > │ ^^^^^^^^
  641. 76.50 s >
  642. 76.50 s > warning: overline was ignored during MathML export
  643. 76.50 s > ┌─ crates/linnest/typst/docs/manual.typ:949:55
  644. 76.50 s > │
  645. 76.50 s > 949 │ + sum_("dangling" e) c_("dangling-centroid") / (d(e, overline(v)) + epsilon)
  646. 76.50 s > │ ^^^^^^^^^^^
  647. 76.50 s >
  648. 76.50 s > warning: overline was ignored during MathML export
  649. 76.50 s > ┌─ crates/linnest/typst/docs/manual.typ:953:8
  650. 76.50 s > │
  651. 76.50 s > 953 │ Here $overline(v)$ is the mean node position. The centroid term pushes every
  652. 76.50 s > │ ^^^^^^^^^^^
  653. 76.50 s >
  654. 76.50 s >
  655. 76.50 s > thread 'provenance_tests::each_build_captures_one_revision_before_rendering' (247) panicked at crates/alphal00p-docs-builder/src/provenance_tests.rs:297:14:
  656. 76.50 s > called `Result::unwrap()` on an `Err` value: generated site has broken links:
  657. 76.50 s > products/linnet/latest/reference/interfaces/index.html -> https://github.com/alphal00p/gammaloop/blob/1111111111111111111111111111111111111111/crates/linnet-py/examples/physics_render_settings.py (missing repository source file crates/linnet-py/examples/physics_render_settings.py)
  658. 76.50 s > products/linnet/latest/reference/interfaces/index.html -> https://github.com/alphal00p/gammaloop/blob/1111111111111111111111111111111111111111/crates/linnet-py/examples/layout_stream.py (missing repository source file crates/linnet-py/examples/layout_stream.py)
  659. 76.50 s > products/linnet/latest/playground/index.html -> https://github.com/alphal00p/gammaloop/blob/1111111111111111111111111111111111111111/crates/linnet-py/examples/layout_stream.py (missing repository source file crates/linnet-py/examples/layout_stream.py)
  660. 76.50 s > products/linnet/latest/guides/python-rendering/index.html -> https://github.com/alphal00p/gammaloop/blob/1111111111111111111111111111111111111111/crates/linnet-py/examples/rendering_api.py (missing repository source file crates/linnet-py/examples/rendering_api.py)
  661. 76.50 s >
  662. 76.50 s > Location:
  663. 76.50 s > crates/alphal00p-docs-builder/src/lib.rs:4940:9
  664. 76.50 s > stack backtrace:
  665. 76.50 s > 0: __rustc::rust_begin_unwind
  666. 76.50 s > 1: core::panicking::panic_fmt
  667. 76.50 s > 2: core::result::unwrap_failed
  668. 76.50 s > 3: alphal00p_docs_builder::provenance_tests::each_build_captures_one_revision_before_rendering
  669. 76.50 s > 4: <alphal00p_docs_builder::provenance_tests::each_build_captures_one_revision_before_rendering::{closure#0} as core::ops::function::FnOnce<()>>::call_once
  670. 76.50 s > note: Some details are omitted, run with `RUST_BACKTRACE=full` for a verbose backtrace.
  671. 76.50 s >
  672. 76.50 s > thread 'provenance_tests::each_build_captures_one_revision_before_rendering' (182) panicked at crates/alphal00p-docs-builder/src/provenance_tests.rs:274:9:
  673. 76.50 s > assertion failed: command.status().unwrap().success()
  674. 76.50 s > stack backtrace:
  675. 76.50 s > 0: __rustc::rust_begin_unwind
  676. 76.50 s > 1: core::panicking::panic_fmt
  677. 76.50 s > 2: core::panicking::panic
  678. 76.50 s > 3: alphal00p_docs_builder::provenance_tests::each_build_captures_one_revision_before_rendering
  679. 76.50 s > 4: <alphal00p_docs_builder::provenance_tests::each_build_captures_one_revision_before_rendering::{closure#0} as core::ops::function::FnOnce<()>>::call_once
  680. 76.50 s > note: Some details are omitted, run with `RUST_BACKTRACE=full` for a verbose backtrace.
  681. 76.50 s > =========================================
  682. 76.50 s > Extracting 2 binaries to /build/source
  683. 76.50 s > Extracted 5 files to /build/source in 0.03s
  684. 76.50 s > ------------
  685. 76.50 s > Nextest run ID 6f4f9331-a8b2-454c-85f0-dda13c0ad24b with nextest profile: ci_gammaloop
  686. 76.50 s > Starting 22 tests across 2 binaries
  687. 76.50 s > ------------
  688. 76.50 s > Summary [ 0.013s] 22 tests run: 22 passed, 0 skipped
  689. 76.50 s >
  690. 76.50 s > ========== nextest test summary ==========
  691. 76.50 s > report: target/nextest/ci_gammaloop/junit.xml
  692. 76.50 s > tests: 22, failures: 0, errors: 0
  693. 76.50 s > No failing testcases found.
  694. 76.50 s > =========================================
  695. 76.50 s > Extracting 3 binaries (including 2 non-test binaries), 1 build script output directory, and 2 linked paths to /build/source
  696. 76.50 s > Extracted 22 files to /build/source in 0.25s
  697. 76.50 s > ------------
  698. 76.50 s > Nextest run ID f50be83c-1e5e-4d93-b2c1-8de08b66bdd8 with nextest profile: ci_gammaloop
  699. 76.50 s > Starting 89 tests across 1 binary
  700. 76.50 s > ------------
  701. 76.50 s > Summary [ 0.045s] 89 tests run: 89 passed, 0 skipped
  702. 76.50 s >
  703. 76.50 s > ========== nextest test summary ==========
  704. 76.50 s > report: target/nextest/ci_gammaloop/junit.xml
  705. 76.50 s > tests: 89, failures: 0, errors: 0
  706. 76.50 s > No failing testcases found.
  707. 76.50 s > =========================================
  708. 76.50 s > Extracting 2 binaries to /build/source
  709. 76.50 s > Extracted 5 files to /build/source in 0.04s
  710. 76.50 s > ------------
  711. 76.50 s > Nextest run ID 00e2dff6-f08d-432d-a310-0e070b0b92f5 with nextest profile: ci_gammaloop
  712. 76.50 s > Starting 10 tests across 2 binaries
  713. 76.50 s > ------------
  714. 76.50 s > Summary [ 12.231s] 10 tests run: 10 passed, 0 skipped
  715. 76.50 s >
  716. 76.50 s > ========== nextest test summary ==========
  717. 76.50 s > report: target/nextest/ci_gammaloop/junit.xml
  718. 76.50 s > tests: 10, failures: 0, errors: 0
  719. 76.50 s > No failing testcases found.
  720. 76.50 s > =========================================
  721. 76.50 s > Extracting 1 binary to /build/source
  722. 76.50 s > Extracted 4 files to /build/source in 0.03s
  723. 76.50 s > ------------
  724. 76.50 s > Nextest run ID df5a64c9-df8a-4fcc-be3e-85fdfc67bc2a with nextest profile: ci_gammaloop
  725. 76.50 s > Starting 0 tests across 1 binary
  726. 76.50 s > ------------
  727. 76.50 s > Summary [ 0.000s] 0 tests run: 0 passed, 0 skipped
  728. 76.50 s >
  729. 76.50 s > ========== nextest test summary ==========
  730. 76.50 s > report: target/nextest/ci_gammaloop/junit.xml
  731. 76.50 s > tests: 0, failures: 0, errors: 0
  732. 76.50 s > No failing testcases found.
  733. 76.50 s > =========================================
  734. 76.50 s > Extracting 1 binary to /build/source
  735. 76.50 s > Extracted 4 files to /build/source in 0.03s
  736. 76.50 s > ------------
  737. 76.50 s > Nextest run ID 2135c76e-cb79-423d-ba3c-e9bc8795b6b1 with nextest profile: ci_gammaloop
  738. 76.50 s > Starting 5 tests across 1 binary
  739. 76.50 s > ------------
  740. 76.50 s > Summary [ 0.005s] 5 tests run: 5 passed, 0 skipped
  741. 76.50 s >
  742. 76.50 s > ========== nextest test summary ==========
  743. 76.50 s > report: target/nextest/ci_gammaloop/junit.xml
  744. 76.50 s > tests: 5, failures: 0, errors: 0
  745. 76.50 s > No failing testcases found.
  746. 76.50 s > =========================================
  747. 76.50 s For full logs, run:
  748. 76.50 s nix log /nix/store/9rs74w2crrwhaq7f0dxdi11wd515i6dj-gammaloop-nextest-docs.drv
  749. 76.65 s [1 built (1 failed), 48 Run failed.