0.00 s
$ /nix/store/9ypz3flqsrl5xl495mm8h645gadjsxi1-coreutils-9.11/bin/timeout --kill-after=15s 7200s /nix/store/23zk8sgzamrbmj1fday15szf7f2279s8-nix-2.34.7/bin/nix --extra-experimental-features nix-command --extra-experimental-features flakes flake clone git+https://github.com/alphal00p/gammaloop --dest /tmp/nix-ci-worker/stable-pwd/repo/
0.12 s
Cloning into '/tmp/nix-ci-worker/stable-pwd/repo'...
0.93 s
remote: Enumerating objects: 87989, done.
1.05 s
remote: Counting objects: 0% (1/10587)
remote: Counting objects: 1% (106/10587)
remote: Counting objects: 2% (212/10587)
remote: Counting objects: 3% (318/10587)
remote: Counting objects: 4% (424/10587)
remote: Counting objects: 5% (530/10587)
remote: Counting objects: 6% (636/10587)
remote: Counting objects: 7% (742/10587)
remote: Counting objects: 8% (847/10587)
remote: Counting objects: 9% (953/10587)
remote: Counting objects: 10% (1059/10587)
remote: Counting objects: 11% (1165/10587)
remote: Counting objects: 12% (1271/10587)
remote: Counting objects: 13% (1377/10587)
remote: Counting objects: 14% (1483/10587)
remote: Counting objects: 15% (1589/10587)
remote: Counting objects: 16% (1694/10587)
remote: Counting objects: 17% (1800/10587)
remote: Counting objects: 18% (1906/10587)
remote: Counting objects: 19% (2012/10587)
remote: Counting objects: 20% (2118/10587)
remote: Counting objects: 21% (2224/10587)
remote: Counting objects: 22% (2330/10587)
remote: Counting objects: 23% (2436/10587)
remote: Counting objects: 24% (2541/10587)
remote: Counting objects: 25% (2647/10587)
remote: Counting objects: 26% (2753/10587)
remote: Counting objects: 27% (2859/10587)
remote: Counting objects: 28% (2965/10587)
remote: Counting objects: 29% (3071/10587)
remote: Counting objects: 30% (3177/10587)
remote: Counting objects: 31% (3282/10587)
remote: Counting objects: 32% (3388/10587)
remote: Counting objects: 33% (3494/10587)
remote: Counting objects: 34% (3600/10587)
remote: Counting objects: 35% (3706/10587)
remote: Counting objects: 36% (3812/10587)
remote: Counting objects: 37% (3918/10587)
remote: Counting objects: 38% (4024/10587)
remote: Counting objects: 39% (4129/10587)
remote: Counting objects: 40% (4235/10587)
remote: Counting objects: 41% (4341/10587)
remote: Counting objects: 42% (4447/10587)
remote: Counting objects: 43% (4553/10587)
remote: Counting objects: 44% (4659/10587)
remote: Counting objects: 45% (4765/10587)
remote: Counting objects: 46% (4871/10587)
remote: Counting objects: 47% (4976/10587)
remote: Counting objects: 48% (5082/10587)
remote: Counting objects: 49% (5188/10587)
remote: Counting objects: 50% (5294/10587)
remote: Counting objects: 51% (5400/10587)
remote: Counting objects: 52% (5506/10587)
remote: Counting objects: 53% (5612/10587)
remote: Counting objects: 54% (5717/10587)
remote: Counting objects: 55% (5823/10587)
remote: Counting objects: 56% (5929/10587)
remote: Counting objects: 57% (6035/10587)
remote: Counting objects: 58% (6141/10587)
remote: Counting objects: 59% (6247/10587)
remote: Counting objects: 60% (6353/10587)
remote: Counting objects: 61% (6459/10587)
remote: Counting objects: 62% (6564/10587)
remote: Counting objects: 63% (6670/10587)
remote: Counting objects: 64% (6776/10587)
remote: Counting objects: 65% (6882/10587)
remote: Counting objects: 66% (6988/10587)
remote: Counting objects: 67% (7094/10587)
remote: Counting objects: 68% (7200/10587)
remote: Counting objects: 69% (7306/10587)
remote: Counting objects: 70% (7411/10587)
remote: Counting objects: 71% (7517/10587)
remote: Counting objects: 72% (7623/10587)
remote: Counting objects: 73% (7729/10587)
remote: Counting objects: 74% (7835/10587)
remote: Counting objects: 75% (7941/10587)
remote: Counting objects: 76% (8047/10587)
remote: Counting objects: 77% (8152/10587)
remote: Counting objects: 78% (8258/10587)
remote: Counting objects: 79% (8364/10587)
remote: Counting objects: 80% (8470/10587)
remote: Counting objects: 81% (8576/10587)
remote: Counting objects: 82% (8682/10587)
remote: Counting objects: 83% (8788/10587)
remote: Counting objects: 84% (8894/10587)
remote: Counting objects: 85% (8999/10587)
remote: Counting objects: 86% (9105/10587)
remote: Counting objects: 87% (9211/10587)
remote: Counting objects: 88% (9317/10587)
remote: Counting objects: 89% (9423/10587)
remote: Counting objects: 90% (9529/10587)
remote: Counting objects: 91% (9635/10587)
remote: Counting objects: 92% (9741/10587)
remote: Counting objects: 93% (9846/10587)
remote: Counting objects: 94% (9952/10587)
remote: Counting objects: 95% (10058/10587)
remote: Counting objects: 96% (10164/10587)
remote: Counting objects: 97% (10270/10587)
remote: Counting objects: 98% (10376/10587)
remote: Counting objects: 99% (10482/10587)
remote: Counting objects: 100% (10587/10587)
remote: Counting objects: 100% (10587/10587), done.
3.86 s
remote: Compressing objects: 0% (1/2956)
remote: Compressing objects: 1% (30/2956)
remote: Compressing objects: 2% (60/2956)
remote: Compressing objects: 3% (89/2956)
remote: Compressing objects: 4% (119/2956)
remote: Compressing objects: 5% (148/2956)
remote: Compressing objects: 6% (178/2956)
remote: Compressing objects: 7% (207/2956)
remote: Compressing objects: 8% (237/2956)
remote: Compressing objects: 9% (267/2956)
remote: Compressing objects: 10% (296/2956)
remote: Compressing objects: 11% (326/2956)
remote: Compressing objects: 12% (355/2956)
remote: Compressing objects: 13% (385/2956)
remote: Compressing objects: 14% (414/2956)
remote: Compressing objects: 15% (444/2956)
remote: Compressing objects: 16% (473/2956)
remote: Compressing objects: 17% (503/2956)
remote: Compressing objects: 17% (526/2956)
remote: Compressing objects: 18% (533/2956)
remote: Compressing objects: 19% (562/2956)
remote: Compressing objects: 20% (592/2956)
remote: Compressing objects: 21% (621/2956)
remote: Compressing objects: 22% (651/2956)
remote: Compressing objects: 23% (680/2956)
remote: Compressing objects: 24% (710/2956)
remote: Compressing objects: 25% (739/2956)
remote: Compressing objects: 26% (769/2956)
remote: Compressing objects: 26% (784/2956)
remote: Compressing objects: 27% (799/2956)
remote: Compressing objects: 28% (828/2956)
remote: Compressing objects: 29% (858/2956)
remote: Compressing objects: 30% (887/2956)
remote: Compressing objects: 31% (917/2956)
remote: Compressing objects: 32% (946/2956)
remote: Compressing objects: 33% (976/2956)
remote: Compressing objects: 34% (1006/2956)
remote: Compressing objects: 35% (1035/2956)
remote: Compressing objects: 36% (1065/2956)
remote: Compressing objects: 37% (1094/2956)
remote: Compressing objects: 38% (1124/2956)
remote: Compressing objects: 39% (1153/2956)
remote: Compressing objects: 40% (1183/2956)
remote: Compressing objects: 41% (1212/2956)
remote: Compressing objects: 42% (1242/2956)
remote: Compressing objects: 43% (1272/2956)
remote: Compressing objects: 44% (1301/2956)
remote: Compressing objects: 45% (1331/2956)
remote: Compressing objects: 46% (1360/2956)
remote: Compressing objects: 47% (1390/2956)
remote: Compressing objects: 48% (1419/2956)
remote: Compressing objects: 49% (1449/2956)
remote: Compressing objects: 50% (1478/2956)
remote: Compressing objects: 51% (1508/2956)
remote: Compressing objects: 52% (1538/2956)
remote: Compressing objects: 53% (1567/2956)
remote: Compressing objects: 54% (1597/2956)
remote: Compressing objects: 55% (1626/2956)
remote: Compressing objects: 56% (1656/2956)
remote: Compressing objects: 57% (1685/2956)
remote: Compressing objects: 58% (1715/2956)
remote: Compressing objects: 59% (1745/2956)
remote: Compressing objects: 60% (1774/2956)
remote: Compressing objects: 61% (1804/2956)
remote: Compressing objects: 62% (1833/2956)
remote: Compressing objects: 63% (1863/2956)
remote: Compressing objects: 64% (1892/2956)
remote: Compressing objects: 65% (1922/2956)
remote: Compressing objects: 66% (1951/2956)
remote: Compressing objects: 67% (1981/2956)
remote: Compressing objects: 68% (2011/2956)
remote: Compressing objects: 69% (2040/2956)
remote: Compressing objects: 70% (2070/2956)
remote: Compressing objects: 71% (2099/2956)
remote: Compressing objects: 72% (2129/2956)
remote: Compressing objects: 73% (2158/2956)
remote: Compressing objects: 74% (2188/2956)
remote: Compressing objects: 75% (2217/2956)
remote: Compressing objects: 76% (2247/2956)
remote: Compressing objects: 77% (2277/2956)
remote: Compressing objects: 78% (2306/2956)
remote: Compressing objects: 79% (2336/2956)
remote: Compressing objects: 80% (2365/2956)
remote: Compressing objects: 81% (2395/2956)
remote: Compressing objects: 82% (2424/2956)
remote: Compressing objects: 83% (2454/2956)
remote: Compressing objects: 84% (2484/2956)
remote: Compressing objects: 85% (2513/2956)
remote: Compressing objects: 86% (2543/2956)
remote: Compressing objects: 87% (2572/2956)
remote: Compressing objects: 88% (2602/2956)
remote: Compressing objects: 89% (2631/2956)
remote: Compressing objects: 90% (2661/2956)
remote: Compressing objects: 91% (2690/2956)
remote: Compressing objects: 92% (2720/2956)
remote: Compressing objects: 93% (2750/2956)
remote: Compressing objects: 94% (2779/2956)
remote: Compressing objects: 95% (2809/2956)
remote: Compressing objects: 96% (2838/2956)
remote: Compressing objects: 97% (2868/2956)
remote: Compressing objects: 98% (2897/2956)
remote: Compressing objects: 99% (2927/2956)
remote: Compressing objects: 100% (2956/2956)
remote: Compressing objects: 100% (2956/2956), done.
9.53 s
Receiving objects: 0% (1/87989)
Receiving objects: 1% (880/87989)
Receiving objects: 2% (1760/87989)
Receiving objects: 3% (2640/87989)
Receiving objects: 4% (3520/87989)
Receiving objects: 5% (4400/87989)
Receiving objects: 6% (5280/87989)
Receiving objects: 7% (6160/87989)
Receiving objects: 8% (7040/87989), 10.54 MiB | 21.07 MiB/s
Receiving objects: 9% (7920/87989), 10.54 MiB | 21.07 MiB/s
Receiving objects: 10% (8799/87989), 10.54 MiB | 21.07 MiB/s
Receiving objects: 11% (9679/87989), 10.54 MiB | 21.07 MiB/s
Receiving objects: 12% (10559/87989), 10.54 MiB | 21.07 MiB/s
Receiving objects: 13% (11439/87989), 10.54 MiB | 21.07 MiB/s
Receiving objects: 14% (12319/87989), 10.54 MiB | 21.07 MiB/s
Receiving objects: 15% (13199/87989), 10.54 MiB | 21.07 MiB/s
Receiving objects: 16% (14079/87989), 10.54 MiB | 21.07 MiB/s
Receiving objects: 17% (14959/87989), 10.54 MiB | 21.07 MiB/s
Receiving objects: 18% (15839/87989), 10.54 MiB | 21.07 MiB/s
Receiving objects: 19% (16718/87989), 10.54 MiB | 21.07 MiB/s
Receiving objects: 20% (17598/87989), 10.54 MiB | 21.07 MiB/s
Receiving objects: 21% (18478/87989), 10.54 MiB | 21.07 MiB/s
Receiving objects: 22% (19358/87989), 10.54 MiB | 21.07 MiB/s
Receiving objects: 23% (20238/87989), 10.54 MiB | 21.07 MiB/s
Receiving objects: 24% (21118/87989), 10.54 MiB | 21.07 MiB/s
Receiving objects: 25% (21998/87989), 10.54 MiB | 21.07 MiB/s
Receiving objects: 26% (22878/87989), 10.54 MiB | 21.07 MiB/s
Receiving objects: 27% (23758/87989), 10.54 MiB | 21.07 MiB/s
Receiving objects: 28% (24637/87989), 10.54 MiB | 21.07 MiB/s
Receiving objects: 29% (25517/87989), 10.54 MiB | 21.07 MiB/s
Receiving objects: 30% (26397/87989), 10.54 MiB | 21.07 MiB/s
Receiving objects: 31% (27277/87989), 10.54 MiB | 21.07 MiB/s
Receiving objects: 32% (28157/87989), 10.54 MiB | 21.07 MiB/s
Receiving objects: 33% (29037/87989), 10.54 MiB | 21.07 MiB/s
Receiving objects: 34% (29917/87989), 10.54 MiB | 21.07 MiB/s
Receiving objects: 35% (30797/87989), 10.54 MiB | 21.07 MiB/s
Receiving objects: 35% (31444/87989), 29.36 MiB | 29.35 MiB/s
Receiving objects: 36% (31677/87989), 29.36 MiB | 29.35 MiB/s
Receiving objects: 37% (32556/87989), 29.36 MiB | 29.35 MiB/s
Receiving objects: 38% (33436/87989), 29.36 MiB | 29.35 MiB/s
Receiving objects: 39% (34316/87989), 29.36 MiB | 29.35 MiB/s
Receiving objects: 40% (35196/87989), 29.36 MiB | 29.35 MiB/s
Receiving objects: 41% (36076/87989), 29.36 MiB | 29.35 MiB/s
Receiving objects: 42% (36956/87989), 29.36 MiB | 29.35 MiB/s
Receiving objects: 43% (37836/87989), 29.36 MiB | 29.35 MiB/s
Receiving objects: 44% (38716/87989), 44.03 MiB | 29.25 MiB/s
Receiving objects: 45% (39596/87989), 44.03 MiB | 29.25 MiB/s
Receiving objects: 46% (40475/87989), 44.03 MiB | 29.25 MiB/s
Receiving objects: 47% (41355/87989), 44.03 MiB | 29.25 MiB/s
Receiving objects: 48% (42235/87989), 44.03 MiB | 29.25 MiB/s
Receiving objects: 49% (43115/87989), 44.03 MiB | 29.25 MiB/s
Receiving objects: 50% (43995/87989), 44.03 MiB | 29.25 MiB/s
Receiving objects: 51% (44875/87989), 44.03 MiB | 29.25 MiB/s
Receiving objects: 52% (45755/87989), 44.03 MiB | 29.25 MiB/s
Receiving objects: 53% (46635/87989), 44.03 MiB | 29.25 MiB/s
Receiving objects: 53% (47386/87989), 44.03 MiB | 29.25 MiB/s
Receiving objects: 54% (47515/87989), 59.93 MiB | 29.89 MiB/s
Receiving objects: 55% (48394/87989), 59.93 MiB | 29.89 MiB/s
Receiving objects: 56% (49274/87989), 59.93 MiB | 29.89 MiB/s
Receiving objects: 57% (50154/87989), 59.93 MiB | 29.89 MiB/s
Receiving objects: 58% (51034/87989), 59.93 MiB | 29.89 MiB/s
Receiving objects: 59% (51914/87989), 59.93 MiB | 29.89 MiB/s
Receiving objects: 60% (52794/87989), 75.75 MiB | 30.21 MiB/s
Receiving objects: 61% (53674/87989), 75.75 MiB | 30.21 MiB/s
Receiving objects: 62% (54554/87989), 75.75 MiB | 30.21 MiB/s
Receiving objects: 63% (55434/87989), 75.75 MiB | 30.21 MiB/s
Receiving objects: 64% (56313/87989), 75.75 MiB | 30.21 MiB/s
Receiving objects: 65% (57193/87989), 75.75 MiB | 30.21 MiB/s
Receiving objects: 65% (57330/87989), 91.44 MiB | 30.32 MiB/s
Receiving objects: 66% (58073/87989), 91.44 MiB | 30.32 MiB/s
Receiving objects: 67% (58953/87989), 91.44 MiB | 30.32 MiB/s
Receiving objects: 68% (59833/87989), 108.57 MiB | 30.88 MiB/s
Receiving objects: 69% (60713/87989), 108.57 MiB | 30.88 MiB/s
Receiving objects: 70% (61593/87989), 108.57 MiB | 30.88 MiB/s
Receiving objects: 71% (62473/87989), 108.57 MiB | 30.88 MiB/s
Receiving objects: 72% (63353/87989), 108.57 MiB | 30.88 MiB/s
Receiving objects: 72% (64141/87989), 123.87 MiB | 30.83 MiB/s
Receiving objects: 73% (64232/87989), 123.87 MiB | 30.83 MiB/s
Receiving objects: 74% (65112/87989), 123.87 MiB | 30.83 MiB/s
Receiving objects: 75% (65992/87989), 123.87 MiB | 30.83 MiB/s
Receiving objects: 76% (66872/87989), 123.87 MiB | 30.83 MiB/s
Receiving objects: 77% (67752/87989), 123.87 MiB | 30.83 MiB/s
Receiving objects: 78% (68632/87989), 123.87 MiB | 30.83 MiB/s
Receiving objects: 79% (69512/87989), 123.87 MiB | 30.83 MiB/s
Receiving objects: 80% (70392/87989), 123.87 MiB | 30.83 MiB/s
Receiving objects: 81% (71272/87989), 123.87 MiB | 30.83 MiB/s
Receiving objects: 82% (72151/87989), 123.87 MiB | 30.83 MiB/s
Receiving objects: 83% (73031/87989), 123.87 MiB | 30.83 MiB/s
Receiving objects: 84% (73911/87989), 123.87 MiB | 30.83 MiB/s
Receiving objects: 85% (74791/87989), 140.23 MiB | 30.98 MiB/s
Receiving objects: 86% (75671/87989), 140.23 MiB | 30.98 MiB/s
Receiving objects: 87% (76551/87989), 140.23 MiB | 30.98 MiB/s
Receiving objects: 88% (77431/87989), 140.23 MiB | 30.98 MiB/s
Receiving objects: 89% (78311/87989), 140.23 MiB | 30.98 MiB/s
Receiving objects: 90% (79191/87989), 140.23 MiB | 30.98 MiB/s
Receiving objects: 91% (80070/87989), 140.23 MiB | 30.98 MiB/s
Receiving objects: 92% (80950/87989), 140.23 MiB | 30.98 MiB/s
Receiving objects: 93% (81830/87989), 140.23 MiB | 30.98 MiB/s
Receiving objects: 94% (82710/87989), 140.23 MiB | 30.98 MiB/s
Receiving objects: 95% (83590/87989), 140.23 MiB | 30.98 MiB/s
Receiving objects: 96% (84470/87989), 140.23 MiB | 30.98 MiB/s
Receiving objects: 97% (85350/87989), 140.23 MiB | 30.98 MiB/s
Receiving objects: 97% (86041/87989), 140.23 MiB | 30.98 MiB/s
Receiving objects: 98% (86230/87989), 156.68 MiB | 32.03 MiB/s
Receiving objects: 99% (87110/87989), 173.68 MiB | 31.57 MiB/s
remote: Total 87989 (delta 8644), reused 8407 (delta 7605), pack-reused 77402 (from 3)
9.53 s
Receiving objects: 100% (87989/87989), 173.68 MiB | 31.57 MiB/s
Receiving objects: 100% (87989/87989), 176.53 MiB | 31.22 MiB/s, done.
10.65 s
Resolving deltas: 0% (0/59509)
Resolving deltas: 1% (596/59509)
Resolving deltas: 2% (1191/59509)
Resolving deltas: 3% (1786/59509)
Resolving deltas: 4% (2381/59509)
Resolving deltas: 5% (2977/59509)
Resolving deltas: 6% (3571/59509)
Resolving deltas: 7% (4166/59509)
Resolving deltas: 8% (4761/59509)
Resolving deltas: 9% (5357/59509)
Resolving deltas: 10% (5952/59509)
Resolving deltas: 11% (6546/59509)
Resolving deltas: 12% (7142/59509)
Resolving deltas: 13% (7737/59509)
Resolving deltas: 14% (8332/59509)
Resolving deltas: 15% (8929/59509)
Resolving deltas: 16% (9522/59509)
Resolving deltas: 17% (10117/59509)
Resolving deltas: 18% (10712/59509)
Resolving deltas: 19% (11307/59509)
Resolving deltas: 20% (11902/59509)
Resolving deltas: 21% (12497/59509)
Resolving deltas: 22% (13093/59509)
Resolving deltas: 23% (13688/59509)
Resolving deltas: 24% (14283/59509)
Resolving deltas: 25% (14878/59509)
Resolving deltas: 26% (15473/59509)
Resolving deltas: 27% (16068/59509)
Resolving deltas: 28% (16663/59509)
Resolving deltas: 29% (17258/59509)
Resolving deltas: 30% (17853/59509)
Resolving deltas: 31% (18448/59509)
Resolving deltas: 32% (19043/59509)
Resolving deltas: 33% (19638/59509)
Resolving deltas: 34% (20235/59509)
Resolving deltas: 35% (20829/59509)
Resolving deltas: 36% (21424/59509)
Resolving deltas: 37% (22019/59509)
Resolving deltas: 38% (22614/59509)
Resolving deltas: 39% (23210/59509)
Resolving deltas: 40% (23804/59509)
Resolving deltas: 41% (24399/59509)
Resolving deltas: 42% (24994/59509)
Resolving deltas: 43% (25589/59509)
Resolving deltas: 44% (26185/59509)
Resolving deltas: 45% (26780/59509)
Resolving deltas: 46% (27375/59509)
Resolving deltas: 47% (27971/59509)
Resolving deltas: 48% (28566/59509)
Resolving deltas: 49% (29160/59509)
Resolving deltas: 50% (29755/59509)
Resolving deltas: 51% (30351/59509)
Resolving deltas: 52% (30945/59509)
Resolving deltas: 53% (31540/59509)
Resolving deltas: 54% (32135/59509)
Resolving deltas: 55% (32730/59509)
Resolving deltas: 56% (33326/59509)
Resolving deltas: 57% (33921/59509)
Resolving deltas: 58% (34516/59509)
Resolving deltas: 59% (35111/59509)
Resolving deltas: 60% (35708/59509)
Resolving deltas: 61% (36301/59509)
Resolving deltas: 62% (36896/59509)
Resolving deltas: 63% (37491/59509)
Resolving deltas: 64% (38087/59509)
Resolving deltas: 65% (38681/59509)
Resolving deltas: 66% (39276/59509)
Resolving deltas: 67% (39872/59509)
Resolving deltas: 68% (40467/59509)
Resolving deltas: 69% (41062/59509)
Resolving deltas: 70% (41657/59509)
Resolving deltas: 71% (42252/59509)
Resolving deltas: 72% (42847/59509)
Resolving deltas: 73% (43443/59509)
Resolving deltas: 74% (44037/59509)
Resolving deltas: 75% (44632/59509)
Resolving deltas: 76% (45227/59509)
Resolving deltas: 77% (45822/59509)
Resolving deltas: 78% (46418/59509)
Resolving deltas: 79% (47013/59509)
Resolving deltas: 80% (47609/59509)
Resolving deltas: 81% (48203/59509)
Resolving deltas: 82% (48799/59509)
Resolving deltas: 83% (49393/59509)
Resolving deltas: 84% (49988/59509)
Resolving deltas: 85% (50583/59509)
Resolving deltas: 86% (51178/59509)
Resolving deltas: 87% (51773/59509)
Resolving deltas: 88% (52368/59509)
Resolving deltas: 89% (52965/59509)
Resolving deltas: 90% (53559/59509)
Resolving deltas: 91% (54154/59509)
Resolving deltas: 92% (54749/59509)
Resolving deltas: 92% (54751/59509)
Resolving deltas: 93% (55344/59509)
Resolving deltas: 94% (55939/59509)
Resolving deltas: 95% (56534/59509)
Resolving deltas: 96% (57129/59509)
Resolving deltas: 97% (57724/59509)
Resolving deltas: 98% (58319/59509)
Resolving deltas: 99% (58914/59509)
Resolving deltas: 100% (59509/59509)
Resolving deltas: 100% (59509/59509), done.
11.44 s
Fetching commit 891dec7c25b5d9026c099da021ec7ae3b757dee9 for codex/docs-before-consolidation-20260914 ...
11.44 s
$ /nix/store/bcnisk3ydfgv26v2gw3zlky24g00yww2-git-2.54.0/bin/git fetch origin 891dec7c25b5d9026c099da021ec7ae3b757dee9
11.98 s
From https://github.com/alphal00p/gammaloop
11.98 s
* branch 891dec7c25b5d9026c099da021ec7ae3b757dee9 -> FETCH_HEAD
12.00 s
$ /nix/store/9ypz3flqsrl5xl495mm8h645gadjsxi1-coreutils-9.11/bin/timeout --kill-after=15s 7200s /nix/store/bcnisk3ydfgv26v2gw3zlky24g00yww2-git-2.54.0/bin/git -c advice.detachedHead=false checkout 891dec7c25b5d9026c099da021ec7ae3b757dee9
12.29 s
HEAD is now at 891dec7c2 change photos
12.30 s
$ /nix/store/9ypz3flqsrl5xl495mm8h645gadjsxi1-coreutils-9.11/bin/timeout --kill-after=15s 7200s /nix/store/23zk8sgzamrbmj1fday15szf7f2279s8-nix-2.34.7/bin/nix --extra-experimental-features nix-command --extra-experimental-features flakes --log-format internal-json run .#packages.x86_64-linux.nix-ci-check-gammaloop-nextest-docs --print-build-logs
12.50 s
21.94 s
evaluating derivation 'g
copying '/nix/store/bgss
evaluating derivation 'g
copying '/nix/store/bgss
evaluating derivation 'g
copying '/nix/store/bgss
evaluating derivation 'g
copying '/nix/store/bgss
evaluating derivation 'g
copying '/nix/store/bgss
evaluating derivation 'g
copying '/nix/store/bgss
evaluating derivation 'g
copying '/nix/store/bgss
evaluating derivation 'g
copying '/nix/store/bgss
evaluating derivation 'g
[0 /1 built]
[1 /0 /1 built] building g gammaloop-nextest-docs> Extracting 2 binaries to /build/source
21.99 s
gammaloop-nextest-docs> Extracted 5 files to /build/source in 0.05s
22.00 s
gammaloop-nextest-docs> ------------
22.00 s
gammaloop-nextest-docs> Nextest run ID ad045fc3-462b-4767-b5f8-e32ee054d46b with nextest profile: ci_gammaloop
22.00 s
gammaloop-nextest-docs> Starting 129 tests across 2 binaries
49.74 s
gammaloop-nextest-docs> FAIL [ 27.734s] (128/129) alphal00p-docs-builder provenance_tests :: each_build_captures_one_revision_before_rendering
49.74 s
gammaloop-nextest-docs> stdout ---
49.74 s
gammaloop-nextest-docs>
49.74 s
gammaloop-nextest-docs> running 1 test
49.74 s
gammaloop-nextest-docs>
49.74 s
gammaloop-nextest-docs> running 1 test
49.74 s
gammaloop-nextest-docs> test provenance_tests::each_build_captures_one_revision_before_rendering ... FAILED
49.74 s
gammaloop-nextest-docs>
49.74 s
gammaloop-nextest-docs> failures:
49.74 s
gammaloop-nextest-docs>
49.74 s
gammaloop-nextest-docs> failures:
49.74 s
gammaloop-nextest-docs> provenance_tests::each_build_captures_one_revision_before_rendering
49.74 s
gammaloop-nextest-docs>
49.74 s
gammaloop-nextest-docs> test result: FAILED. 0 passed; 1 failed; 0 ignored; 0 measured; 128 filtered out; finished in 27.66s
49.74 s
gammaloop-nextest-docs>
49.74 s
gammaloop-nextest-docs> test provenance_tests::each_build_captures_one_revision_before_rendering ... FAILED
49.74 s
gammaloop-nextest-docs>
49.74 s
gammaloop-nextest-docs> failures:
49.74 s
gammaloop-nextest-docs>
49.74 s
gammaloop-nextest-docs> failures:
49.74 s
gammaloop-nextest-docs> provenance_tests::each_build_captures_one_revision_before_rendering
49.74 s
gammaloop-nextest-docs>
49.74 s
gammaloop-nextest-docs> test result: FAILED. 0 passed; 1 failed; 0 ignored; 0 measured; 128 filtered out; finished in 27.72s
49.74 s
gammaloop-nextest-docs>
49.74 s
gammaloop-nextest-docs> stderr ---
49.74 s
gammaloop-nextest-docs> warning: bundle export is experimental
49.74 s
gammaloop-nextest-docs> = hint: its behaviour may change at any time
49.74 s
gammaloop-nextest-docs> = hint: do not rely on this feature for production use cases
49.74 s
gammaloop-nextest-docs>
49.74 s
gammaloop-nextest-docs> warning: unknown font family: roboto
49.74 s
gammaloop-nextest-docs> ┌─ crates/linnest/typst/docs/manual.typ:11:28
49.74 s
gammaloop-nextest-docs> │
49.74 s
gammaloop-nextest-docs> 11 │ #set text(size: 10pt, font: "Roboto")
49.74 s
gammaloop-nextest-docs> │ ^^^^^^^^
49.74 s
gammaloop-nextest-docs>
49.74 s
gammaloop-nextest-docs> warning: unknown font family: roboto
49.74 s
gammaloop-nextest-docs> ┌─ crates/linnest/typst/docs/manual.typ:14:29
49.74 s
gammaloop-nextest-docs> │
49.74 s
gammaloop-nextest-docs> 14 │ #set text(size: 3em, font: "Roboto")
49.74 s
gammaloop-nextest-docs> │ ^^^^^^^^
49.74 s
gammaloop-nextest-docs>
49.74 s
gammaloop-nextest-docs> warning: unknown font family: roboto
49.74 s
gammaloop-nextest-docs> ┌─ crates/linnest/typst/docs/manual.typ:16:31
49.74 s
gammaloop-nextest-docs> │
49.74 s
gammaloop-nextest-docs> 16 │ #set text(size: 0.3em, font: "Roboto")
49.74 s
gammaloop-nextest-docs> │ ^^^^^^^^
49.74 s
gammaloop-nextest-docs>
49.74 s
gammaloop-nextest-docs> warning: overline was ignored during MathML export
49.74 s
gammaloop-nextest-docs> ┌─ crates/linnest/typst/docs/manual.typ:949:55
49.74 s
gammaloop-nextest-docs> │
49.74 s
gammaloop-nextest-docs> 949 │ + sum_("dangling" e) c_("dangling-centroid") / (d(e, overline(v)) + epsilon)
49.74 s
gammaloop-nextest-docs> │ ^^^^^^^^^^^
49.74 s
gammaloop-nextest-docs>
49.74 s
gammaloop-nextest-docs> warning: overline was ignored during MathML export
49.74 s
gammaloop-nextest-docs> ┌─ crates/linnest/typst/docs/manual.typ:953:8
49.74 s
gammaloop-nextest-docs> │
49.74 s
gammaloop-nextest-docs> 953 │ Here $overline(v)$ is the mean node position. The centroid term pushes every
49.74 s
gammaloop-nextest-docs> │ ^^^^^^^^^^^
49.74 s
gammaloop-nextest-docs>
49.74 s
gammaloop-nextest-docs>
49.74 s
gammaloop-nextest-docs> thread 'provenance_tests::each_build_captures_one_revision_before_rendering' (241) panicked at crates/alphal00p-docs-builder/src/provenance_tests.rs:297:14:
49.74 s
gammaloop-nextest-docs> called `Result::unwrap()` on an `Err` value: generated site has broken links:
49.74 s
gammaloop-nextest-docs> products/linnet/latest/reference/interfaces/index.html -> https://github.com/alphal00p/gammaloop/blob/1111111111111111111111111111111111111111/crates/linnet-py/examples/physics_render_settings.py (missing repository source file crates/linnet-py/examples/physics_render_settings.py)
49.74 s
gammaloop-nextest-docs> products/linnet/latest/reference/interfaces/index.html -> https://github.com/alphal00p/gammaloop/blob/1111111111111111111111111111111111111111/crates/linnet-py/examples/layout_stream.py (missing repository source file crates/linnet-py/examples/layout_stream.py)
49.74 s
gammaloop-nextest-docs> products/linnet/latest/playground/index.html -> https://github.com/alphal00p/gammaloop/blob/1111111111111111111111111111111111111111/crates/linnet-py/examples/layout_stream.py (missing repository source file crates/linnet-py/examples/layout_stream.py)
49.74 s
gammaloop-nextest-docs> products/linnet/latest/guides/python-rendering/index.html -> https://github.com/alphal00p/gammaloop/blob/1111111111111111111111111111111111111111/crates/linnet-py/examples/rendering_api.py (missing repository source file crates/linnet-py/examples/rendering_api.py)
49.74 s
gammaloop-nextest-docs>
49.74 s
gammaloop-nextest-docs> Location:
49.74 s
gammaloop-nextest-docs> crates/alphal00p-docs-builder/src/lib.rs:4940:9
49.74 s
gammaloop-nextest-docs> stack backtrace:
49.74 s
gammaloop-nextest-docs> 0: __rustc::rust_begin_unwind
49.74 s
gammaloop-nextest-docs> 1: core::panicking::panic_fmt
49.74 s
gammaloop-nextest-docs> 2: core::result::unwrap_failed
49.74 s
gammaloop-nextest-docs> 3: alphal00p_docs_builder::provenance_tests::each_build_captures_one_revision_before_rendering
49.74 s
gammaloop-nextest-docs> 4: <alphal00p_docs_builder::provenance_tests::each_build_captures_one_revision_before_rendering::{closure#0} as core::ops::function::FnOnce<()>>::call_once
49.74 s
gammaloop-nextest-docs> note: Some details are omitted, run with `RUST_BACKTRACE=full` for a verbose backtrace.
49.74 s
gammaloop-nextest-docs>
49.74 s
gammaloop-nextest-docs> thread 'provenance_tests::each_build_captures_one_revision_before_rendering' (197) panicked at crates/alphal00p-docs-builder/src/provenance_tests.rs:274:9:
49.74 s
gammaloop-nextest-docs> assertion failed: command.status().unwrap().success()
49.74 s
gammaloop-nextest-docs> stack backtrace:
49.74 s
gammaloop-nextest-docs> 0: __rustc::rust_begin_unwind
49.74 s
gammaloop-nextest-docs> 1: core::panicking::panic_fmt
49.74 s
gammaloop-nextest-docs> 2: core::panicking::panic
49.74 s
gammaloop-nextest-docs> 3: alphal00p_docs_builder::provenance_tests::each_build_captures_one_revision_before_rendering
49.74 s
gammaloop-nextest-docs> 4: <alphal00p_docs_builder::provenance_tests::each_build_captures_one_revision_before_rendering::{closure#0} as core::ops::function::FnOnce<()>>::call_once
49.74 s
gammaloop-nextest-docs> note: Some details are omitted, run with `RUST_BACKTRACE=full` for a verbose backtrace.
49.74 s
gammaloop-nextest-docs>
55.72 s
gammaloop-nextest-docs> ------------
55.72 s
gammaloop-nextest-docs> Summary [ 33.714s] 129 tests run: 128 passed , 1 failed , 0 skipped
55.72 s
gammaloop-nextest-docs> FAIL [ 27.734s] (128/129) alphal00p-docs-builder provenance_tests :: each_build_captures_one_revision_before_rendering
55.72 s
gammaloop-nextest-docs> stdout ---
55.72 s
gammaloop-nextest-docs>
55.72 s
gammaloop-nextest-docs> running 1 test
55.72 s
gammaloop-nextest-docs>
55.72 s
gammaloop-nextest-docs> running 1 test
55.72 s
gammaloop-nextest-docs> test provenance_tests::each_build_captures_one_revision_before_rendering ... FAILED
55.72 s
gammaloop-nextest-docs>
55.72 s
gammaloop-nextest-docs> failures:
55.72 s
gammaloop-nextest-docs>
55.72 s
gammaloop-nextest-docs> failures:
55.72 s
gammaloop-nextest-docs> provenance_tests::each_build_captures_one_revision_before_rendering
55.72 s
gammaloop-nextest-docs>
55.72 s
gammaloop-nextest-docs> test result: FAILED. 0 passed; 1 failed; 0 ignored; 0 measured; 128 filtered out; finished in 27.66s
55.72 s
gammaloop-nextest-docs>
55.72 s
gammaloop-nextest-docs> test provenance_tests::each_build_captures_one_revision_before_rendering ... FAILED
55.72 s
gammaloop-nextest-docs>
55.72 s
gammaloop-nextest-docs> failures:
55.72 s
gammaloop-nextest-docs>
55.72 s
gammaloop-nextest-docs> failures:
55.72 s
gammaloop-nextest-docs> provenance_tests::each_build_captures_one_revision_before_rendering
55.72 s
gammaloop-nextest-docs>
55.72 s
gammaloop-nextest-docs> test result: FAILED. 0 passed; 1 failed; 0 ignored; 0 measured; 128 filtered out; finished in 27.72s
55.72 s
gammaloop-nextest-docs>
55.72 s
gammaloop-nextest-docs> stderr ---
55.72 s
gammaloop-nextest-docs> warning: bundle export is experimental
55.72 s
gammaloop-nextest-docs> = hint: its behaviour may change at any time
55.72 s
gammaloop-nextest-docs> = hint: do not rely on this feature for production use cases
55.72 s
gammaloop-nextest-docs>
55.72 s
gammaloop-nextest-docs> warning: unknown font family: roboto
55.72 s
gammaloop-nextest-docs> ┌─ crates/linnest/typst/docs/manual.typ:11:28
55.72 s
gammaloop-nextest-docs> │
55.72 s
gammaloop-nextest-docs> 11 │ #set text(size: 10pt, font: "Roboto")
55.72 s
gammaloop-nextest-docs> │ ^^^^^^^^
55.72 s
gammaloop-nextest-docs>
55.72 s
gammaloop-nextest-docs> warning: unknown font family: roboto
55.72 s
gammaloop-nextest-docs> ┌─ crates/linnest/typst/docs/manual.typ:14:29
55.72 s
gammaloop-nextest-docs> │
55.72 s
gammaloop-nextest-docs> 14 │ #set text(size: 3em, font: "Roboto")
55.72 s
gammaloop-nextest-docs> │ ^^^^^^^^
55.72 s
gammaloop-nextest-docs>
55.72 s
gammaloop-nextest-docs> warning: unknown font family: roboto
55.72 s
gammaloop-nextest-docs> ┌─ crates/linnest/typst/docs/manual.typ:16:31
55.72 s
gammaloop-nextest-docs> │
55.72 s
gammaloop-nextest-docs> 16 │ #set text(size: 0.3em, font: "Roboto")
55.72 s
gammaloop-nextest-docs> │ ^^^^^^^^
55.72 s
gammaloop-nextest-docs>
55.72 s
gammaloop-nextest-docs> warning: overline was ignored during MathML export
55.72 s
gammaloop-nextest-docs> ┌─ crates/linnest/typst/docs/manual.typ:949:55
55.72 s
gammaloop-nextest-docs> │
55.72 s
gammaloop-nextest-docs> 949 │ + sum_("dangling" e) c_("dangling-centroid") / (d(e, overline(v)) + epsilon)
55.72 s
gammaloop-nextest-docs> │ ^^^^^^^^^^^
55.72 s
gammaloop-nextest-docs>
55.72 s
gammaloop-nextest-docs> warning: overline was ignored during MathML export
55.72 s
gammaloop-nextest-docs> ┌─ crates/linnest/typst/docs/manual.typ:953:8
55.72 s
gammaloop-nextest-docs> │
55.72 s
gammaloop-nextest-docs> 953 │ Here $overline(v)$ is the mean node position. The centroid term pushes every
55.72 s
gammaloop-nextest-docs> │ ^^^^^^^^^^^
55.72 s
gammaloop-nextest-docs>
55.72 s
gammaloop-nextest-docs>
55.72 s
gammaloop-nextest-docs> thread 'provenance_tests::each_build_captures_one_revision_before_rendering' (241) panicked at crates/alphal00p-docs-builder/src/provenance_tests.rs:297:14:
55.72 s
gammaloop-nextest-docs> called `Result::unwrap()` on an `Err` value: generated site has broken links:
55.72 s
gammaloop-nextest-docs> products/linnet/latest/reference/interfaces/index.html -> https://github.com/alphal00p/gammaloop/blob/1111111111111111111111111111111111111111/crates/linnet-py/examples/physics_render_settings.py (missing repository source file crates/linnet-py/examples/physics_render_settings.py)
55.72 s
gammaloop-nextest-docs> products/linnet/latest/reference/interfaces/index.html -> https://github.com/alphal00p/gammaloop/blob/1111111111111111111111111111111111111111/crates/linnet-py/examples/layout_stream.py (missing repository source file crates/linnet-py/examples/layout_stream.py)
55.72 s
gammaloop-nextest-docs> products/linnet/latest/playground/index.html -> https://github.com/alphal00p/gammaloop/blob/1111111111111111111111111111111111111111/crates/linnet-py/examples/layout_stream.py (missing repository source file crates/linnet-py/examples/layout_stream.py)
55.72 s
gammaloop-nextest-docs> products/linnet/latest/guides/python-rendering/index.html -> https://github.com/alphal00p/gammaloop/blob/1111111111111111111111111111111111111111/crates/linnet-py/examples/rendering_api.py (missing repository source file crates/linnet-py/examples/rendering_api.py)
55.72 s
gammaloop-nextest-docs>
55.72 s
gammaloop-nextest-docs> Location:
55.72 s
gammaloop-nextest-docs> crates/alphal00p-docs-builder/src/lib.rs:4940:9
55.72 s
gammaloop-nextest-docs> stack backtrace:
55.72 s
gammaloop-nextest-docs> 0: __rustc::rust_begin_unwind
55.72 s
gammaloop-nextest-docs> 1: core::panicking::panic_fmt
55.72 s
gammaloop-nextest-docs> 2: core::result::unwrap_failed
55.72 s
gammaloop-nextest-docs> 3: alphal00p_docs_builder::provenance_tests::each_build_captures_one_revision_before_rendering
55.72 s
gammaloop-nextest-docs> 4: <alphal00p_docs_builder::provenance_tests::each_build_captures_one_revision_before_rendering::{closure#0} as core::ops::function::FnOnce<()>>::call_once
55.72 s
gammaloop-nextest-docs> note: Some details are omitted, run with `RUST_BACKTRACE=full` for a verbose backtrace.
55.72 s
gammaloop-nextest-docs>
55.72 s
gammaloop-nextest-docs> thread 'provenance_tests::each_build_captures_one_revision_before_rendering' (197) panicked at crates/alphal00p-docs-builder/src/provenance_tests.rs:274:9:
55.72 s
gammaloop-nextest-docs> assertion failed: command.status().unwrap().success()
55.72 s
gammaloop-nextest-docs> stack backtrace:
55.72 s
gammaloop-nextest-docs> 0: __rustc::rust_begin_unwind
55.72 s
gammaloop-nextest-docs> 1: core::panicking::panic_fmt
55.72 s
gammaloop-nextest-docs> 2: core::panicking::panic
55.72 s
gammaloop-nextest-docs> 3: alphal00p_docs_builder::provenance_tests::each_build_captures_one_revision_before_rendering
55.72 s
gammaloop-nextest-docs> 4: <alphal00p_docs_builder::provenance_tests::each_build_captures_one_revision_before_rendering::{closure#0} as core::ops::function::FnOnce<()>>::call_once
55.72 s
gammaloop-nextest-docs> note: Some details are omitted, run with `RUST_BACKTRACE=full` for a verbose backtrace.
55.72 s
gammaloop-nextest-docs>
55.72 s
gammaloop-nextest-docs> error : test run failed
55.75 s
gammaloop-nextest-docs>
55.75 s
gammaloop-nextest-docs> ========== nextest test summary ==========
55.75 s
gammaloop-nextest-docs> report: target/nextest/ci_gammaloop/junit.xml
55.75 s
gammaloop-nextest-docs> tests: 129, failures: 1, errors: 0
55.75 s
gammaloop-nextest-docs>
55.75 s
gammaloop-nextest-docs> 1. alphal00p-docs-builder::provenance_tests::each_build_captures_one_revision_before_rendering
55.75 s
gammaloop-nextest-docs> failure: test failure with exit code 101
55.75 s
gammaloop-nextest-docs> thread 'provenance_tests::each_build_captures_one_revision_before_rendering' (197) panicked at crates/alphal00p-docs-builder/src/provenance_tests.rs:274:9:
55.75 s
gammaloop-nextest-docs> assertion failed: command.status().unwrap().success()
55.75 s
gammaloop-nextest-docs> stack backtrace:
55.75 s
gammaloop-nextest-docs> 0: __rustc::rust_begin_unwind
55.75 s
gammaloop-nextest-docs> 1: core::panicking::panic_fmt
55.75 s
gammaloop-nextest-docs> 2: core::panicking::panic
55.75 s
gammaloop-nextest-docs> 3: alphal00p_docs_builder::provenance_tests::each_build_captures_one_revision_before_rendering
55.75 s
gammaloop-nextest-docs> 4: <alphal00p_docs_builder::provenance_tests::each_build_captures_one_revision_before_rendering::{closure#0} as core::ops::function::FnOnce<()>>::call_once
55.75 s
gammaloop-nextest-docs> note: Some details are omitted, run with `RUST_BACKTRACE=full` for a verbose backtrace.
55.75 s
gammaloop-nextest-docs> system-out
55.75 s
gammaloop-nextest-docs> running 1 test
55.75 s
gammaloop-nextest-docs>
55.75 s
gammaloop-nextest-docs> running 1 test
55.75 s
gammaloop-nextest-docs> test provenance_tests::each_build_captures_one_revision_before_rendering ... FAILED
55.75 s
gammaloop-nextest-docs>
55.75 s
gammaloop-nextest-docs> failures:
55.75 s
gammaloop-nextest-docs>
55.75 s
gammaloop-nextest-docs> failures:
55.75 s
gammaloop-nextest-docs> provenance_tests::each_build_captures_one_revision_before_rendering
55.75 s
gammaloop-nextest-docs>
55.75 s
gammaloop-nextest-docs> test result: FAILED. 0 passed; 1 failed; 0 ignored; 0 measured; 128 filtered out; finished in 27.66s
55.75 s
gammaloop-nextest-docs>
55.75 s
gammaloop-nextest-docs> test provenance_tests::each_build_captures_one_revision_before_rendering ... FAILED
55.75 s
gammaloop-nextest-docs>
55.75 s
gammaloop-nextest-docs> failures:
55.75 s
gammaloop-nextest-docs>
55.75 s
gammaloop-nextest-docs> failures:
55.75 s
gammaloop-nextest-docs> provenance_tests::each_build_captures_one_revision_before_rendering
55.75 s
gammaloop-nextest-docs>
55.75 s
gammaloop-nextest-docs> test result: FAILED. 0 passed; 1 failed; 0 ignored; 0 measured; 128 filtered out; finished in 27.72s
55.75 s
gammaloop-nextest-docs> system-err
55.75 s
gammaloop-nextest-docs> warning: bundle export is experimental
55.75 s
gammaloop-nextest-docs> = hint: its behaviour may change at any time
55.75 s
gammaloop-nextest-docs> = hint: do not rely on this feature for production use cases
55.75 s
gammaloop-nextest-docs>
55.75 s
gammaloop-nextest-docs> warning: unknown font family: roboto
55.75 s
gammaloop-nextest-docs> ┌─ crates/linnest/typst/docs/manual.typ:11:28
55.75 s
gammaloop-nextest-docs> │
55.75 s
gammaloop-nextest-docs> 11 │ #set text(size: 10pt, font: "Roboto")
55.75 s
gammaloop-nextest-docs> │ ^^^^^^^^
55.75 s
gammaloop-nextest-docs>
55.75 s
gammaloop-nextest-docs> warning: unknown font family: roboto
55.75 s
gammaloop-nextest-docs> ┌─ crates/linnest/typst/docs/manual.typ:14:29
55.75 s
gammaloop-nextest-docs> │
55.75 s
gammaloop-nextest-docs> 14 │ #set text(size: 3em, font: "Roboto")
55.75 s
gammaloop-nextest-docs> │ ^^^^^^^^
55.75 s
gammaloop-nextest-docs>
55.75 s
gammaloop-nextest-docs> warning: unknown font family: roboto
55.75 s
gammaloop-nextest-docs> ┌─ crates/linnest/typst/docs/manual.typ:16:31
55.75 s
gammaloop-nextest-docs> │
55.75 s
gammaloop-nextest-docs> 16 │ #set text(size: 0.3em, font: "Roboto")
55.75 s
gammaloop-nextest-docs> │ ^^^^^^^^
55.75 s
gammaloop-nextest-docs>
55.75 s
gammaloop-nextest-docs> warning: overline was ignored during MathML export
55.75 s
gammaloop-nextest-docs> ┌─ crates/linnest/typst/docs/manual.typ:949:55
55.75 s
gammaloop-nextest-docs> │
55.75 s
gammaloop-nextest-docs> 949 │ + sum_("dangling" e) c_("dangling-centroid") / (d(e, overline(v)) + epsilon)
55.75 s
gammaloop-nextest-docs> │ ^^^^^^^^^^^
55.75 s
gammaloop-nextest-docs>
55.75 s
gammaloop-nextest-docs> warning: overline was ignored during MathML export
55.75 s
gammaloop-nextest-docs> ┌─ crates/linnest/typst/docs/manual.typ:953:8
55.75 s
gammaloop-nextest-docs> │
55.75 s
gammaloop-nextest-docs> 953 │ Here $overline(v)$ is the mean node position. The centroid term pushes every
55.75 s
gammaloop-nextest-docs> │ ^^^^^^^^^^^
55.75 s
gammaloop-nextest-docs>
55.75 s
gammaloop-nextest-docs>
55.75 s
gammaloop-nextest-docs> thread 'provenance_tests::each_build_captures_one_revision_before_rendering' (241) panicked at crates/alphal00p-docs-builder/src/provenance_tests.rs:297:14:
55.75 s
gammaloop-nextest-docs> called `Result::unwrap()` on an `Err` value: generated site has broken links:
55.75 s
gammaloop-nextest-docs> products/linnet/latest/reference/interfaces/index.html -> https://github.com/alphal00p/gammaloop/blob/1111111111111111111111111111111111111111/crates/linnet-py/examples/physics_render_settings.py (missing repository source file crates/linnet-py/examples/physics_render_settings.py)
55.75 s
gammaloop-nextest-docs> products/linnet/latest/reference/interfaces/index.html -> https://github.com/alphal00p/gammaloop/blob/1111111111111111111111111111111111111111/crates/linnet-py/examples/layout_stream.py (missing repository source file crates/linnet-py/examples/layout_stream.py)
55.75 s
gammaloop-nextest-docs> products/linnet/latest/playground/index.html -> https://github.com/alphal00p/gammaloop/blob/1111111111111111111111111111111111111111/crates/linnet-py/examples/layout_stream.py (missing repository source file crates/linnet-py/examples/layout_stream.py)
55.75 s
gammaloop-nextest-docs> products/linnet/latest/guides/python-rendering/index.html -> https://github.com/alphal00p/gammaloop/blob/1111111111111111111111111111111111111111/crates/linnet-py/examples/rendering_api.py (missing repository source file crates/linnet-py/examples/rendering_api.py)
55.75 s
gammaloop-nextest-docs>
55.75 s
gammaloop-nextest-docs> Location:
55.75 s
gammaloop-nextest-docs> crates/alphal00p-docs-builder/src/lib.rs:4940:9
55.75 s
gammaloop-nextest-docs> stack backtrace:
55.75 s
gammaloop-nextest-docs> 0: __rustc::rust_begin_unwind
55.75 s
gammaloop-nextest-docs> 1: core::panicking::panic_fmt
55.75 s
gammaloop-nextest-docs> 2: core::result::unwrap_failed
55.75 s
gammaloop-nextest-docs> 3: alphal00p_docs_builder::provenance_tests::each_build_captures_one_revision_before_rendering
55.75 s
gammaloop-nextest-docs> 4: <alphal00p_docs_builder::provenance_tests::each_build_captures_one_revision_before_rendering::{closure#0} as core::ops::function::FnOnce<()>>::call_once
55.75 s
gammaloop-nextest-docs> note: Some details are omitted, run with `RUST_BACKTRACE=full` for a verbose backtrace.
55.75 s
gammaloop-nextest-docs>
55.75 s
gammaloop-nextest-docs> thread 'provenance_tests::each_build_captures_one_revision_before_rendering' (197) panicked at crates/alphal00p-docs-builder/src/provenance_tests.rs:274:9:
55.75 s
gammaloop-nextest-docs> assertion failed: command.status().unwrap().success()
55.75 s
gammaloop-nextest-docs> stack backtrace:
55.75 s
gammaloop-nextest-docs> 0: __rustc::rust_begin_unwind
55.75 s
gammaloop-nextest-docs> 1: core::panicking::panic_fmt
55.75 s
gammaloop-nextest-docs> 2: core::panicking::panic
55.75 s
gammaloop-nextest-docs> 3: alphal00p_docs_builder::provenance_tests::each_build_captures_one_revision_before_rendering
55.75 s
gammaloop-nextest-docs> 4: <alphal00p_docs_builder::provenance_tests::each_build_captures_one_revision_before_rendering::{closure#0} as core::ops::function::FnOnce<()>>::call_once
55.75 s
gammaloop-nextest-docs> note: Some details are omitted, run with `RUST_BACKTRACE=full` for a verbose backtrace.
55.75 s
gammaloop-nextest-docs> =========================================
55.77 s
gammaloop-nextest-docs> Extracting 2 binaries to /build/source
55.81 s
gammaloop-nextest-docs> Extracted 5 files to /build/source in 0.04s
55.81 s
gammaloop-nextest-docs> ------------
55.81 s
gammaloop-nextest-docs> Nextest run ID 4a58f56e-dc5e-4bfa-9762-7e482ecab559 with nextest profile: ci_gammaloop
55.81 s
gammaloop-nextest-docs> Starting 22 tests across 2 binaries
55.83 s
gammaloop-nextest-docs> ------------
55.83 s
gammaloop-nextest-docs> Summary [ 0.015s] 22 tests run: 22 passed , 0 skipped
55.86 s
gammaloop-nextest-docs>
55.86 s
gammaloop-nextest-docs> ========== nextest test summary ==========
55.86 s
gammaloop-nextest-docs> report: target/nextest/ci_gammaloop/junit.xml
55.86 s
gammaloop-nextest-docs> tests: 22, failures: 0, errors: 0
55.86 s
gammaloop-nextest-docs> No failing testcases found.
55.86 s
gammaloop-nextest-docs> =========================================
55.88 s
gammaloop-nextest-docs> Extracting 3 binaries (including 2 non-test binaries), 1 build script output directory, and 2 linked paths to /build/source
56.17 s
gammaloop-nextest-docs> Extracted 22 files to /build/source in 0.29s
56.18 s
gammaloop-nextest-docs> ------------
56.18 s
gammaloop-nextest-docs> Nextest run ID 0abfed65-fbb6-46e0-bde3-e7fc0e6b3ccc with nextest profile: ci_gammaloop
56.18 s
gammaloop-nextest-docs> Starting 89 tests across 1 binary
56.22 s
gammaloop-nextest-docs> ------------
56.22 s
gammaloop-nextest-docs> Summary [ 0.041s] 89 tests run: 89 passed , 0 skipped
56.25 s
gammaloop-nextest-docs>
56.25 s
gammaloop-nextest-docs> ========== nextest test summary ==========
56.25 s
gammaloop-nextest-docs> report: target/nextest/ci_gammaloop/junit.xml
56.25 s
gammaloop-nextest-docs> tests: 89, failures: 0, errors: 0
56.25 s
gammaloop-nextest-docs> No failing testcases found.
56.25 s
gammaloop-nextest-docs> =========================================
56.27 s
gammaloop-nextest-docs> Extracting 2 binaries to /build/source
56.31 s
gammaloop-nextest-docs> Extracted 5 files to /build/source in 0.05s
56.32 s
gammaloop-nextest-docs> ------------
56.32 s
gammaloop-nextest-docs> Nextest run ID d95e9177-2b66-428c-b9e1-a31934bc00f0 with nextest profile: ci_gammaloop
56.32 s
gammaloop-nextest-docs> Starting 10 tests across 2 binaries
70.24 s
gammaloop-nextest-docs> ------------
70.24 s
gammaloop-nextest-docs> Summary [ 13.918s] 10 tests run: 10 passed , 0 skipped
70.28 s
gammaloop-nextest-docs>
70.28 s
gammaloop-nextest-docs> ========== nextest test summary ==========
70.28 s
gammaloop-nextest-docs> report: target/nextest/ci_gammaloop/junit.xml
70.28 s
gammaloop-nextest-docs> tests: 10, failures: 0, errors: 0
70.28 s
gammaloop-nextest-docs> No failing testcases found.
70.28 s
gammaloop-nextest-docs> =========================================
70.29 s
gammaloop-nextest-docs> Extracting 1 binary to /build/source
70.33 s
gammaloop-nextest-docs> Extracted 4 files to /build/source in 0.04s
70.34 s
gammaloop-nextest-docs> ------------
70.34 s
gammaloop-nextest-docs> Nextest run ID b36d766c-5d87-439a-b38e-7f49e4de13f8 with nextest profile: ci_gammaloop
70.34 s
gammaloop-nextest-docs> Starting 0 tests across 1 binary
70.34 s
gammaloop-nextest-docs> ------------
70.34 s
gammaloop-nextest-docs> Summary [ 0.000s] 0 tests run: 0 passed , 0 skipped
70.37 s
gammaloop-nextest-docs>
70.37 s
gammaloop-nextest-docs> ========== nextest test summary ==========
70.37 s
gammaloop-nextest-docs> report: target/nextest/ci_gammaloop/junit.xml
70.37 s
gammaloop-nextest-docs> tests: 0, failures: 0, errors: 0
70.37 s
gammaloop-nextest-docs> No failing testcases found.
70.37 s
gammaloop-nextest-docs> =========================================
70.38 s
gammaloop-nextest-docs> Extracting 1 binary to /build/source
70.42 s
gammaloop-nextest-docs> Extracted 4 files to /build/source in 0.04s
70.43 s
gammaloop-nextest-docs> ------------
70.43 s
gammaloop-nextest-docs> Nextest run ID d4f26152-d69d-481a-8077-d67cf015ee56 with nextest profile: ci_gammaloop
70.43 s
gammaloop-nextest-docs> Starting 5 tests across 1 binary
70.43 s
gammaloop-nextest-docs> ------------
70.43 s
gammaloop-nextest-docs> Summary [ 0.005s] 5 tests run: 5 passed , 0 skipped
70.46 s
gammaloop-nextest-docs>
70.46 s
gammaloop-nextest-docs> ========== nextest test summary ==========
70.46 s
gammaloop-nextest-docs> report: target/nextest/ci_gammaloop/junit.xml
70.46 s
gammaloop-nextest-docs> tests: 5, failures: 0, errors: 0
70.46 s
gammaloop-nextest-docs> No failing testcases found.
70.46 s
gammaloop-nextest-docs> =========================================
70.68 s
error: Cannot build '/nix/store/9rs74w2crrwhaq7f0dxdi11wd515i6dj-gammaloop-nextest-docs.drv '.
70.68 s
Reason: builder failed with exit code 100 .
70.68 s
Output paths:
70.68 s
/nix/store/1jyipvscqlj4v0h7qjznydlgdlc4bjy7-gammaloop-nextest-docs
70.68 s
Last 347 log lines:
70.68 s
> Extracting 2 binaries to /build/source
70.68 s
> Extracted 5 files to /build/source in 0.05s
70.68 s
> ------------
70.68 s
> Nextest run ID ad045fc3-462b-4767-b5f8-e32ee054d46b with nextest profile: ci_gammaloop
70.68 s
> Starting 129 tests across 2 binaries
70.68 s
> FAIL [ 27.734s] (128/129) alphal00p-docs-builder provenance_tests :: each_build_captures_one_revision_before_rendering
70.68 s
> stdout ---
70.68 s
>
70.68 s
> running 1 test
70.68 s
>
70.68 s
> running 1 test
70.68 s
> test provenance_tests::each_build_captures_one_revision_before_rendering ... FAILED
70.68 s
>
70.68 s
> failures:
70.68 s
>
70.68 s
> failures:
70.68 s
> provenance_tests::each_build_captures_one_revision_before_rendering
70.68 s
>
70.68 s
> test result: FAILED. 0 passed; 1 failed; 0 ignored; 0 measured; 128 filtered out; finished in 27.66s
70.68 s
>
70.68 s
> test provenance_tests::each_build_captures_one_revision_before_rendering ... FAILED
70.68 s
>
70.68 s
> failures:
70.68 s
>
70.68 s
> failures:
70.68 s
> provenance_tests::each_build_captures_one_revision_before_rendering
70.68 s
>
70.68 s
> test result: FAILED. 0 passed; 1 failed; 0 ignored; 0 measured; 128 filtered out; finished in 27.72s
70.68 s
>
70.68 s
> stderr ---
70.68 s
> warning: bundle export is experimental
70.68 s
> = hint: its behaviour may change at any time
70.68 s
> = hint: do not rely on this feature for production use cases
70.68 s
>
70.68 s
> warning: unknown font family: roboto
70.68 s
> ┌─ crates/linnest/typst/docs/manual.typ:11:28
70.68 s
> │
70.68 s
> 11 │ #set text(size: 10pt, font: "Roboto")
70.68 s
> │ ^^^^^^^^
70.68 s
>
70.68 s
> warning: unknown font family: roboto
70.68 s
> ┌─ crates/linnest/typst/docs/manual.typ:14:29
70.68 s
> │
70.68 s
> 14 │ #set text(size: 3em, font: "Roboto")
70.68 s
> │ ^^^^^^^^
70.68 s
>
70.68 s
> warning: unknown font family: roboto
70.68 s
> ┌─ crates/linnest/typst/docs/manual.typ:16:31
70.68 s
> │
70.68 s
> 16 │ #set text(size: 0.3em, font: "Roboto")
70.68 s
> │ ^^^^^^^^
70.68 s
>
70.68 s
> warning: overline was ignored during MathML export
70.68 s
> ┌─ crates/linnest/typst/docs/manual.typ:949:55
70.68 s
> │
70.68 s
> 949 │ + sum_("dangling" e) c_("dangling-centroid") / (d(e, overline(v)) + epsilon)
70.68 s
> │ ^^^^^^^^^^^
70.68 s
>
70.68 s
> warning: overline was ignored during MathML export
70.68 s
> ┌─ crates/linnest/typst/docs/manual.typ:953:8
70.68 s
> │
70.68 s
> 953 │ Here $overline(v)$ is the mean node position. The centroid term pushes every
70.68 s
> │ ^^^^^^^^^^^
70.68 s
>
70.68 s
>
70.68 s
> thread 'provenance_tests::each_build_captures_one_revision_before_rendering' (241) panicked at crates/alphal00p-docs-builder/src/provenance_tests.rs:297:14:
70.68 s
> called `Result::unwrap()` on an `Err` value: generated site has broken links:
70.68 s
> products/linnet/latest/reference/interfaces/index.html -> https://github.com/alphal00p/gammaloop/blob/1111111111111111111111111111111111111111/crates/linnet-py/examples/physics_render_settings.py (missing repository source file crates/linnet-py/examples/physics_render_settings.py)
70.68 s
> products/linnet/latest/reference/interfaces/index.html -> https://github.com/alphal00p/gammaloop/blob/1111111111111111111111111111111111111111/crates/linnet-py/examples/layout_stream.py (missing repository source file crates/linnet-py/examples/layout_stream.py)
70.68 s
> products/linnet/latest/playground/index.html -> https://github.com/alphal00p/gammaloop/blob/1111111111111111111111111111111111111111/crates/linnet-py/examples/layout_stream.py (missing repository source file crates/linnet-py/examples/layout_stream.py)
70.68 s
> products/linnet/latest/guides/python-rendering/index.html -> https://github.com/alphal00p/gammaloop/blob/1111111111111111111111111111111111111111/crates/linnet-py/examples/rendering_api.py (missing repository source file crates/linnet-py/examples/rendering_api.py)
70.68 s
>
70.68 s
> Location:
70.68 s
> crates/alphal00p-docs-builder/src/lib.rs:4940:9
70.68 s
> stack backtrace:
70.68 s
> 0: __rustc::rust_begin_unwind
70.68 s
> 1: core::panicking::panic_fmt
70.68 s
> 2: core::result::unwrap_failed
70.68 s
> 3: alphal00p_docs_builder::provenance_tests::each_build_captures_one_revision_before_rendering
70.68 s
> 4: <alphal00p_docs_builder::provenance_tests::each_build_captures_one_revision_before_rendering::{closure#0} as core::ops::function::FnOnce<()>>::call_once
70.68 s
> note: Some details are omitted, run with `RUST_BACKTRACE=full` for a verbose backtrace.
70.68 s
>
70.68 s
> thread 'provenance_tests::each_build_captures_one_revision_before_rendering' (197) panicked at crates/alphal00p-docs-builder/src/provenance_tests.rs:274:9:
70.68 s
> assertion failed: command.status().unwrap().success()
70.68 s
> stack backtrace:
70.68 s
> 0: __rustc::rust_begin_unwind
70.68 s
> 1: core::panicking::panic_fmt
70.68 s
> 2: core::panicking::panic
70.68 s
> 3: alphal00p_docs_builder::provenance_tests::each_build_captures_one_revision_before_rendering
70.68 s
> 4: <alphal00p_docs_builder::provenance_tests::each_build_captures_one_revision_before_rendering::{closure#0} as core::ops::function::FnOnce<()>>::call_once
70.68 s
> note: Some details are omitted, run with `RUST_BACKTRACE=full` for a verbose backtrace.
70.68 s
>
70.68 s
> ------------
70.68 s
> Summary [ 33.714s] 129 tests run: 128 passed , 1 failed , 0 skipped
70.68 s
> FAIL [ 27.734s] (128/129) alphal00p-docs-builder provenance_tests :: each_build_captures_one_revision_before_rendering
70.68 s
> stdout ---
70.68 s
>
70.68 s
> running 1 test
70.68 s
>
70.68 s
> running 1 test
70.68 s
> test provenance_tests::each_build_captures_one_revision_before_rendering ... FAILED
70.68 s
>
70.68 s
> failures:
70.68 s
>
70.68 s
> failures:
70.68 s
> provenance_tests::each_build_captures_one_revision_before_rendering
70.68 s
>
70.68 s
> test result: FAILED. 0 passed; 1 failed; 0 ignored; 0 measured; 128 filtered out; finished in 27.66s
70.68 s
>
70.68 s
> test provenance_tests::each_build_captures_one_revision_before_rendering ... FAILED
70.68 s
>
70.68 s
> failures:
70.68 s
>
70.68 s
> failures:
70.68 s
> provenance_tests::each_build_captures_one_revision_before_rendering
70.68 s
>
70.68 s
> test result: FAILED. 0 passed; 1 failed; 0 ignored; 0 measured; 128 filtered out; finished in 27.72s
70.68 s
>
70.68 s
> stderr ---
70.68 s
> warning: bundle export is experimental
70.68 s
> = hint: its behaviour may change at any time
70.68 s
> = hint: do not rely on this feature for production use cases
70.68 s
>
70.68 s
> warning: unknown font family: roboto
70.68 s
> ┌─ crates/linnest/typst/docs/manual.typ:11:28
70.68 s
> │
70.68 s
> 11 │ #set text(size: 10pt, font: "Roboto")
70.68 s
> │ ^^^^^^^^
70.68 s
>
70.68 s
> warning: unknown font family: roboto
70.68 s
> ┌─ crates/linnest/typst/docs/manual.typ:14:29
70.68 s
> │
70.68 s
> 14 │ #set text(size: 3em, font: "Roboto")
70.68 s
> │ ^^^^^^^^
70.68 s
>
70.68 s
> warning: unknown font family: roboto
70.68 s
> ┌─ crates/linnest/typst/docs/manual.typ:16:31
70.68 s
> │
70.68 s
> 16 │ #set text(size: 0.3em, font: "Roboto")
70.68 s
> │ ^^^^^^^^
70.68 s
>
70.68 s
> warning: overline was ignored during MathML export
70.68 s
> ┌─ crates/linnest/typst/docs/manual.typ:949:55
70.68 s
> │
70.68 s
> 949 │ + sum_("dangling" e) c_("dangling-centroid") / (d(e, overline(v)) + epsilon)
70.68 s
> │ ^^^^^^^^^^^
70.68 s
>
70.68 s
> warning: overline was ignored during MathML export
70.68 s
> ┌─ crates/linnest/typst/docs/manual.typ:953:8
70.68 s
> │
70.68 s
> 953 │ Here $overline(v)$ is the mean node position. The centroid term pushes every
70.68 s
> │ ^^^^^^^^^^^
70.68 s
>
70.68 s
>
70.68 s
> thread 'provenance_tests::each_build_captures_one_revision_before_rendering' (241) panicked at crates/alphal00p-docs-builder/src/provenance_tests.rs:297:14:
70.68 s
> called `Result::unwrap()` on an `Err` value: generated site has broken links:
70.68 s
> products/linnet/latest/reference/interfaces/index.html -> https://github.com/alphal00p/gammaloop/blob/1111111111111111111111111111111111111111/crates/linnet-py/examples/physics_render_settings.py (missing repository source file crates/linnet-py/examples/physics_render_settings.py)
70.68 s
> products/linnet/latest/reference/interfaces/index.html -> https://github.com/alphal00p/gammaloop/blob/1111111111111111111111111111111111111111/crates/linnet-py/examples/layout_stream.py (missing repository source file crates/linnet-py/examples/layout_stream.py)
70.68 s
> products/linnet/latest/playground/index.html -> https://github.com/alphal00p/gammaloop/blob/1111111111111111111111111111111111111111/crates/linnet-py/examples/layout_stream.py (missing repository source file crates/linnet-py/examples/layout_stream.py)
70.68 s
> products/linnet/latest/guides/python-rendering/index.html -> https://github.com/alphal00p/gammaloop/blob/1111111111111111111111111111111111111111/crates/linnet-py/examples/rendering_api.py (missing repository source file crates/linnet-py/examples/rendering_api.py)
70.68 s
>
70.68 s
> Location:
70.68 s
> crates/alphal00p-docs-builder/src/lib.rs:4940:9
70.68 s
> stack backtrace:
70.68 s
> 0: __rustc::rust_begin_unwind
70.68 s
> 1: core::panicking::panic_fmt
70.68 s
> 2: core::result::unwrap_failed
70.68 s
> 3: alphal00p_docs_builder::provenance_tests::each_build_captures_one_revision_before_rendering
70.68 s
> 4: <alphal00p_docs_builder::provenance_tests::each_build_captures_one_revision_before_rendering::{closure#0} as core::ops::function::FnOnce<()>>::call_once
70.68 s
> note: Some details are omitted, run with `RUST_BACKTRACE=full` for a verbose backtrace.
70.68 s
>
70.68 s
> thread 'provenance_tests::each_build_captures_one_revision_before_rendering' (197) panicked at crates/alphal00p-docs-builder/src/provenance_tests.rs:274:9:
70.68 s
> assertion failed: command.status().unwrap().success()
70.68 s
> stack backtrace:
70.68 s
> 0: __rustc::rust_begin_unwind
70.68 s
> 1: core::panicking::panic_fmt
70.68 s
> 2: core::panicking::panic
70.68 s
> 3: alphal00p_docs_builder::provenance_tests::each_build_captures_one_revision_before_rendering
70.68 s
> 4: <alphal00p_docs_builder::provenance_tests::each_build_captures_one_revision_before_rendering::{closure#0} as core::ops::function::FnOnce<()>>::call_once
70.68 s
> note: Some details are omitted, run with `RUST_BACKTRACE=full` for a verbose backtrace.
70.68 s
>
70.68 s
> error : test run failed
70.68 s
>
70.68 s
> ========== nextest test summary ==========
70.68 s
> report: target/nextest/ci_gammaloop/junit.xml
70.68 s
> tests: 129, failures: 1, errors: 0
70.68 s
>
70.68 s
> 1. alphal00p-docs-builder::provenance_tests::each_build_captures_one_revision_before_rendering
70.68 s
> failure: test failure with exit code 101
70.68 s
> thread 'provenance_tests::each_build_captures_one_revision_before_rendering' (197) panicked at crates/alphal00p-docs-builder/src/provenance_tests.rs:274:9:
70.68 s
> assertion failed: command.status().unwrap().success()
70.68 s
> stack backtrace:
70.68 s
> 0: __rustc::rust_begin_unwind
70.68 s
> 1: core::panicking::panic_fmt
70.68 s
> 2: core::panicking::panic
70.68 s
> 3: alphal00p_docs_builder::provenance_tests::each_build_captures_one_revision_before_rendering
70.68 s
> 4: <alphal00p_docs_builder::provenance_tests::each_build_captures_one_revision_before_rendering::{closure#0} as core::ops::function::FnOnce<()>>::call_once
70.68 s
> note: Some details are omitted, run with `RUST_BACKTRACE=full` for a verbose backtrace.
70.68 s
> system-out
70.68 s
> running 1 test
70.68 s
>
70.68 s
> running 1 test
70.68 s
> test provenance_tests::each_build_captures_one_revision_before_rendering ... FAILED
70.68 s
>
70.68 s
> failures:
70.68 s
>
70.68 s
> failures:
70.68 s
> provenance_tests::each_build_captures_one_revision_before_rendering
70.68 s
>
70.68 s
> test result: FAILED. 0 passed; 1 failed; 0 ignored; 0 measured; 128 filtered out; finished in 27.66s
70.68 s
>
70.68 s
> test provenance_tests::each_build_captures_one_revision_before_rendering ... FAILED
70.68 s
>
70.68 s
> failures:
70.68 s
>
70.68 s
> failures:
70.68 s
> provenance_tests::each_build_captures_one_revision_before_rendering
70.68 s
>
70.68 s
> test result: FAILED. 0 passed; 1 failed; 0 ignored; 0 measured; 128 filtered out; finished in 27.72s
70.68 s
> system-err
70.68 s
> warning: bundle export is experimental
70.68 s
> = hint: its behaviour may change at any time
70.68 s
> = hint: do not rely on this feature for production use cases
70.68 s
>
70.68 s
> warning: unknown font family: roboto
70.68 s
> ┌─ crates/linnest/typst/docs/manual.typ:11:28
70.68 s
> │
70.68 s
> 11 │ #set text(size: 10pt, font: "Roboto")
70.68 s
> │ ^^^^^^^^
70.68 s
>
70.68 s
> warning: unknown font family: roboto
70.68 s
> ┌─ crates/linnest/typst/docs/manual.typ:14:29
70.68 s
> │
70.68 s
> 14 │ #set text(size: 3em, font: "Roboto")
70.68 s
> │ ^^^^^^^^
70.68 s
>
70.68 s
> warning: unknown font family: roboto
70.68 s
> ┌─ crates/linnest/typst/docs/manual.typ:16:31
70.68 s
> │
70.68 s
> 16 │ #set text(size: 0.3em, font: "Roboto")
70.68 s
> │ ^^^^^^^^
70.68 s
>
70.68 s
> warning: overline was ignored during MathML export
70.68 s
> ┌─ crates/linnest/typst/docs/manual.typ:949:55
70.68 s
> │
70.68 s
> 949 │ + sum_("dangling" e) c_("dangling-centroid") / (d(e, overline(v)) + epsilon)
70.68 s
> │ ^^^^^^^^^^^
70.68 s
>
70.68 s
> warning: overline was ignored during MathML export
70.68 s
> ┌─ crates/linnest/typst/docs/manual.typ:953:8
70.68 s
> │
70.68 s
> 953 │ Here $overline(v)$ is the mean node position. The centroid term pushes every
70.68 s
> │ ^^^^^^^^^^^
70.68 s
>
70.68 s
>
70.68 s
> thread 'provenance_tests::each_build_captures_one_revision_before_rendering' (241) panicked at crates/alphal00p-docs-builder/src/provenance_tests.rs:297:14:
70.68 s
> called `Result::unwrap()` on an `Err` value: generated site has broken links:
70.68 s
> products/linnet/latest/reference/interfaces/index.html -> https://github.com/alphal00p/gammaloop/blob/1111111111111111111111111111111111111111/crates/linnet-py/examples/physics_render_settings.py (missing repository source file crates/linnet-py/examples/physics_render_settings.py)
70.68 s
> products/linnet/latest/reference/interfaces/index.html -> https://github.com/alphal00p/gammaloop/blob/1111111111111111111111111111111111111111/crates/linnet-py/examples/layout_stream.py (missing repository source file crates/linnet-py/examples/layout_stream.py)
70.68 s
> products/linnet/latest/playground/index.html -> https://github.com/alphal00p/gammaloop/blob/1111111111111111111111111111111111111111/crates/linnet-py/examples/layout_stream.py (missing repository source file crates/linnet-py/examples/layout_stream.py)
70.68 s
> products/linnet/latest/guides/python-rendering/index.html -> https://github.com/alphal00p/gammaloop/blob/1111111111111111111111111111111111111111/crates/linnet-py/examples/rendering_api.py (missing repository source file crates/linnet-py/examples/rendering_api.py)
70.68 s
>
70.68 s
> Location:
70.68 s
> crates/alphal00p-docs-builder/src/lib.rs:4940:9
70.68 s
> stack backtrace:
70.68 s
> 0: __rustc::rust_begin_unwind
70.68 s
> 1: core::panicking::panic_fmt
70.68 s
> 2: core::result::unwrap_failed
70.68 s
> 3: alphal00p_docs_builder::provenance_tests::each_build_captures_one_revision_before_rendering
70.68 s
> 4: <alphal00p_docs_builder::provenance_tests::each_build_captures_one_revision_before_rendering::{closure#0} as core::ops::function::FnOnce<()>>::call_once
70.68 s
> note: Some details are omitted, run with `RUST_BACKTRACE=full` for a verbose backtrace.
70.68 s
>
70.68 s
> thread 'provenance_tests::each_build_captures_one_revision_before_rendering' (197) panicked at crates/alphal00p-docs-builder/src/provenance_tests.rs:274:9:
70.68 s
> assertion failed: command.status().unwrap().success()
70.68 s
> stack backtrace:
70.68 s
> 0: __rustc::rust_begin_unwind
70.68 s
> 1: core::panicking::panic_fmt
70.68 s
> 2: core::panicking::panic
70.68 s
> 3: alphal00p_docs_builder::provenance_tests::each_build_captures_one_revision_before_rendering
70.68 s
> 4: <alphal00p_docs_builder::provenance_tests::each_build_captures_one_revision_before_rendering::{closure#0} as core::ops::function::FnOnce<()>>::call_once
70.68 s
> note: Some details are omitted, run with `RUST_BACKTRACE=full` for a verbose backtrace.
70.68 s
> =========================================
70.68 s
> Extracting 2 binaries to /build/source
70.68 s
> Extracted 5 files to /build/source in 0.04s
70.68 s
> ------------
70.68 s
> Nextest run ID 4a58f56e-dc5e-4bfa-9762-7e482ecab559 with nextest profile: ci_gammaloop
70.68 s
> Starting 22 tests across 2 binaries
70.68 s
> ------------
70.68 s
> Summary [ 0.015s] 22 tests run: 22 passed , 0 skipped
70.68 s
>
70.68 s
> ========== nextest test summary ==========
70.68 s
> report: target/nextest/ci_gammaloop/junit.xml
70.68 s
> tests: 22, failures: 0, errors: 0
70.68 s
> No failing testcases found.
70.68 s
> =========================================
70.68 s
> Extracting 3 binaries (including 2 non-test binaries), 1 build script output directory, and 2 linked paths to /build/source
70.68 s
> Extracted 22 files to /build/source in 0.29s
70.68 s
> ------------
70.68 s
> Nextest run ID 0abfed65-fbb6-46e0-bde3-e7fc0e6b3ccc with nextest profile: ci_gammaloop
70.68 s
> Starting 89 tests across 1 binary
70.68 s
> ------------
70.68 s
> Summary [ 0.041s] 89 tests run: 89 passed , 0 skipped
70.68 s
>
70.68 s
> ========== nextest test summary ==========
70.68 s
> report: target/nextest/ci_gammaloop/junit.xml
70.68 s
> tests: 89, failures: 0, errors: 0
70.68 s
> No failing testcases found.
70.68 s
> =========================================
70.68 s
> Extracting 2 binaries to /build/source
70.68 s
> Extracted 5 files to /build/source in 0.05s
70.68 s
> ------------
70.68 s
> Nextest run ID d95e9177-2b66-428c-b9e1-a31934bc00f0 with nextest profile: ci_gammaloop
70.68 s
> Starting 10 tests across 2 binaries
70.68 s
> ------------
70.68 s
> Summary [ 13.918s] 10 tests run: 10 passed , 0 skipped
70.68 s
>
70.68 s
> ========== nextest test summary ==========
70.68 s
> report: target/nextest/ci_gammaloop/junit.xml
70.68 s
> tests: 10, failures: 0, errors: 0
70.68 s
> No failing testcases found.
70.68 s
> =========================================
70.68 s
> Extracting 1 binary to /build/source
70.68 s
> Extracted 4 files to /build/source in 0.04s
70.68 s
> ------------
70.68 s
> Nextest run ID b36d766c-5d87-439a-b38e-7f49e4de13f8 with nextest profile: ci_gammaloop
70.68 s
> Starting 0 tests across 1 binary
70.68 s
> ------------
70.68 s
> Summary [ 0.000s] 0 tests run: 0 passed , 0 skipped
70.68 s
>
70.68 s
> ========== nextest test summary ==========
70.68 s
> report: target/nextest/ci_gammaloop/junit.xml
70.68 s
> tests: 0, failures: 0, errors: 0
70.68 s
> No failing testcases found.
70.68 s
> =========================================
70.68 s
> Extracting 1 binary to /build/source
70.68 s
> Extracted 4 files to /build/source in 0.04s
70.68 s
> ------------
70.68 s
> Nextest run ID d4f26152-d69d-481a-8077-d67cf015ee56 with nextest profile: ci_gammaloop
70.68 s
> Starting 5 tests across 1 binary
70.68 s
> ------------
70.68 s
> Summary [ 0.005s] 5 tests run: 5 passed , 0 skipped
70.68 s
>
70.68 s
> ========== nextest test summary ==========
70.68 s
> report: target/nextest/ci_gammaloop/junit.xml
70.68 s
> tests: 5, failures: 0, errors: 0
70.68 s
> No failing testcases found.
70.68 s
> =========================================
70.68 s
For full logs, run:
70.68 s
nix log /nix/store/9rs74w2crrwhaq7f0dxdi11wd515i6dj-gammaloop-nextest-docs.drv
70.82 s
[0 built (1 failed )]Run failed.