0.01 s
$ /nix/store/9ypz3flqsrl5xl495mm8h645gadjsxi1-coreutils-9.11/bin/timeout --kill-after=15s 7200s /nix/store/23zk8sgzamrbmj1fday15szf7f2279s8-nix-2.34.7/bin/nix --extra-experimental-features nix-command --extra-experimental-features flakes --log-format internal-json build --no-link --print-out-paths git+https://github.com/alphal00p/gammaloop?ref=codex%2Fdocs-manuals&rev=fa8ed9a02ca7dff8db2b623fcf9163af3051b0df&shallow=1#checks.x86_64-linux.gammaloop-check --print-build-logs
0.41 s
error (ignored): SQLite database '/var/cache/nix-ci-worker/eval-cache-v6/b8662e2bf247965c4b15522798a3327a911ceb09864110b48cc6d8093ad95d06.sqlite ' is busy
3.27 s
4.98 s
Building /nix/store/yq41fja0qvn1pcayl6m3fb5q6zl3fd3g-gammaloop-workspace-check-0.1.0.drv
5.12 s
[gammaloop-workspace-check] Phase: unpackPhase
5.13 s
[gammaloop-workspace-check] unpacking source archive /nix/store/0llqw1df709zbvslaaqs2ang2jp44rl4-source
5.26 s
[gammaloop-workspace-check] source root is source
5.30 s
[gammaloop-workspace-check] Phase: patchPhase
5.30 s
[gammaloop-workspace-check] Executing configureCargoCommonVars
5.30 s
[gammaloop-workspace-check] decompressing cargo artifacts from /nix/store/wxpx6lf642pgxp2wz1pw1lxksj5p1wb0-gammaloop-workspace-deps-deps-0.1.0/target.tar.zst to target
10.08 s
[gammaloop-workspace-check] Phase: updateAutotoolsGnuConfigScriptsPhase
10.12 s
[gammaloop-workspace-check] Phase: configurePhase
10.13 s
[gammaloop-workspace-check] will append /build/source/.cargo-home/config.toml with contents of /nix/store/8zq9ya5slh345hbylmsibxw827bi98w0-vendor-cargo-deps/config.toml
10.15 s
[gammaloop-workspace-check] default configurePhase, nothing to do
10.15 s
[gammaloop-workspace-check] Phase: buildPhase
10.17 s
[gammaloop-workspace-check] +++ command cargo --version
10.17 s
[gammaloop-workspace-check] cargo 1.97.0 (c980f4866 2026-06-30)
10.21 s
[gammaloop-workspace-check] +++ command cargo check --profile ci-optim --locked --workspace --features gammaloop-tracing-filter/clap,gammaloop-tracing-filter/symbolica,idenso/bincode,idenso/reference-cases,linnet/bincode,linnet/drawing,linnet/rkyv,linnet/serde,linnet/symbolica,spenso-macros/shadowing,spenso/shadowing,symbolica/tracing_max_level_info,three-dimensional-reps/display,three-dimensional-reps/eval,three-dimensional-reps/serde --all-targets
10.73 s
[gammaloop-workspace-check] Checking cfg-if v1.0.4
10.73 s
[gammaloop-workspace-check] Checking memchr v2.8.0
10.73 s
[gammaloop-workspace-check] Checking once_cell v1.21.4
10.74 s
[gammaloop-workspace-check] Checking either v1.15.0
10.74 s
[gammaloop-workspace-check] Checking serde_core v1.0.228
10.75 s
[gammaloop-workspace-check] Checking libc v0.2.186
10.75 s
[gammaloop-workspace-check] Checking libm v0.2.16
10.75 s
[gammaloop-workspace-check] Checking itoa v1.0.18
10.76 s
[gammaloop-workspace-check] Checking log v0.4.29
10.76 s
[gammaloop-workspace-check] Checking regex-syntax v0.8.10
10.76 s
[gammaloop-workspace-check] Checking zerocopy v0.8.48
10.77 s
[gammaloop-workspace-check] Checking crossbeam-utils v0.8.21
10.78 s
[gammaloop-workspace-check] Checking equivalent v1.0.2
10.79 s
[gammaloop-workspace-check] Checking zmij v1.0.21
10.80 s
[gammaloop-workspace-check] Checking bytemuck v1.25.0
10.80 s
[gammaloop-workspace-check] Checking lazy_static v1.5.0
10.80 s
[gammaloop-workspace-check] Compiling target-lexicon v0.13.5
10.84 s
[gammaloop-workspace-check] Checking arrayvec v0.7.6
10.87 s
[gammaloop-workspace-check] Checking powerfmt v0.2.0
10.91 s
[gammaloop-workspace-check] Checking pin-project-lite v0.2.17
10.91 s
[gammaloop-workspace-check] Checking num-conv v0.2.1
10.92 s
[gammaloop-workspace-check] Checking time-core v0.1.8
10.95 s
[gammaloop-workspace-check] Checking safe_arch v0.7.4
10.96 s
[gammaloop-workspace-check] Checking num_threads v0.1.7
11.00 s
[gammaloop-workspace-check] Checking deranged v0.5.8
11.03 s
[gammaloop-workspace-check] Checking tracing-core v0.1.36
11.04 s
[gammaloop-workspace-check] Checking itertools v0.14.0
11.15 s
[gammaloop-workspace-check] Checking allocator-api2 v0.2.21
11.17 s
[gammaloop-workspace-check] Checking foldhash v0.2.0
11.18 s
[gammaloop-workspace-check] Checking const-random v0.1.18
11.28 s
[gammaloop-workspace-check] Checking nu-ansi-term v0.50.3
11.31 s
[gammaloop-workspace-check] Checking winnow v1.0.2
11.33 s
[gammaloop-workspace-check] Checking static_assertions v1.1.0
11.36 s
[gammaloop-workspace-check] Checking unty v0.0.4
11.53 s
[gammaloop-workspace-check] Checking safe_arch v1.0.0
11.54 s
[gammaloop-workspace-check] Checking crossbeam-epoch v0.9.18
11.69 s
[gammaloop-workspace-check] Checking sharded-slab v0.1.7
11.71 s
[gammaloop-workspace-check] Checking hashbrown v0.16.1
11.75 s
[gammaloop-workspace-check] Checking wide v0.7.33
11.86 s
[gammaloop-workspace-check] Checking crossbeam-deque v0.8.6
11.90 s
[gammaloop-workspace-check] Checking aho-corasick v1.1.4
12.10 s
[gammaloop-workspace-check] Checking thread_local v1.1.9
12.12 s
[gammaloop-workspace-check] Checking tracing-log v0.2.0
12.44 s
[gammaloop-workspace-check] Checking tracing v0.1.44
12.45 s
[gammaloop-workspace-check] Checking toml_writer v1.1.1+spec-1.1.0
12.48 s
[gammaloop-workspace-check] Checking rayon-core v1.13.0
12.88 s
[gammaloop-workspace-check] Checking az v1.3.0
12.89 s
[gammaloop-workspace-check] Checking indenter v0.3.4
12.99 s
[gammaloop-workspace-check] Checking wide v1.3.0
13.02 s
[gammaloop-workspace-check] Compiling phf_shared v0.11.3
13.22 s
[gammaloop-workspace-check] Checking anyhow v1.0.102
13.28 s
[gammaloop-workspace-check] Checking utf8parse v0.2.2
13.36 s
[gammaloop-workspace-check] Checking rawpointer v0.2.1
13.40 s
[gammaloop-workspace-check] Checking alloc-no-stdlib v2.0.4
13.51 s
[gammaloop-workspace-check] Checking dyn-clone v1.0.20
13.54 s
[gammaloop-workspace-check] Checking toml_parser v1.1.2+spec-1.1.0
13.55 s
[gammaloop-workspace-check] Checking rayon v1.12.0
13.62 s
[gammaloop-workspace-check] Checking alloc-stdlib v0.2.2
13.63 s
[gammaloop-workspace-check] Checking getrandom v0.3.4
13.67 s
[gammaloop-workspace-check] Checking time v0.3.47
13.85 s
[gammaloop-workspace-check] Checking gmp-mpfr-sys v1.7.1
13.86 s
[gammaloop-workspace-check] Checking rand_core v0.9.5
13.96 s
[gammaloop-workspace-check] Checking matrixmultiply v0.3.10
14.14 s
[gammaloop-workspace-check] Checking anstyle-parse v1.0.0
14.19 s
[gammaloop-workspace-check] Checking colorchoice v1.0.5
14.23 s
[gammaloop-workspace-check] Compiling pyo3-build-config v0.28.3
14.25 s
[gammaloop-workspace-check] Checking anstyle v1.0.14
14.27 s
[gammaloop-workspace-check] Checking colored v3.1.1
14.35 s
[gammaloop-workspace-check] Checking is_terminal_polyfill v1.70.2
14.39 s
[gammaloop-workspace-check] Checking anstyle-query v1.1.5
14.42 s
[gammaloop-workspace-check] Compiling phf_generator v0.11.3
14.45 s
[gammaloop-workspace-check] Checking eyre v0.6.12
14.47 s
[gammaloop-workspace-check] Checking num-traits v0.2.19
14.52 s
[gammaloop-workspace-check] Checking unicode-width v0.2.2
14.56 s
[gammaloop-workspace-check] Checking bitflags v1.3.2
14.58 s
[gammaloop-workspace-check] Checking wasmtime-jit-icache-coherence v34.0.2
14.60 s
[gammaloop-workspace-check] Checking brotli-decompressor v5.0.0
14.64 s
[gammaloop-workspace-check] Checking hugepage-rs v0.1.1
14.64 s
[gammaloop-workspace-check] Checking region v3.0.2
14.65 s
[gammaloop-workspace-check] Checking inventory v0.3.24
14.72 s
[gammaloop-workspace-check] Compiling phf_codegen v0.11.3
14.74 s
[gammaloop-workspace-check] Checking spec_math v0.1.6
14.82 s
[gammaloop-workspace-check] Checking thiserror v2.0.18
14.87 s
[gammaloop-workspace-check] Compiling getopts v0.2.24
14.89 s
[gammaloop-workspace-check] Checking libloading v0.9.0
14.93 s
[gammaloop-workspace-check] Checking tinyjson v2.5.1
14.93 s
[gammaloop-workspace-check] Checking serde v1.0.228
14.96 s
[gammaloop-workspace-check] Checking serde_json v1.0.149
14.97 s
[gammaloop-workspace-check] Checking bitflags v2.11.1
15.07 s
[gammaloop-workspace-check] Checking serde_spanned v1.1.1
15.07 s
[gammaloop-workspace-check] Checking toml_datetime v1.1.1+spec-1.1.0
15.15 s
[gammaloop-workspace-check] Checking anstream v1.0.0
15.26 s
[gammaloop-workspace-check] Checking toml v1.1.2+spec-1.1.0
15.28 s
[gammaloop-workspace-check] Checking self_cell v1.2.2
15.30 s
[gammaloop-workspace-check] Checking smallvec v1.15.1
15.34 s
[gammaloop-workspace-check] Checking bincode v2.0.1
15.44 s
[gammaloop-workspace-check] Checking tracing-serde v0.2.0
15.45 s
[gammaloop-workspace-check] Checking smartstring v1.0.1
15.57 s
[gammaloop-workspace-check] Checking byteorder v1.5.0
15.63 s
[gammaloop-workspace-check] Checking append-only-vec v0.1.8
15.69 s
[gammaloop-workspace-check] Checking bytes v1.11.1
15.77 s
[gammaloop-workspace-check] Checking regex-automata v0.4.14
15.86 s
[gammaloop-workspace-check] Compiling unicode_names2_generator v1.3.0
15.89 s
[gammaloop-workspace-check] Compiling unic-common v0.9.0
16.03 s
[gammaloop-workspace-check] Checking linux-raw-sys v0.12.1
16.16 s
[gammaloop-workspace-check] Checking num-complex v0.4.6
16.25 s
[gammaloop-workspace-check] Checking approx v0.5.1
16.32 s
[gammaloop-workspace-check] Checking num-integer v0.1.46
16.34 s
[gammaloop-workspace-check] Compiling unic-char-range v0.9.0
16.38 s
[gammaloop-workspace-check] Compiling unic-ucd-version v0.9.0
16.45 s
[gammaloop-workspace-check] Compiling unic-char-property v0.9.0
16.46 s
[gammaloop-workspace-check] Compiling is-macro v0.3.7
16.48 s
[gammaloop-workspace-check] Compiling rustpython-parser-vendored v0.4.0
16.54 s
[gammaloop-workspace-check] Checking iana-time-zone v0.1.65
16.58 s
[gammaloop-workspace-check] Compiling rustpython-parser v0.4.0
16.60 s
[gammaloop-workspace-check] Checking rustix v1.1.4
16.63 s
[gammaloop-workspace-check] Checking chrono v0.4.44
16.87 s
[gammaloop-workspace-check] Checking brotli v8.0.2
16.97 s
[gammaloop-workspace-check] Compiling phf v0.11.3
17.15 s
[gammaloop-workspace-check] Checking rustc-hash v2.1.2
17.27 s
[gammaloop-workspace-check] Compiling unic-ucd-ident v0.9.0
17.38 s
[gammaloop-workspace-check] Compiling unic-emoji-char v0.9.0
17.43 s
[gammaloop-workspace-check] Checking simba v0.9.1
17.53 s
[gammaloop-workspace-check] Checking ndarray v0.17.2
17.55 s
[gammaloop-workspace-check] Compiling rustc-hash v1.1.0
17.64 s
[gammaloop-workspace-check] Compiling lalrpop-util v0.20.2
17.66 s
[gammaloop-workspace-check] Checking rug v1.30.0
18.09 s
[gammaloop-workspace-check] Checking unicode-segmentation v1.13.2
18.44 s
[gammaloop-workspace-check] Compiling symbolica v2.2.0 (https://github.com/alphal00p/symbolica?rev=4d0a833eb8e059d1f95bdae5abed2559830b235f#4d0a833e)
18.92 s
[gammaloop-workspace-check] Checking typenum v1.20.0
19.01 s
[gammaloop-workspace-check] Checking getrandom v0.2.17
19.27 s
[gammaloop-workspace-check] Checking scopeguard v1.2.0
19.36 s
[gammaloop-workspace-check] Checking parking_lot_core v0.9.12
19.46 s
[gammaloop-workspace-check] Checking unicode-ident v1.0.24
19.48 s
[gammaloop-workspace-check] Checking lock_api v0.4.14
19.61 s
[gammaloop-workspace-check] Checking hashbrown v0.17.0
19.82 s
[gammaloop-workspace-check] Checking terminal_size v0.4.4
19.98 s
[gammaloop-workspace-check] Checking errno v0.3.14
20.12 s
[gammaloop-workspace-check] Checking generic-array v0.14.7
20.13 s
[gammaloop-workspace-check] Checking parking_lot v0.12.5
20.17 s
[gammaloop-workspace-check] Checking clap_lex v1.1.0
20.27 s
[gammaloop-workspace-check] Checking unicase v2.9.0
20.38 s
[gammaloop-workspace-check] Checking strsim v0.11.1
20.56 s
[gammaloop-workspace-check] Checking signal-hook-registry v1.4.8
20.59 s
[gammaloop-workspace-check] Checking clap_builder v4.6.0
20.62 s
[gammaloop-workspace-check] Checking vte v0.14.1
20.85 s
[gammaloop-workspace-check] Checking same-file v1.0.6
20.97 s
[gammaloop-workspace-check] Checking signal-hook v0.3.18
21.04 s
[gammaloop-workspace-check] Checking walkdir v2.5.0
21.07 s
[gammaloop-workspace-check] Checking crypto-common v0.1.7
21.16 s
[gammaloop-workspace-check] Checking block-buffer v0.10.4
21.30 s
[gammaloop-workspace-check] Checking mio v1.2.0
21.47 s
[gammaloop-workspace-check] Checking ciborium-io v0.2.2
21.51 s
[gammaloop-workspace-check] Checking minimal-lexical v0.2.1
21.55 s
[gammaloop-workspace-check] Checking digest v0.10.7
21.96 s
[gammaloop-workspace-check] Checking derive_more v2.1.1
21.97 s
[gammaloop-workspace-check] Checking nom v7.1.3
22.06 s
[gammaloop-workspace-check] Checking num-bigint v0.4.6
22.27 s
[gammaloop-workspace-check] Checking indexmap v2.14.0
22.59 s
[gammaloop-workspace-check] Checking signal-hook-mio v0.2.5
22.65 s
[gammaloop-workspace-check] Checking console v0.16.3
22.78 s
[gammaloop-workspace-check] Checking bstr v1.12.1
23.19 s
[gammaloop-workspace-check] Checking cpufeatures v0.2.17
23.28 s
[gammaloop-workspace-check] Checking linux-raw-sys v0.4.15
23.82 s
[gammaloop-workspace-check] Checking winnow v0.7.15
24.09 s
[gammaloop-workspace-check] Checking rustix v0.38.44
24.47 s
[gammaloop-workspace-check] Checking sha2 v0.10.9
25.02 s
[gammaloop-workspace-check] Checking ppv-lite86 v0.2.21
25.37 s
[gammaloop-workspace-check] Checking ahash v0.8.12
25.58 s
[gammaloop-workspace-check] Checking half v2.7.1
25.61 s
[gammaloop-workspace-check] Checking getrandom v0.4.2
25.67 s
[gammaloop-workspace-check] Checking rand_core v0.6.4
25.79 s
[gammaloop-workspace-check] Checking fastrand v2.4.1
25.94 s
[gammaloop-workspace-check] Checking plotters-backend v0.3.7
26.18 s
[gammaloop-workspace-check] Compiling unicode_names2 v1.3.0
26.18 s
[gammaloop-workspace-check] Checking rand_chacha v0.9.0
26.19 s
[gammaloop-workspace-check] Checking fnv v1.0.7
26.37 s
[gammaloop-workspace-check] Checking tempfile v3.27.0
26.50 s
[gammaloop-workspace-check] Checking ciborium-ll v0.2.2
26.54 s
[gammaloop-workspace-check] Checking crossterm v0.28.1
26.55 s
[gammaloop-workspace-check] Checking rand v0.9.4
26.76 s
[gammaloop-workspace-check] Checking plotters-svg v0.3.7
26.96 s
[gammaloop-workspace-check] Checking ciborium v0.2.2
27.08 s
[gammaloop-workspace-check] Checking toml_datetime v0.6.11
27.20 s
[gammaloop-workspace-check] Checking serde_spanned v0.6.9
27.31 s
[gammaloop-workspace-check] Checking itertools v0.10.5
27.49 s
[gammaloop-workspace-check] Checking toml_write v0.1.2
27.60 s
[gammaloop-workspace-check] Checking tap v1.0.1
27.67 s
[gammaloop-workspace-check] Checking matchers v0.2.0
27.68 s
[gammaloop-workspace-check] Checking regex v1.12.3
27.72 s
[gammaloop-workspace-check] Checking globset v0.4.18
27.74 s
[gammaloop-workspace-check] Checking ansitok v0.3.0
27.86 s
[gammaloop-workspace-check] Checking clap v4.6.1
27.92 s
[gammaloop-workspace-check] Checking cast v0.3.0
28.00 s
[gammaloop-workspace-check] Checking tracing-subscriber v0.3.23
28.08 s
[gammaloop-workspace-check] Checking ansi-str v0.9.0
28.11 s
[gammaloop-workspace-check] Checking wyz v0.5.1
28.17 s
[gammaloop-workspace-check] Checking plotters v0.3.7
28.23 s
[gammaloop-workspace-check] Checking symjit v2.21.0
28.27 s
[gammaloop-workspace-check] Checking rand_chacha v0.3.1
28.29 s
[gammaloop-workspace-check] Checking rust-embed-utils v8.11.0
28.54 s
[gammaloop-workspace-check] Checking radium v0.7.0
28.56 s
[gammaloop-workspace-check] Checking criterion-plot v0.5.0
28.74 s
[gammaloop-workspace-check] Checking typeid v1.0.3
28.76 s
[gammaloop-workspace-check] Checking similar v2.7.0
28.78 s
[gammaloop-workspace-check] Checking tinytemplate v1.2.1
28.81 s
[gammaloop-workspace-check] Checking is-terminal v0.4.17
28.85 s
[gammaloop-workspace-check] Checking anes v0.1.6
28.96 s
[gammaloop-workspace-check] Checking oorandom v11.1.5
28.97 s
[gammaloop-workspace-check] Checking funty v2.0.0
28.98 s
[gammaloop-workspace-check] Checking bytecount v0.6.9
29.04 s
[gammaloop-workspace-check] Checking rand v0.8.6
29.21 s
[gammaloop-workspace-check] Checking ron v0.12.1
29.49 s
[gammaloop-workspace-check] Checking papergrid v0.17.0
29.64 s
[gammaloop-workspace-check] Checking env_filter v1.0.1
30.14 s
[gammaloop-workspace-check] Checking testing_table v0.3.0
30.17 s
[gammaloop-workspace-check] Checking toml_edit v0.25.11+spec-1.1.0
30.27 s
[gammaloop-workspace-check] Checking uncased v0.9.10
30.43 s
[gammaloop-workspace-check] Checking jiff v0.2.24
30.60 s
[gammaloop-workspace-check] Checking bitvec v1.0.1
30.73 s
[gammaloop-workspace-check] Checking ptr_meta v0.1.4
30.74 s
[gammaloop-workspace-check] Checking xprec v0.2.2
30.84 s
[gammaloop-workspace-check] Checking simdutf8 v0.1.5
30.95 s
[gammaloop-workspace-check] Checking ucd-trie v0.1.7
31.01 s
[gammaloop-workspace-check] Checking bytecheck v0.6.12
31.13 s
[gammaloop-workspace-check] Checking ahash v0.7.8
31.33 s
[gammaloop-workspace-check] Checking pest v2.8.6
31.39 s
[gammaloop-workspace-check] Checking toml_edit v0.22.27
31.48 s
[gammaloop-workspace-check] Checking hashbrown v0.12.3
31.60 s
[gammaloop-workspace-check] Checking rend v0.4.2
32.23 s
[gammaloop-workspace-check] Checking approx v0.4.0
32.27 s
[gammaloop-workspace-check] Checking criterion v0.5.1
32.37 s
[gammaloop-workspace-check] Checking seahash v4.1.0
32.43 s
[gammaloop-workspace-check] Checking cgmath v0.18.0
32.52 s
[gammaloop-workspace-check] Checking num-rational v0.4.2
32.57 s
[gammaloop-workspace-check] Checking insta v1.47.2
33.13 s
[gammaloop-workspace-check] Checking tabled v0.20.0
33.16 s
[gammaloop-workspace-check] Checking num-iter v0.1.45
33.22 s
[gammaloop-workspace-check] Checking ref-ops v0.2.5
33.42 s
[gammaloop-workspace-check] Checking num v0.4.3
33.50 s
[gammaloop-workspace-check] Checking rand_xoshiro v0.6.0
33.61 s
[gammaloop-workspace-check] Checking features v0.10.0
33.77 s
[gammaloop-workspace-check] Checking gat-lending-iterator v0.1.8
34.16 s
[gammaloop-workspace-check] Checking dot-parser v0.5.1
34.20 s
[gammaloop-workspace-check] Compiling pyo3-macros-backend v0.28.3
34.41 s
[gammaloop-workspace-check] Compiling pyo3-ffi v0.28.3
34.60 s
[gammaloop-workspace-check] Compiling pyo3 v0.28.3
34.67 s
[gammaloop-workspace-check] Compiling numpy v0.28.0
35.40 s
[gammaloop-workspace-check] Checking constcat v0.5.1
35.44 s
[gammaloop-workspace-check] Checking colored v2.2.0
35.57 s
[gammaloop-workspace-check] Checking constant_time_eq v0.4.2
35.64 s
[gammaloop-workspace-check] Checking cpufeatures v0.3.0
35.70 s
[gammaloop-workspace-check] Checking arrayref v0.3.9
35.75 s
[gammaloop-workspace-check] Checking base64 v0.22.1
35.78 s
[gammaloop-workspace-check] Checking siphasher v1.0.2
35.82 s
[gammaloop-workspace-check] Checking blake3 v1.8.5
35.88 s
[gammaloop-workspace-check] Checking joinery v2.1.0
35.96 s
[gammaloop-workspace-check] Checking phf_shared v0.13.1
36.02 s
[gammaloop-workspace-check] Checking rust_lisp v0.18.0
36.04 s
[gammaloop-workspace-check] Checking toml v0.8.23
36.14 s
[gammaloop-workspace-check] Checking subprocess v0.2.15
36.25 s
[gammaloop-workspace-check] Checking titlecase v2.2.1
36.53 s
[gammaloop-workspace-check] Compiling vakint v0.1.2 (/build/source/crates/vakint)
36.56 s
[gammaloop-workspace-check] Checking version-compare v0.2.1
36.59 s
[gammaloop-workspace-check] Checking phf v0.13.1
36.67 s
[gammaloop-workspace-check] Checking xpct v0.5.1
36.67 s
[gammaloop-workspace-check] Checking figment v0.10.19
36.92 s
[gammaloop-workspace-check] Checking ryu v1.0.23
36.95 s
[gammaloop-workspace-check] Checking castaway v0.2.4
36.99 s
[gammaloop-workspace-check] Checking toml_datetime v0.7.5+spec-1.1.0
37.06 s
[gammaloop-workspace-check] Checking env_logger v0.11.10
37.07 s
[gammaloop-workspace-check] Checking strum v0.27.2
37.23 s
[gammaloop-workspace-check] Checking unicode-truncate v2.0.1
37.26 s
[gammaloop-workspace-check] Checking kasuari v0.4.12
37.26 s
[gammaloop-workspace-check] Checking lru v0.16.4
37.31 s
[gammaloop-workspace-check] Checking vte v0.15.0
37.36 s
[gammaloop-workspace-check] Checking toml v0.9.12+spec-1.1.0
37.36 s
[gammaloop-workspace-check] Checking portable-atomic v1.13.1
37.46 s
[gammaloop-workspace-check] Checking compact_str v0.9.0
37.56 s
[gammaloop-workspace-check] Checking vt100 v0.16.2
37.63 s
[gammaloop-workspace-check] Checking unit-prefix v0.5.2
37.67 s
[gammaloop-workspace-check] Checking rand_distr v0.4.3
37.72 s
[gammaloop-workspace-check] Compiling rustpython-parser-core v0.4.0
37.75 s
[gammaloop-workspace-check] Checking string-template-plus v0.4.3
37.77 s
[gammaloop-workspace-check] Checking simba v0.6.0
37.90 s
[gammaloop-workspace-check] Checking line-clipping v0.3.7
37.90 s
[gammaloop-workspace-check] Compiling three-dimensional-reps v0.1.0 (/build/source/crates/three-dimensional-reps)
37.99 s
[gammaloop-workspace-check] Checking gimli v0.32.3
38.02 s
[gammaloop-workspace-check] Checking adler2 v2.0.1
38.05 s
[gammaloop-workspace-check] Checking thiserror v1.0.69
38.10 s
[gammaloop-workspace-check] Checking indicatif v0.18.4
38.14 s
[gammaloop-workspace-check] Checking derive_builder v0.11.2
38.20 s
[gammaloop-workspace-check] Checking object v0.37.3
38.22 s
[gammaloop-workspace-check] Checking miniz_oxide v0.8.9
38.22 s
[gammaloop-workspace-check] Checking crossterm v0.29.0
38.22 s
[gammaloop-workspace-check] Checking owo-colors v4.3.0
38.26 s
[gammaloop-workspace-check] Checking ratatui-core v0.1.0
38.58 s
[gammaloop-workspace-check] Compiling rustpython-ast v0.4.0
38.66 s
[gammaloop-workspace-check] Checking tracing-error v0.2.1
39.26 s
[gammaloop-workspace-check] Checking typed-index-collections v3.5.0
39.32 s
[gammaloop-workspace-check] Checking amd v0.2.2
39.78 s
[gammaloop-workspace-check] Checking serde-big-array v0.5.1
39.79 s
[gammaloop-workspace-check] Checking ratatui-widgets v0.3.0
39.83 s
[gammaloop-workspace-check] Checking itertools v0.11.0
39.86 s
[gammaloop-workspace-check] Compiling gammaloop-tracing-filter-macros v0.1.0 (/build/source/crates/gammaloop-tracing-filter-macros)
40.00 s
[gammaloop-workspace-check] Checking rustc-demangle v0.1.27
40.06 s
[gammaloop-workspace-check] Checking option-ext v0.2.0
40.14 s
[gammaloop-workspace-check] Checking dirs-sys v0.5.0
40.27 s
[gammaloop-workspace-check] Checking ratatui-crossterm v0.1.0
40.29 s
[gammaloop-workspace-check] Checking ref-cast v1.0.25
40.30 s
[gammaloop-workspace-check] Checking nix v0.31.2
40.35 s
[gammaloop-workspace-check] Checking integer-sqrt v0.1.5
40.44 s
[gammaloop-workspace-check] Checking brotli-decompressor v4.0.3
40.49 s
[gammaloop-workspace-check] Checking crossbeam-channel v0.5.15
40.58 s
[gammaloop-workspace-check] Checking itertools v0.12.1
40.91 s
[gammaloop-workspace-check] Compiling gammalooprs v0.3.4 (/build/source/crates/gammalooprs)
41.02 s
[gammaloop-workspace-check] Checking unsafe-libyaml v0.2.11
41.22 s
[gammaloop-workspace-check] Checking symlink v0.1.0
41.25 s
[gammaloop-workspace-check] Checking ratatui-macros v0.7.0
41.39 s
[gammaloop-workspace-check] Checking tracing-appender v0.2.5
41.42 s
[gammaloop-workspace-check] Checking ratatui v0.30.0
41.62 s
[gammaloop-workspace-check] Checking rkyv v0.7.46
41.66 s
[gammaloop-workspace-check] Checking color-spantrace v0.3.0
41.67 s
[gammaloop-workspace-check] Checking ctrlc v3.5.2
41.69 s
[gammaloop-workspace-check] Checking brotli v7.0.0
41.76 s
[gammaloop-workspace-check] Checking include_dir v0.7.4
41.77 s
[gammaloop-workspace-check] Checking pathfinding v4.15.0
41.96 s
[gammaloop-workspace-check] Checking schemars v1.2.1
41.97 s
[gammaloop-workspace-check] Checking dirs v6.0.0
42.02 s
[gammaloop-workspace-check] Checking slotmap v1.1.1
42.08 s
[gammaloop-workspace-check] Checking tracing-indicatif v0.3.14
42.21 s
[gammaloop-workspace-check] Checking json5 v0.4.1
42.48 s
[gammaloop-workspace-check] Checking serde_yaml v0.9.34+deprecated
42.77 s
[gammaloop-workspace-check] Checking addr2line v0.25.1
42.81 s
[gammaloop-workspace-check] Checking vectorize v0.2.0
42.89 s
[gammaloop-workspace-check] Checking base62 v2.2.4
42.97 s
[gammaloop-workspace-check] Checking ringbuffer v0.16.0
42.99 s
[gammaloop-workspace-check] Checking rust-embed v8.11.0
43.15 s
[gammaloop-workspace-check] Checking clap_complete v4.6.3
43.21 s
[gammaloop-workspace-check] Checking strip-ansi-escapes v0.2.1
43.37 s
[gammaloop-workspace-check] Compiling gammaloop-api v0.1.0 (/build/source/crates/gammaloop-api)
43.42 s
[gammaloop-workspace-check] Checking fd-lock v4.0.4
43.44 s
[gammaloop-workspace-check] Checking itertools v0.13.0
43.50 s
[gammaloop-workspace-check] Checking strum v0.26.3
43.52 s
[gammaloop-workspace-check] Checking clap_complete_nushell v4.6.0
43.60 s
[gammaloop-workspace-check] Checking sysinfo v0.33.1
43.74 s
[gammaloop-workspace-check] Checking shlex v1.3.0
43.94 s
[gammaloop-workspace-check] Checking futures-core v0.3.32
44.01 s
[gammaloop-workspace-check] Checking clarabel v0.11.1
44.18 s
[gammaloop-workspace-check] Checking slab v0.4.12
44.28 s
[gammaloop-workspace-check] Checking futures-task v0.3.32
44.34 s
[gammaloop-workspace-check] Checking sdd v3.0.10
44.39 s
[gammaloop-workspace-check] Compiling gammaloop-integration-tests v0.1.0 (/build/source/tests)
44.40 s
[gammaloop-workspace-check] Compiling test-log-core v0.2.20
44.42 s
[gammaloop-workspace-check] Compiling rustc_version v0.4.1
44.47 s
[gammaloop-workspace-check] Checking which v8.0.2
44.58 s
[gammaloop-workspace-check] Checking scc v2.4.0
44.82 s
[gammaloop-workspace-check] Checking futures-util v0.3.32
45.13 s
[gammaloop-workspace-check] Checking bincode v1.3.3
45.60 s
[gammaloop-workspace-check] Compiling gungraun-runner v0.18.2
46.09 s
[gammaloop-workspace-check] Compiling gungraun-macros v0.8.0
47.70 s
[gammaloop-workspace-check] Compiling test-log-macros v0.2.20
48.30 s
[gammaloop-workspace-check] Compiling numerica v2.2.0 (https://github.com/alphal00p/symbolica?rev=4d0a833eb8e059d1f95bdae5abed2559830b235f#4d0a833e)
48.74 s
[gammaloop-workspace-check] Checking reedline v0.42.0
49.34 s
[gammaloop-workspace-check] Checking proc-macro2 v1.0.106
49.70 s
[gammaloop-workspace-check] Checking nalgebra v0.29.0
50.14 s
[gammaloop-workspace-check] Checking base64 v0.21.7
50.21 s
[gammaloop-workspace-check] Checking maplit v1.0.2
50.24 s
[gammaloop-workspace-check] Compiling iai-callgrind-runner v0.14.2
50.31 s
[gammaloop-workspace-check] Checking backtrace v0.3.76
50.48 s
[gammaloop-workspace-check] Checking quote v1.0.45
50.62 s
[gammaloop-workspace-check] Checking kurbo v0.13.0
50.62 s
[gammaloop-workspace-check] Checking wait-timeout v0.2.1
50.70 s
[gammaloop-workspace-check] Checking quick-error v1.2.3
50.76 s
[gammaloop-workspace-check] Checking bit-vec v0.8.0
50.82 s
[gammaloop-workspace-check] Compiling iai-callgrind v0.14.2
51.08 s
[gammaloop-workspace-check] Checking color-eyre v0.6.5
51.10 s
[gammaloop-workspace-check] Checking ron v0.8.1
51.20 s
[gammaloop-workspace-check] Checking bit-set v0.8.0
51.24 s
[gammaloop-workspace-check] Checking futures-executor v0.3.32
51.32 s
[gammaloop-workspace-check] Checking serial_test v3.4.0
51.37 s
[gammaloop-workspace-check] Checking syn v2.0.117
51.48 s
[gammaloop-workspace-check] Checking rusty-fork v0.3.1
51.61 s
[gammaloop-workspace-check] Compiling iai-callgrind-macros v0.5.1
51.68 s
[gammaloop-workspace-check] Checking rand_xorshift v0.4.0
51.85 s
[gammaloop-workspace-check] Checking console v0.15.11
51.92 s
[gammaloop-workspace-check] Checking pathdiff v0.2.3
52.10 s
[gammaloop-workspace-check] Checking unarray v0.1.4
52.33 s
[gammaloop-workspace-check] Checking proptest v1.11.0
52.66 s
[gammaloop-workspace-check] Checking similar-asserts v1.7.0
52.90 s
[gammaloop-workspace-check] Checking clinnet v0.1.8 (/build/source/crates/clinnet)
53.46 s
[gammaloop-workspace-check] Checking kurvst v0.1.0 (/build/source/crates/kurvst)
53.56 s
[gammaloop-workspace-check] Checking test-log v0.2.20
58.17 s
[gammaloop-workspace-check] Compiling graphica v2.1.0 (https://github.com/alphal00p/symbolica?rev=4d0a833eb8e059d1f95bdae5abed2559830b235f#4d0a833e)
63.50 s
[gammaloop-workspace-check] Checking statrs v0.16.1
65.36 s
[gammaloop-workspace-check] Checking momtrop v0.3.0
67.04 s
[gammaloop-workspace-check] Checking gungraun v0.18.2
71.36 s
[gammaloop-workspace-check] Compiling pyo3-macros v0.28.3
72.27 s
[gammaloop-workspace-check] Compiling pyo3-stub-gen-derive v0.17.2
81.72 s
[gammaloop-workspace-check] Checking pyo3-stub-gen v0.17.2
88.39 s
[gammaloop-workspace-check] Checking symbolica-utils v0.1.0 (/build/source/crates/symbolica-utils)
88.39 s
[gammaloop-workspace-check] Checking spenso-macros v0.3.2 (/build/source/crates/spenso-macros)
273.81 s
[gammaloop-workspace-check] Compiling gammaloop-workspace-hack v0.1.0 (/build/source/crates/gammaloop-workspace-hack)
273.99 s
[gammaloop-workspace-check] Checking linnet v0.17.0 (/build/source/crates/linnet)
276.79 s
[gammaloop-workspace-check] Checking spenso v0.6.0 (/build/source/crates/spenso)
276.96 s
[gammaloop-workspace-check] Checking linnet-py v0.1.0 (/build/source/crates/linnet-py)
276.96 s
[gammaloop-workspace-check] Checking linnest v0.1.0 (/build/source/crates/linnest)
280.99 s
[gammaloop-workspace-check] Checking idenso v0.3.0 (/build/source/crates/idenso)
280.99 s
[gammaloop-workspace-check] Checking gammaloop-tracing-filter v0.1.0 (/build/source/crates/gammaloop-tracing-filter)
282.51 s
[gammaloop-workspace-check] Checking spenso-hep-lib v0.1.7 (/build/source/crates/spenso-hep-lib)
282.65 s
[gammaloop-workspace-check] Checking spynso3 v0.1.2 (/build/source/crates/spynso3)
314.45 s
[gammaloop-workspace-check] error[E0624] : method `export_uv_forest_graph` is private
314.45 s
[gammaloop-workspace-check] --> tests/tests/uv.rs:3426:33
314.45 s
[gammaloop-workspace-check] |
314.45 s
[gammaloop-workspace-check] 3426 | let soft_export = integrand.export_uv_forest_graph(
314.45 s
[gammaloop-workspace-check] | ^^^^^^^^^^^^^^^^^^^^^^ private method
314.45 s
[gammaloop-workspace-check] |
314.45 s
[gammaloop-workspace-check] ::: crates/gammalooprs/src/uv/export.rs:125:5
314.45 s
[gammaloop-workspace-check] |
314.45 s
[gammaloop-workspace-check] 125 | / pub(crate) fn export_uv_forest_graph(
314.45 s
[gammaloop-workspace-check] 126 | | &self,
314.45 s
[gammaloop-workspace-check] 127 | | graph_id: usize,
314.45 s
[gammaloop-workspace-check] 128 | | orientation: Option<OrientationProjection<'_>>,
314.45 s
[gammaloop-workspace-check] 129 | | generation_settings: &GenerationSettings,
314.45 s
[gammaloop-workspace-check] 130 | | export_settings: &UVForestExportSettings,
314.45 s
[gammaloop-workspace-check] 131 | | ) -> Result<UVForestExport> {
314.45 s
[gammaloop-workspace-check] | |_______________________________- private method defined here
314.45 s
[gammaloop-workspace-check]
314.46 s
[gammaloop-workspace-check] error[E0624] : method `export_uv_forest_graph` is private
314.46 s
[gammaloop-workspace-check] --> tests/tests/uv.rs:3522:38
314.46 s
[gammaloop-workspace-check] |
314.46 s
[gammaloop-workspace-check] 3522 | let uv_export = uv_integrand.export_uv_forest_graph(
314.46 s
[gammaloop-workspace-check] | ^^^^^^^^^^^^^^^^^^^^^^ private method
314.46 s
[gammaloop-workspace-check] |
314.46 s
[gammaloop-workspace-check] ::: crates/gammalooprs/src/uv/export.rs:125:5
314.46 s
[gammaloop-workspace-check] |
314.46 s
[gammaloop-workspace-check] 125 | / pub(crate) fn export_uv_forest_graph(
314.46 s
[gammaloop-workspace-check] 126 | | &self,
314.46 s
[gammaloop-workspace-check] 127 | | graph_id: usize,
314.46 s
[gammaloop-workspace-check] 128 | | orientation: Option<OrientationProjection<'_>>,
314.46 s
[gammaloop-workspace-check] 129 | | generation_settings: &GenerationSettings,
314.46 s
[gammaloop-workspace-check] 130 | | export_settings: &UVForestExportSettings,
314.46 s
[gammaloop-workspace-check] 131 | | ) -> Result<UVForestExport> {
314.46 s
[gammaloop-workspace-check] | |_______________________________- private method defined here
314.46 s
[gammaloop-workspace-check]
314.49 s
[gammaloop-workspace-check] error[E0624] : method `export_uv_forest_graph` is private
314.49 s
[gammaloop-workspace-check] --> tests/tests/uv.rs:3936:44
314.49 s
[gammaloop-workspace-check] |
314.49 s
[gammaloop-workspace-check] 3936 | let export = integrand.export_uv_forest_graph(
314.49 s
[gammaloop-workspace-check] | ^^^^^^^^^^^^^^^^^^^^^^ private method
314.49 s
[gammaloop-workspace-check] |
314.49 s
[gammaloop-workspace-check] ::: crates/gammalooprs/src/uv/export.rs:125:5
314.49 s
[gammaloop-workspace-check] |
314.49 s
[gammaloop-workspace-check] 125 | / pub(crate) fn export_uv_forest_graph(
314.49 s
[gammaloop-workspace-check] 126 | | &self,
314.49 s
[gammaloop-workspace-check] 127 | | graph_id: usize,
314.49 s
[gammaloop-workspace-check] 128 | | orientation: Option<OrientationProjection<'_>>,
314.49 s
[gammaloop-workspace-check] 129 | | generation_settings: &GenerationSettings,
314.49 s
[gammaloop-workspace-check] 130 | | export_settings: &UVForestExportSettings,
314.49 s
[gammaloop-workspace-check] 131 | | ) -> Result<UVForestExport> {
314.49 s
[gammaloop-workspace-check] | |_______________________________- private method defined here
314.49 s
[gammaloop-workspace-check]
314.51 s
[gammaloop-workspace-check] error[E0624] : method `export_uv_forest_graph` is private
314.51 s
[gammaloop-workspace-check] --> tests/tests/uv.rs:4128:36
314.51 s
[gammaloop-workspace-check] |
314.51 s
[gammaloop-workspace-check] 4128 | let export = integrand.export_uv_forest_graph(
314.51 s
[gammaloop-workspace-check] | ^^^^^^^^^^^^^^^^^^^^^^ private method
314.51 s
[gammaloop-workspace-check] |
314.51 s
[gammaloop-workspace-check] ::: crates/gammalooprs/src/uv/export.rs:125:5
314.51 s
[gammaloop-workspace-check] |
314.51 s
[gammaloop-workspace-check] 125 | / pub(crate) fn export_uv_forest_graph(
314.51 s
[gammaloop-workspace-check] 126 | | &self,
314.51 s
[gammaloop-workspace-check] 127 | | graph_id: usize,
314.51 s
[gammaloop-workspace-check] 128 | | orientation: Option<OrientationProjection<'_>>,
314.51 s
[gammaloop-workspace-check] 129 | | generation_settings: &GenerationSettings,
314.51 s
[gammaloop-workspace-check] 130 | | export_settings: &UVForestExportSettings,
314.51 s
[gammaloop-workspace-check] 131 | | ) -> Result<UVForestExport> {
314.51 s
[gammaloop-workspace-check] | |_______________________________- private method defined here
314.51 s
[gammaloop-workspace-check]
314.52 s
[gammaloop-workspace-check] error[E0624] : method `export_uv_forest_graph` is private
314.52 s
[gammaloop-workspace-check] --> tests/tests/uv.rs:4335:36
314.52 s
[gammaloop-workspace-check] |
314.52 s
[gammaloop-workspace-check] 4335 | let export = integrand.export_uv_forest_graph(
314.52 s
[gammaloop-workspace-check] | ^^^^^^^^^^^^^^^^^^^^^^ private method
314.52 s
[gammaloop-workspace-check] |
314.52 s
[gammaloop-workspace-check] ::: crates/gammalooprs/src/uv/export.rs:125:5
314.52 s
[gammaloop-workspace-check] |
314.52 s
[gammaloop-workspace-check] 125 | / pub(crate) fn export_uv_forest_graph(
314.52 s
[gammaloop-workspace-check] 126 | | &self,
314.52 s
[gammaloop-workspace-check] 127 | | graph_id: usize,
314.52 s
[gammaloop-workspace-check] 128 | | orientation: Option<OrientationProjection<'_>>,
314.52 s
[gammaloop-workspace-check] 129 | | generation_settings: &GenerationSettings,
314.52 s
[gammaloop-workspace-check] 130 | | export_settings: &UVForestExportSettings,
314.52 s
[gammaloop-workspace-check] 131 | | ) -> Result<UVForestExport> {
314.52 s
[gammaloop-workspace-check] | |_______________________________- private method defined here
314.52 s
[gammaloop-workspace-check]
314.70 s
[gammaloop-workspace-check] error[E0061] : this method takes 5 arguments but 3 arguments were supplied
314.70 s
[gammaloop-workspace-check] --> tests/tests/uv.rs:4551:26
314.70 s
[gammaloop-workspace-check] |
314.70 s
[gammaloop-workspace-check] 4551 | parent_graph.cff(&parent_tree, &parent_cut, &OrientationPattern::default())?;
314.70 s
[gammaloop-workspace-check] | ^^^ ----------------------------------------------------------- two arguments of type `&three_dimensional_reps::generation::Generate3DExpressionOptions` and `Option<&symbolica::atom::Atom>` are missing
314.70 s
[gammaloop-workspace-check] |
314.70 s
[gammaloop-workspace-check] note : method defined here
314.70 s
[gammaloop-workspace-check] --> crates/gammalooprs/src/cff/mod.rs:755:12
314.70 s
[gammaloop-workspace-check] |
314.70 s
[gammaloop-workspace-check] 755 | pub fn cff<S: SubGraphLike + SubSetLike>(
314.70 s
[gammaloop-workspace-check] | ^^^
314.70 s
[gammaloop-workspace-check] help : provide the arguments
314.70 s
[gammaloop-workspace-check] |
314.70 s
[gammaloop-workspace-check] 4551 | parent_graph.cff(&parent_tree, &parent_cut, &OrientationPattern::default(), /* &three_dimensional_reps::generation::Generate3DExpressionOptions */, /* Option<&symbolica::atom::Atom> */ )?;
314.70 s
[gammaloop-workspace-check] | ++++++++++++++++++++++++++++++++++++++++++++++++++++++++++++++++++++++++++++++++++++++++++++++++++++++++++++++
314.70 s
[gammaloop-workspace-check]
314.70 s
[gammaloop-workspace-check] error[E0616] : field `orientations` of struct `CFFTerm` is private
314.70 s
[gammaloop-workspace-check] --> tests/tests/uv.rs:4555:36
314.70 s
[gammaloop-workspace-check] |
314.70 s
[gammaloop-workspace-check] 4555 | .flat_map(|term| &term.orientations)
314.70 s
[gammaloop-workspace-check] | ^^^^^^^^^^^^ private field
314.70 s
[gammaloop-workspace-check]
314.77 s
[gammaloop-workspace-check] error[E0609] : no field `orientations` on type `&GeneratedThreeDExpression<Esurface, Hsurface>`
314.77 s
[gammaloop-workspace-check] --> tests/tests/uv.rs:4653:18
314.77 s
[gammaloop-workspace-check] |
314.77 s
[gammaloop-workspace-check] 4653 | .orientations
314.77 s
[gammaloop-workspace-check] | ^^^^^^^^^^^^ unknown field
314.77 s
[gammaloop-workspace-check] |
314.77 s
[gammaloop-workspace-check] = note : the full name for the type has been written to '/build/source/target/ci-optim/deps/uv-ae6ff038ef4b6f0a.long-type-1251860757990444536.txt'
314.77 s
[gammaloop-workspace-check] = note : consider using `--verbose` to print the full type name to the console
314.77 s
[gammaloop-workspace-check] help : one of the expressions' fields has a field of the same name
314.77 s
[gammaloop-workspace-check] |
314.77 s
[gammaloop-workspace-check] 4653 | .expression. orientations
314.77 s
[gammaloop-workspace-check] | +++++++++++
314.77 s
[gammaloop-workspace-check]
314.77 s
[gammaloop-workspace-check] error[E0624] : method `export_uv_forest_graph` is private
314.77 s
[gammaloop-workspace-check] --> tests/tests/uv.rs:4673:43
314.77 s
[gammaloop-workspace-check] |
314.77 s
[gammaloop-workspace-check] 4673 | let structural_forest = integrand.export_uv_forest_graph(
314.77 s
[gammaloop-workspace-check] | ^^^^^^^^^^^^^^^^^^^^^^ private method
314.77 s
[gammaloop-workspace-check] |
314.77 s
[gammaloop-workspace-check] ::: crates/gammalooprs/src/uv/export.rs:125:5
314.77 s
[gammaloop-workspace-check] |
314.77 s
[gammaloop-workspace-check] 125 | / pub(crate) fn export_uv_forest_graph(
314.77 s
[gammaloop-workspace-check] 126 | | &self,
314.77 s
[gammaloop-workspace-check] 127 | | graph_id: usize,
314.77 s
[gammaloop-workspace-check] 128 | | orientation: Option<OrientationProjection<'_>>,
314.77 s
[gammaloop-workspace-check] 129 | | generation_settings: &GenerationSettings,
314.77 s
[gammaloop-workspace-check] 130 | | export_settings: &UVForestExportSettings,
314.77 s
[gammaloop-workspace-check] 131 | | ) -> Result<UVForestExport> {
314.77 s
[gammaloop-workspace-check] | |_______________________________- private method defined here
314.77 s
[gammaloop-workspace-check]
314.80 s
[gammaloop-workspace-check] error[E0624] : method `export_uv_forest_graph` is private
314.80 s
[gammaloop-workspace-check] --> tests/tests/uv.rs:4897:43
314.80 s
[gammaloop-workspace-check] |
314.80 s
[gammaloop-workspace-check] 4897 | let structural_forest = integrand.export_uv_forest_graph(
314.80 s
[gammaloop-workspace-check] | ^^^^^^^^^^^^^^^^^^^^^^ private method
314.80 s
[gammaloop-workspace-check] |
314.80 s
[gammaloop-workspace-check] ::: crates/gammalooprs/src/uv/export.rs:125:5
314.80 s
[gammaloop-workspace-check] |
314.80 s
[gammaloop-workspace-check] 125 | / pub(crate) fn export_uv_forest_graph(
314.80 s
[gammaloop-workspace-check] 126 | | &self,
314.80 s
[gammaloop-workspace-check] 127 | | graph_id: usize,
314.80 s
[gammaloop-workspace-check] 128 | | orientation: Option<OrientationProjection<'_>>,
314.80 s
[gammaloop-workspace-check] 129 | | generation_settings: &GenerationSettings,
314.80 s
[gammaloop-workspace-check] 130 | | export_settings: &UVForestExportSettings,
314.80 s
[gammaloop-workspace-check] 131 | | ) -> Result<UVForestExport> {
314.80 s
[gammaloop-workspace-check] | |_______________________________- private method defined here
314.80 s
[gammaloop-workspace-check]
314.82 s
[gammaloop-workspace-check] error[E0624] : method `export_uv_forest_graph` is private
314.82 s
[gammaloop-workspace-check] --> tests/tests/uv.rs:5146:43
314.82 s
[gammaloop-workspace-check] |
314.82 s
[gammaloop-workspace-check] 5146 | let structural_forest = integrand.export_uv_forest_graph(
314.82 s
[gammaloop-workspace-check] | ^^^^^^^^^^^^^^^^^^^^^^ private method
314.82 s
[gammaloop-workspace-check] |
314.82 s
[gammaloop-workspace-check] ::: crates/gammalooprs/src/uv/export.rs:125:5
314.82 s
[gammaloop-workspace-check] |
314.82 s
[gammaloop-workspace-check] 125 | / pub(crate) fn export_uv_forest_graph(
314.82 s
[gammaloop-workspace-check] 126 | | &self,
314.82 s
[gammaloop-workspace-check] 127 | | graph_id: usize,
314.82 s
[gammaloop-workspace-check] 128 | | orientation: Option<OrientationProjection<'_>>,
314.82 s
[gammaloop-workspace-check] 129 | | generation_settings: &GenerationSettings,
314.82 s
[gammaloop-workspace-check] 130 | | export_settings: &UVForestExportSettings,
314.82 s
[gammaloop-workspace-check] 131 | | ) -> Result<UVForestExport> {
314.82 s
[gammaloop-workspace-check] | |_______________________________- private method defined here
314.82 s
[gammaloop-workspace-check]
314.82 s
[gammaloop-workspace-check] error[E0624] : method `export_uv_forest_graph` is private
314.82 s
[gammaloop-workspace-check] --> tests/tests/uv.rs:5161:41
314.82 s
[gammaloop-workspace-check] |
314.82 s
[gammaloop-workspace-check] 5161 | let computed_forest = integrand.export_uv_forest_graph(
314.82 s
[gammaloop-workspace-check] | ^^^^^^^^^^^^^^^^^^^^^^ private method
314.82 s
[gammaloop-workspace-check] |
314.82 s
[gammaloop-workspace-check] ::: crates/gammalooprs/src/uv/export.rs:125:5
314.82 s
[gammaloop-workspace-check] |
314.82 s
[gammaloop-workspace-check] 125 | / pub(crate) fn export_uv_forest_graph(
314.82 s
[gammaloop-workspace-check] 126 | | &self,
314.82 s
[gammaloop-workspace-check] 127 | | graph_id: usize,
314.82 s
[gammaloop-workspace-check] 128 | | orientation: Option<OrientationProjection<'_>>,
314.82 s
[gammaloop-workspace-check] 129 | | generation_settings: &GenerationSettings,
314.82 s
[gammaloop-workspace-check] 130 | | export_settings: &UVForestExportSettings,
314.82 s
[gammaloop-workspace-check] 131 | | ) -> Result<UVForestExport> {
314.82 s
[gammaloop-workspace-check] | |_______________________________- private method defined here
314.82 s
[gammaloop-workspace-check]
314.86 s
[gammaloop-workspace-check] error[E0624] : method `export_uv_forest_graph` is private
314.86 s
[gammaloop-workspace-check] --> tests/tests/uv.rs:5724:51
314.86 s
[gammaloop-workspace-check] |
314.86 s
[gammaloop-workspace-check] 5724 | let structural_forest = integrand.export_uv_forest_graph(
314.86 s
[gammaloop-workspace-check] | ^^^^^^^^^^^^^^^^^^^^^^ private method
314.86 s
[gammaloop-workspace-check] |
314.86 s
[gammaloop-workspace-check] ::: crates/gammalooprs/src/uv/export.rs:125:5
314.86 s
[gammaloop-workspace-check] |
314.86 s
[gammaloop-workspace-check] 125 | / pub(crate) fn export_uv_forest_graph(
314.86 s
[gammaloop-workspace-check] 126 | | &self,
314.86 s
[gammaloop-workspace-check] 127 | | graph_id: usize,
314.86 s
[gammaloop-workspace-check] 128 | | orientation: Option<OrientationProjection<'_>>,
314.86 s
[gammaloop-workspace-check] 129 | | generation_settings: &GenerationSettings,
314.86 s
[gammaloop-workspace-check] 130 | | export_settings: &UVForestExportSettings,
314.86 s
[gammaloop-workspace-check] 131 | | ) -> Result<UVForestExport> {
314.86 s
[gammaloop-workspace-check] | |_______________________________- private method defined here
314.86 s
[gammaloop-workspace-check]
315.07 s
[gammaloop-workspace-check] Some errors have detailed explanations: E0061, E0609, E0616, E0624.
315.07 s
[gammaloop-workspace-check] For more information about an error, try `rustc --explain E0061`.
315.10 s
[gammaloop-workspace-check] error : could not compile `gammaloop-integration-tests` (test "uv") due to 13 previous errors
315.10 s
[gammaloop-workspace-check] warning : build failed, waiting for other jobs to finish...
316.39 s
Progress: 0 of 1 built (1 failed)
316.39 s
Failed to build gammaloop-workspace-check after 5m11s
316.41 s
Cannot build ' /nix/store/yq41fja0qvn1pcayl6m3fb5q6zl3fd3g-gammaloop-workspace-check-0.1.0.drv '.
316.41 s
Reason: builder failed with exit code 101 .
316.41 s
Output paths:
316.41 s
/nix/store/hwdr1153vypfqwdqsimb7pidkhdih6m9-gammaloop-workspace-check-0.1.0
316.41 s
Last 634 log lines:
316.41 s
> Running phase: unpackPhase
316.41 s
> unpacking source archive /nix/store/0llqw1df709zbvslaaqs2ang2jp44rl4-source
316.41 s
> source root is source
316.41 s
> Running phase: patchPhase
316.41 s
> Executing configureCargoCommonVars
316.41 s
> decompressing cargo artifacts from /nix/store/wxpx6lf642pgxp2wz1pw1lxksj5p1wb0-gammaloop-workspace-deps-deps-0.1.0/target.tar.zst to target
316.41 s
> Running phase: updateAutotoolsGnuConfigScriptsPhase
316.41 s
> Running phase: configurePhase
316.41 s
> will append /build/source/.cargo-home/config.toml with contents of /nix/store/8zq9ya5slh345hbylmsibxw827bi98w0-vendor-cargo-deps/config.toml
316.41 s
> default configurePhase, nothing to do
316.41 s
> Running phase: buildPhase
316.41 s
> +++ command cargo --version
316.41 s
> cargo 1.97.0 (c980f4866 2026-06-30)
316.41 s
> +++ command cargo check --profile ci-optim --locked --workspace --features gammaloop-tracing-filter/clap,gammaloop-tracing-filter/symbolica,idenso/bincode,idenso/reference-cases,linnet/bincode,linnet/drawing,linnet/rkyv,linnet/serde,linnet/symbolica,spenso-macros/shadowing,spenso/shadowing,symbolica/tracing_max_level_info,three-dimensional-reps/display,three-dimensional-reps/eval,three-dimensional-reps/serde --all-targets
316.41 s
> Checking cfg-if v1.0.4
316.41 s
> Checking memchr v2.8.0
316.41 s
> Checking once_cell v1.21.4
316.41 s
> Checking either v1.15.0
316.41 s
> Checking serde_core v1.0.228
316.41 s
> Checking libc v0.2.186
316.41 s
> Checking libm v0.2.16
316.41 s
> Checking itoa v1.0.18
316.41 s
> Checking log v0.4.29
316.41 s
> Checking regex-syntax v0.8.10
316.41 s
> Checking zerocopy v0.8.48
316.41 s
> Checking crossbeam-utils v0.8.21
316.41 s
> Checking equivalent v1.0.2
316.41 s
> Checking zmij v1.0.21
316.41 s
> Checking bytemuck v1.25.0
316.41 s
> Checking lazy_static v1.5.0
316.41 s
> Compiling target-lexicon v0.13.5
316.41 s
> Checking arrayvec v0.7.6
316.41 s
> Checking powerfmt v0.2.0
316.41 s
> Checking pin-project-lite v0.2.17
316.41 s
> Checking num-conv v0.2.1
316.41 s
> Checking time-core v0.1.8
316.41 s
> Checking safe_arch v0.7.4
316.41 s
> Checking num_threads v0.1.7
316.41 s
> Checking deranged v0.5.8
316.41 s
> Checking tracing-core v0.1.36
316.41 s
> Checking itertools v0.14.0
316.41 s
> Checking allocator-api2 v0.2.21
316.41 s
> Checking foldhash v0.2.0
316.41 s
> Checking const-random v0.1.18
316.41 s
> Checking nu-ansi-term v0.50.3
316.41 s
> Checking winnow v1.0.2
316.41 s
> Checking static_assertions v1.1.0
316.41 s
> Checking unty v0.0.4
316.41 s
> Checking safe_arch v1.0.0
316.41 s
> Checking crossbeam-epoch v0.9.18
316.41 s
> Checking sharded-slab v0.1.7
316.41 s
> Checking hashbrown v0.16.1
316.41 s
> Checking wide v0.7.33
316.41 s
> Checking crossbeam-deque v0.8.6
316.41 s
> Checking aho-corasick v1.1.4
316.41 s
> Checking thread_local v1.1.9
316.41 s
> Checking tracing-log v0.2.0
316.41 s
> Checking tracing v0.1.44
316.41 s
> Checking toml_writer v1.1.1+spec-1.1.0
316.41 s
> Checking rayon-core v1.13.0
316.41 s
> Checking az v1.3.0
316.41 s
> Checking indenter v0.3.4
316.41 s
> Checking wide v1.3.0
316.41 s
> Compiling phf_shared v0.11.3
316.41 s
> Checking anyhow v1.0.102
316.41 s
> Checking utf8parse v0.2.2
316.41 s
> Checking rawpointer v0.2.1
316.41 s
> Checking alloc-no-stdlib v2.0.4
316.41 s
> Checking dyn-clone v1.0.20
316.41 s
> Checking toml_parser v1.1.2+spec-1.1.0
316.41 s
> Checking rayon v1.12.0
316.41 s
> Checking alloc-stdlib v0.2.2
316.41 s
> Checking getrandom v0.3.4
316.41 s
> Checking time v0.3.47
316.41 s
> Checking gmp-mpfr-sys v1.7.1
316.41 s
> Checking rand_core v0.9.5
316.41 s
> Checking matrixmultiply v0.3.10
316.41 s
> Checking anstyle-parse v1.0.0
316.41 s
> Checking colorchoice v1.0.5
316.41 s
> Compiling pyo3-build-config v0.28.3
316.41 s
> Checking anstyle v1.0.14
316.41 s
> Checking colored v3.1.1
316.41 s
> Checking is_terminal_polyfill v1.70.2
316.41 s
> Checking anstyle-query v1.1.5
316.41 s
> Compiling phf_generator v0.11.3
316.41 s
> Checking eyre v0.6.12
316.41 s
> Checking num-traits v0.2.19
316.41 s
> Checking unicode-width v0.2.2
316.41 s
> Checking bitflags v1.3.2
316.41 s
> Checking wasmtime-jit-icache-coherence v34.0.2
316.41 s
> Checking brotli-decompressor v5.0.0
316.41 s
> Checking hugepage-rs v0.1.1
316.41 s
> Checking region v3.0.2
316.41 s
> Checking inventory v0.3.24
316.41 s
> Compiling phf_codegen v0.11.3
316.41 s
> Checking spec_math v0.1.6
316.41 s
> Checking thiserror v2.0.18
316.41 s
> Compiling getopts v0.2.24
316.41 s
> Checking libloading v0.9.0
316.41 s
> Checking tinyjson v2.5.1
316.41 s
> Checking serde v1.0.228
316.41 s
> Checking serde_json v1.0.149
316.41 s
> Checking bitflags v2.11.1
316.41 s
> Checking serde_spanned v1.1.1
316.41 s
> Checking toml_datetime v1.1.1+spec-1.1.0
316.41 s
> Checking anstream v1.0.0
316.41 s
> Checking toml v1.1.2+spec-1.1.0
316.41 s
> Checking self_cell v1.2.2
316.41 s
> Checking smallvec v1.15.1
316.41 s
> Checking bincode v2.0.1
316.41 s
> Checking tracing-serde v0.2.0
316.41 s
> Checking smartstring v1.0.1
316.41 s
> Checking byteorder v1.5.0
316.41 s
> Checking append-only-vec v0.1.8
316.41 s
> Checking bytes v1.11.1
316.41 s
> Checking regex-automata v0.4.14
316.41 s
> Compiling unicode_names2_generator v1.3.0
316.41 s
> Compiling unic-common v0.9.0
316.41 s
> Checking linux-raw-sys v0.12.1
316.41 s
> Checking num-complex v0.4.6
316.41 s
> Checking approx v0.5.1
316.41 s
> Checking num-integer v0.1.46
316.41 s
> Compiling unic-char-range v0.9.0
316.41 s
> Compiling unic-ucd-version v0.9.0
316.41 s
> Compiling unic-char-property v0.9.0
316.41 s
> Compiling is-macro v0.3.7
316.41 s
> Compiling rustpython-parser-vendored v0.4.0
316.41 s
> Checking iana-time-zone v0.1.65
316.41 s
> Compiling rustpython-parser v0.4.0
316.41 s
> Checking rustix v1.1.4
316.41 s
> Checking chrono v0.4.44
316.41 s
> Checking brotli v8.0.2
316.41 s
> Compiling phf v0.11.3
316.41 s
> Checking rustc-hash v2.1.2
316.41 s
> Compiling unic-ucd-ident v0.9.0
316.41 s
> Compiling unic-emoji-char v0.9.0
316.41 s
> Checking simba v0.9.1
316.41 s
> Checking ndarray v0.17.2
316.41 s
> Compiling rustc-hash v1.1.0
316.41 s
> Compiling lalrpop-util v0.20.2
316.41 s
> Checking rug v1.30.0
316.41 s
> Checking unicode-segmentation v1.13.2
316.41 s
> Compiling symbolica v2.2.0 (https://github.com/alphal00p/symbolica?rev=4d0a833eb8e059d1f95bdae5abed2559830b235f#4d0a833e)
316.41 s
> Checking typenum v1.20.0
316.41 s
> Checking getrandom v0.2.17
316.41 s
> Checking scopeguard v1.2.0
316.41 s
> Checking parking_lot_core v0.9.12
316.41 s
> Checking unicode-ident v1.0.24
316.41 s
> Checking lock_api v0.4.14
316.41 s
> Checking hashbrown v0.17.0
316.41 s
> Checking terminal_size v0.4.4
316.41 s
> Checking errno v0.3.14
316.41 s
> Checking generic-array v0.14.7
316.41 s
> Checking parking_lot v0.12.5
316.41 s
> Checking clap_lex v1.1.0
316.41 s
> Checking unicase v2.9.0
316.41 s
> Checking strsim v0.11.1
316.41 s
> Checking signal-hook-registry v1.4.8
316.41 s
> Checking clap_builder v4.6.0
316.41 s
> Checking vte v0.14.1
316.41 s
> Checking same-file v1.0.6
316.41 s
> Checking signal-hook v0.3.18
316.41 s
> Checking walkdir v2.5.0
316.41 s
> Checking crypto-common v0.1.7
316.41 s
> Checking block-buffer v0.10.4
316.41 s
> Checking mio v1.2.0
316.41 s
> Checking ciborium-io v0.2.2
316.41 s
> Checking minimal-lexical v0.2.1
316.41 s
> Checking digest v0.10.7
316.41 s
> Checking derive_more v2.1.1
316.41 s
> Checking nom v7.1.3
316.41 s
> Checking num-bigint v0.4.6
316.41 s
> Checking indexmap v2.14.0
316.41 s
> Checking signal-hook-mio v0.2.5
316.41 s
> Checking console v0.16.3
316.41 s
> Checking bstr v1.12.1
316.41 s
> Checking cpufeatures v0.2.17
316.41 s
> Checking linux-raw-sys v0.4.15
316.41 s
> Checking winnow v0.7.15
316.41 s
> Checking rustix v0.38.44
316.41 s
> Checking sha2 v0.10.9
316.41 s
> Checking ppv-lite86 v0.2.21
316.41 s
> Checking ahash v0.8.12
316.41 s
> Checking half v2.7.1
316.41 s
> Checking getrandom v0.4.2
316.41 s
> Checking rand_core v0.6.4
316.41 s
> Checking fastrand v2.4.1
316.41 s
> Checking plotters-backend v0.3.7
316.41 s
> Compiling unicode_names2 v1.3.0
316.41 s
> Checking rand_chacha v0.9.0
316.41 s
> Checking fnv v1.0.7
316.41 s
> Checking tempfile v3.27.0
316.41 s
> Checking ciborium-ll v0.2.2
316.41 s
> Checking crossterm v0.28.1
316.41 s
> Checking rand v0.9.4
316.41 s
> Checking plotters-svg v0.3.7
316.41 s
> Checking ciborium v0.2.2
316.41 s
> Checking toml_datetime v0.6.11
316.41 s
> Checking serde_spanned v0.6.9
316.41 s
> Checking itertools v0.10.5
316.41 s
> Checking toml_write v0.1.2
316.41 s
> Checking tap v1.0.1
316.41 s
> Checking matchers v0.2.0
316.41 s
> Checking regex v1.12.3
316.41 s
> Checking globset v0.4.18
316.41 s
> Checking ansitok v0.3.0
316.41 s
> Checking clap v4.6.1
316.41 s
> Checking cast v0.3.0
316.41 s
> Checking tracing-subscriber v0.3.23
316.41 s
> Checking ansi-str v0.9.0
316.41 s
> Checking wyz v0.5.1
316.41 s
> Checking plotters v0.3.7
316.41 s
> Checking symjit v2.21.0
316.41 s
> Checking rand_chacha v0.3.1
316.41 s
> Checking rust-embed-utils v8.11.0
316.41 s
> Checking radium v0.7.0
316.41 s
> Checking criterion-plot v0.5.0
316.41 s
> Checking typeid v1.0.3
316.41 s
> Checking similar v2.7.0
316.41 s
> Checking tinytemplate v1.2.1
316.41 s
> Checking is-terminal v0.4.17
316.41 s
> Checking anes v0.1.6
316.41 s
> Checking oorandom v11.1.5
316.41 s
> Checking funty v2.0.0
316.41 s
> Checking bytecount v0.6.9
316.41 s
> Checking rand v0.8.6
316.41 s
> Checking ron v0.12.1
316.41 s
> Checking papergrid v0.17.0
316.41 s
> Checking env_filter v1.0.1
316.41 s
> Checking testing_table v0.3.0
316.41 s
> Checking toml_edit v0.25.11+spec-1.1.0
316.41 s
> Checking uncased v0.9.10
316.41 s
> Checking jiff v0.2.24
316.41 s
> Checking bitvec v1.0.1
316.41 s
> Checking ptr_meta v0.1.4
316.41 s
> Checking xprec v0.2.2
316.41 s
> Checking simdutf8 v0.1.5
316.41 s
> Checking ucd-trie v0.1.7
316.41 s
> Checking bytecheck v0.6.12
316.41 s
> Checking ahash v0.7.8
316.41 s
> Checking pest v2.8.6
316.41 s
> Checking toml_edit v0.22.27
316.41 s
> Checking hashbrown v0.12.3
316.41 s
> Checking rend v0.4.2
316.41 s
> Checking approx v0.4.0
316.41 s
> Checking criterion v0.5.1
316.41 s
> Checking seahash v4.1.0
316.41 s
> Checking cgmath v0.18.0
316.41 s
> Checking num-rational v0.4.2
316.41 s
> Checking insta v1.47.2
316.41 s
> Checking tabled v0.20.0
316.41 s
> Checking num-iter v0.1.45
316.41 s
> Checking ref-ops v0.2.5
316.41 s
> Checking num v0.4.3
316.41 s
> Checking rand_xoshiro v0.6.0
316.41 s
> Checking features v0.10.0
316.41 s
> Checking gat-lending-iterator v0.1.8
316.41 s
> Checking dot-parser v0.5.1
316.41 s
> Compiling pyo3-macros-backend v0.28.3
316.41 s
> Compiling pyo3-ffi v0.28.3
316.41 s
> Compiling pyo3 v0.28.3
316.41 s
> Compiling numpy v0.28.0
316.41 s
> Checking constcat v0.5.1
316.41 s
> Checking colored v2.2.0
316.41 s
> Checking constant_time_eq v0.4.2
316.41 s
> Checking cpufeatures v0.3.0
316.41 s
> Checking arrayref v0.3.9
316.41 s
> Checking base64 v0.22.1
316.41 s
> Checking siphasher v1.0.2
316.41 s
> Checking blake3 v1.8.5
316.41 s
> Checking joinery v2.1.0
316.41 s
> Checking phf_shared v0.13.1
316.41 s
> Checking rust_lisp v0.18.0
316.41 s
> Checking toml v0.8.23
316.41 s
> Checking subprocess v0.2.15
316.41 s
> Checking titlecase v2.2.1
316.41 s
> Compiling vakint v0.1.2 (/build/source/crates/vakint)
316.41 s
> Checking version-compare v0.2.1
316.41 s
> Checking phf v0.13.1
316.41 s
> Checking xpct v0.5.1
316.41 s
> Checking figment v0.10.19
316.41 s
> Checking ryu v1.0.23
316.41 s
> Checking castaway v0.2.4
316.41 s
> Checking toml_datetime v0.7.5+spec-1.1.0
316.41 s
> Checking env_logger v0.11.10
316.41 s
> Checking strum v0.27.2
316.41 s
> Checking unicode-truncate v2.0.1
316.41 s
> Checking kasuari v0.4.12
316.41 s
> Checking lru v0.16.4
316.41 s
> Checking vte v0.15.0
316.41 s
> Checking toml v0.9.12+spec-1.1.0
316.41 s
> Checking portable-atomic v1.13.1
316.41 s
> Checking compact_str v0.9.0
316.41 s
> Checking vt100 v0.16.2
316.41 s
> Checking unit-prefix v0.5.2
316.41 s
> Checking rand_distr v0.4.3
316.41 s
> Compiling rustpython-parser-core v0.4.0
316.41 s
> Checking string-template-plus v0.4.3
316.41 s
> Checking simba v0.6.0
316.41 s
> Checking line-clipping v0.3.7
316.41 s
> Compiling three-dimensional-reps v0.1.0 (/build/source/crates/three-dimensional-reps)
316.41 s
> Checking gimli v0.32.3
316.41 s
> Checking adler2 v2.0.1
316.41 s
> Checking thiserror v1.0.69
316.41 s
> Checking indicatif v0.18.4
316.41 s
> Checking derive_builder v0.11.2
316.41 s
> Checking object v0.37.3
316.41 s
> Checking miniz_oxide v0.8.9
316.41 s
> Checking crossterm v0.29.0
316.41 s
> Checking owo-colors v4.3.0
316.41 s
> Checking ratatui-core v0.1.0
316.41 s
> Compiling rustpython-ast v0.4.0
316.41 s
> Checking tracing-error v0.2.1
316.41 s
> Checking typed-index-collections v3.5.0
316.41 s
> Checking amd v0.2.2
316.41 s
> Checking serde-big-array v0.5.1
316.41 s
> Checking ratatui-widgets v0.3.0
316.41 s
> Checking itertools v0.11.0
316.41 s
> Compiling gammaloop-tracing-filter-macros v0.1.0 (/build/source/crates/gammaloop-tracing-filter-macros)
316.41 s
> Checking rustc-demangle v0.1.27
316.41 s
> Checking option-ext v0.2.0
316.41 s
> Checking dirs-sys v0.5.0
316.41 s
> Checking ratatui-crossterm v0.1.0
316.41 s
> Checking ref-cast v1.0.25
316.41 s
> Checking nix v0.31.2
316.41 s
> Checking integer-sqrt v0.1.5
316.41 s
> Checking brotli-decompressor v4.0.3
316.41 s
> Checking crossbeam-channel v0.5.15
316.41 s
> Checking itertools v0.12.1
316.41 s
> Compiling gammalooprs v0.3.4 (/build/source/crates/gammalooprs)
316.41 s
> Checking unsafe-libyaml v0.2.11
316.41 s
> Checking symlink v0.1.0
316.41 s
> Checking ratatui-macros v0.7.0
316.41 s
> Checking tracing-appender v0.2.5
316.41 s
> Checking ratatui v0.30.0
316.41 s
> Checking rkyv v0.7.46
316.41 s
> Checking color-spantrace v0.3.0
316.41 s
> Checking ctrlc v3.5.2
316.41 s
> Checking brotli v7.0.0
316.41 s
> Checking include_dir v0.7.4
316.41 s
> Checking pathfinding v4.15.0
316.41 s
> Checking schemars v1.2.1
316.41 s
> Checking dirs v6.0.0
316.41 s
> Checking slotmap v1.1.1
316.41 s
> Checking tracing-indicatif v0.3.14
316.41 s
> Checking json5 v0.4.1
316.41 s
> Checking serde_yaml v0.9.34+deprecated
316.41 s
> Checking addr2line v0.25.1
316.41 s
> Checking vectorize v0.2.0
316.41 s
> Checking base62 v2.2.4
316.41 s
> Checking ringbuffer v0.16.0
316.41 s
> Checking rust-embed v8.11.0
316.41 s
> Checking clap_complete v4.6.3
316.41 s
> Checking strip-ansi-escapes v0.2.1
316.41 s
> Compiling gammaloop-api v0.1.0 (/build/source/crates/gammaloop-api)
316.41 s
> Checking fd-lock v4.0.4
316.41 s
> Checking itertools v0.13.0
316.41 s
> Checking strum v0.26.3
316.41 s
> Checking clap_complete_nushell v4.6.0
316.41 s
> Checking sysinfo v0.33.1
316.41 s
> Checking shlex v1.3.0
316.41 s
> Checking futures-core v0.3.32
316.41 s
> Checking clarabel v0.11.1
316.41 s
> Checking slab v0.4.12
316.41 s
> Checking futures-task v0.3.32
316.41 s
> Checking sdd v3.0.10
316.41 s
> Compiling gammaloop-integration-tests v0.1.0 (/build/source/tests)
316.41 s
> Compiling test-log-core v0.2.20
316.41 s
> Compiling rustc_version v0.4.1
316.41 s
> Checking which v8.0.2
316.41 s
> Checking scc v2.4.0
316.41 s
> Checking futures-util v0.3.32
316.41 s
> Checking bincode v1.3.3
316.41 s
> Compiling gungraun-runner v0.18.2
316.41 s
> Compiling gungraun-macros v0.8.0
316.41 s
> Compiling test-log-macros v0.2.20
316.41 s
> Compiling numerica v2.2.0 (https://github.com/alphal00p/symbolica?rev=4d0a833eb8e059d1f95bdae5abed2559830b235f#4d0a833e)
316.41 s
> Checking reedline v0.42.0
316.41 s
> Checking proc-macro2 v1.0.106
316.41 s
> Checking nalgebra v0.29.0
316.41 s
> Checking base64 v0.21.7
316.41 s
> Checking maplit v1.0.2
316.41 s
> Compiling iai-callgrind-runner v0.14.2
316.41 s
> Checking backtrace v0.3.76
316.41 s
> Checking quote v1.0.45
316.41 s
> Checking kurbo v0.13.0
316.41 s
> Checking wait-timeout v0.2.1
316.41 s
> Checking quick-error v1.2.3
316.41 s
> Checking bit-vec v0.8.0
316.41 s
> Compiling iai-callgrind v0.14.2
316.41 s
> Checking color-eyre v0.6.5
316.41 s
> Checking ron v0.8.1
316.41 s
> Checking bit-set v0.8.0
316.41 s
> Checking futures-executor v0.3.32
316.41 s
> Checking serial_test v3.4.0
316.41 s
> Checking syn v2.0.117
316.41 s
> Checking rusty-fork v0.3.1
316.41 s
> Compiling iai-callgrind-macros v0.5.1
316.41 s
> Checking rand_xorshift v0.4.0
316.41 s
> Checking console v0.15.11
316.41 s
> Checking pathdiff v0.2.3
316.41 s
> Checking unarray v0.1.4
316.41 s
> Checking proptest v1.11.0
316.41 s
> Checking similar-asserts v1.7.0
316.41 s
> Checking clinnet v0.1.8 (/build/source/crates/clinnet)
316.41 s
> Checking kurvst v0.1.0 (/build/source/crates/kurvst)
316.41 s
> Checking test-log v0.2.20
316.41 s
> Compiling graphica v2.1.0 (https://github.com/alphal00p/symbolica?rev=4d0a833eb8e059d1f95bdae5abed2559830b235f#4d0a833e)
316.41 s
> Checking statrs v0.16.1
316.41 s
> Checking momtrop v0.3.0
316.41 s
> Checking gungraun v0.18.2
316.41 s
> Compiling pyo3-macros v0.28.3
316.41 s
> Compiling pyo3-stub-gen-derive v0.17.2
316.41 s
> Checking pyo3-stub-gen v0.17.2
316.41 s
> Checking symbolica-utils v0.1.0 (/build/source/crates/symbolica-utils)
316.41 s
> Checking spenso-macros v0.3.2 (/build/source/crates/spenso-macros)
316.41 s
> Compiling gammaloop-workspace-hack v0.1.0 (/build/source/crates/gammaloop-workspace-hack)
316.41 s
> Checking linnet v0.17.0 (/build/source/crates/linnet)
316.41 s
> Checking spenso v0.6.0 (/build/source/crates/spenso)
316.41 s
> Checking linnet-py v0.1.0 (/build/source/crates/linnet-py)
316.41 s
> Checking linnest v0.1.0 (/build/source/crates/linnest)
316.41 s
> Checking idenso v0.3.0 (/build/source/crates/idenso)
316.41 s
> Checking gammaloop-tracing-filter v0.1.0 (/build/source/crates/gammaloop-tracing-filter)
316.41 s
> Checking spenso-hep-lib v0.1.7 (/build/source/crates/spenso-hep-lib)
316.41 s
> Checking spynso3 v0.1.2 (/build/source/crates/spynso3)
316.41 s
> error[E0624] : method `export_uv_forest_graph` is private
316.41 s
> --> tests/tests/uv.rs:3426:33
316.41 s
> |
316.41 s
> 3426 | let soft_export = integrand.export_uv_forest_graph(
316.41 s
> | ^^^^^^^^^^^^^^^^^^^^^^ private method
316.41 s
> |
316.41 s
> ::: crates/gammalooprs/src/uv/export.rs:125:5
316.41 s
> |
316.41 s
> 125 | / pub(crate) fn export_uv_forest_graph(
316.41 s
> 126 | | &self,
316.41 s
> 127 | | graph_id: usize,
316.41 s
> 128 | | orientation: Option<OrientationProjection<'_>>,
316.41 s
> 129 | | generation_settings: &GenerationSettings,
316.41 s
> 130 | | export_settings: &UVForestExportSettings,
316.41 s
> 131 | | ) -> Result<UVForestExport> {
316.41 s
> | |_______________________________- private method defined here
316.41 s
>
316.41 s
> error[E0624] : method `export_uv_forest_graph` is private
316.41 s
> --> tests/tests/uv.rs:3522:38
316.41 s
> |
316.41 s
> 3522 | let uv_export = uv_integrand.export_uv_forest_graph(
316.41 s
> | ^^^^^^^^^^^^^^^^^^^^^^ private method
316.41 s
> |
316.41 s
> ::: crates/gammalooprs/src/uv/export.rs:125:5
316.41 s
> |
316.41 s
> 125 | / pub(crate) fn export_uv_forest_graph(
316.41 s
> 126 | | &self,
316.41 s
> 127 | | graph_id: usize,
316.41 s
> 128 | | orientation: Option<OrientationProjection<'_>>,
316.41 s
> 129 | | generation_settings: &GenerationSettings,
316.41 s
> 130 | | export_settings: &UVForestExportSettings,
316.41 s
> 131 | | ) -> Result<UVForestExport> {
316.41 s
> | |_______________________________- private method defined here
316.41 s
>
316.41 s
> error[E0624] : method `export_uv_forest_graph` is private
316.41 s
> --> tests/tests/uv.rs:3936:44
316.41 s
> |
316.41 s
> 3936 | let export = integrand.export_uv_forest_graph(
316.41 s
> | ^^^^^^^^^^^^^^^^^^^^^^ private method
316.41 s
> |
316.41 s
> ::: crates/gammalooprs/src/uv/export.rs:125:5
316.41 s
> |
316.41 s
> 125 | / pub(crate) fn export_uv_forest_graph(
316.41 s
> 126 | | &self,
316.41 s
> 127 | | graph_id: usize,
316.41 s
> 128 | | orientation: Option<OrientationProjection<'_>>,
316.41 s
> 129 | | generation_settings: &GenerationSettings,
316.41 s
> 130 | | export_settings: &UVForestExportSettings,
316.41 s
> 131 | | ) -> Result<UVForestExport> {
316.41 s
> | |_______________________________- private method defined here
316.41 s
>
316.41 s
> error[E0624] : method `export_uv_forest_graph` is private
316.41 s
> --> tests/tests/uv.rs:4128:36
316.41 s
> |
316.41 s
> 4128 | let export = integrand.export_uv_forest_graph(
316.41 s
> | ^^^^^^^^^^^^^^^^^^^^^^ private method
316.41 s
> |
316.41 s
> ::: crates/gammalooprs/src/uv/export.rs:125:5
316.41 s
> |
316.41 s
> 125 | / pub(crate) fn export_uv_forest_graph(
316.41 s
> 126 | | &self,
316.41 s
> 127 | | graph_id: usize,
316.41 s
> 128 | | orientation: Option<OrientationProjection<'_>>,
316.41 s
> 129 | | generation_settings: &GenerationSettings,
316.41 s
> 130 | | export_settings: &UVForestExportSettings,
316.41 s
> 131 | | ) -> Result<UVForestExport> {
316.41 s
> | |_______________________________- private method defined here
316.41 s
>
316.41 s
> error[E0624] : method `export_uv_forest_graph` is private
316.41 s
> --> tests/tests/uv.rs:4335:36
316.41 s
> |
316.41 s
> 4335 | let export = integrand.export_uv_forest_graph(
316.41 s
> | ^^^^^^^^^^^^^^^^^^^^^^ private method
316.41 s
> |
316.41 s
> ::: crates/gammalooprs/src/uv/export.rs:125:5
316.41 s
> |
316.41 s
> 125 | / pub(crate) fn export_uv_forest_graph(
316.41 s
> 126 | | &self,
316.41 s
> 127 | | graph_id: usize,
316.41 s
> 128 | | orientation: Option<OrientationProjection<'_>>,
316.41 s
> 129 | | generation_settings: &GenerationSettings,
316.41 s
> 130 | | export_settings: &UVForestExportSettings,
316.41 s
> 131 | | ) -> Result<UVForestExport> {
316.41 s
> | |_______________________________- private method defined here
316.41 s
>
316.41 s
> error[E0061] : this method takes 5 arguments but 3 arguments were supplied
316.41 s
> --> tests/tests/uv.rs:4551:26
316.41 s
> |
316.41 s
> 4551 | parent_graph.cff(&parent_tree, &parent_cut, &OrientationPattern::default())?;
316.41 s
> | ^^^ ----------------------------------------------------------- two arguments of type `&three_dimensional_reps::generation::Generate3DExpressionOptions` and `Option<&symbolica::atom::Atom>` are missing
316.41 s
> |
316.41 s
> note : method defined here
316.41 s
> --> crates/gammalooprs/src/cff/mod.rs:755:12
316.41 s
> |
316.41 s
> 755 | pub fn cff<S: SubGraphLike + SubSetLike>(
316.41 s
> | ^^^
316.41 s
> help : provide the arguments
316.41 s
> |
316.41 s
> 4551 | parent_graph.cff(&parent_tree, &parent_cut, &OrientationPattern::default(), /* &three_dimensional_reps::generation::Generate3DExpressionOptions */, /* Option<&symbolica::atom::Atom> */ )?;
316.41 s
> | ++++++++++++++++++++++++++++++++++++++++++++++++++++++++++++++++++++++++++++++++++++++++++++++++++++++++++++++
316.41 s
>
316.41 s
> error[E0616] : field `orientations` of struct `CFFTerm` is private
316.41 s
> --> tests/tests/uv.rs:4555:36
316.41 s
> |
316.41 s
> 4555 | .flat_map(|term| &term.orientations)
316.41 s
> | ^^^^^^^^^^^^ private field
316.41 s
>
316.41 s
> error[E0609] : no field `orientations` on type `&GeneratedThreeDExpression<Esurface, Hsurface>`
316.41 s
> --> tests/tests/uv.rs:4653:18
316.41 s
> |
316.41 s
> 4653 | .orientations
316.41 s
> | ^^^^^^^^^^^^ unknown field
316.41 s
> |
316.41 s
> = note : the full name for the type has been written to '/build/source/target/ci-optim/deps/uv-ae6ff038ef4b6f0a.long-type-1251860757990444536.txt'
316.41 s
> = note : consider using `--verbose` to print the full type name to the console
316.41 s
> help : one of the expressions' fields has a field of the same name
316.41 s
> |
316.41 s
> 4653 | .expression. orientations
316.41 s
> | +++++++++++
316.41 s
>
316.41 s
> error[E0624] : method `export_uv_forest_graph` is private
316.41 s
> --> tests/tests/uv.rs:4673:43
316.41 s
> |
316.41 s
> 4673 | let structural_forest = integrand.export_uv_forest_graph(
316.41 s
> | ^^^^^^^^^^^^^^^^^^^^^^ private method
316.41 s
> |
316.41 s
> ::: crates/gammalooprs/src/uv/export.rs:125:5
316.41 s
> |
316.41 s
> 125 | / pub(crate) fn export_uv_forest_graph(
316.41 s
> 126 | | &self,
316.41 s
> 127 | | graph_id: usize,
316.41 s
> 128 | | orientation: Option<OrientationProjection<'_>>,
316.41 s
> 129 | | generation_settings: &GenerationSettings,
316.41 s
> 130 | | export_settings: &UVForestExportSettings,
316.41 s
> 131 | | ) -> Result<UVForestExport> {
316.41 s
> | |_______________________________- private method defined here
316.41 s
>
316.41 s
> error[E0624] : method `export_uv_forest_graph` is private
316.41 s
> --> tests/tests/uv.rs:4897:43
316.41 s
> |
316.41 s
> 4897 | let structural_forest = integrand.export_uv_forest_graph(
316.41 s
> | ^^^^^^^^^^^^^^^^^^^^^^ private method
316.41 s
> |
316.41 s
> ::: crates/gammalooprs/src/uv/export.rs:125:5
316.41 s
> |
316.41 s
> 125 | / pub(crate) fn export_uv_forest_graph(
316.41 s
> 126 | | &self,
316.41 s
> 127 | | graph_id: usize,
316.41 s
> 128 | | orientation: Option<OrientationProjection<'_>>,
316.41 s
> 129 | | generation_settings: &GenerationSettings,
316.41 s
> 130 | | export_settings: &UVForestExportSettings,
316.41 s
> 131 | | ) -> Result<UVForestExport> {
316.41 s
> | |_______________________________- private method defined here
316.41 s
>
316.41 s
> error[E0624] : method `export_uv_forest_graph` is private
316.41 s
> --> tests/tests/uv.rs:5146:43
316.41 s
> |
316.41 s
> 5146 | let structural_forest = integrand.export_uv_forest_graph(
316.41 s
> | ^^^^^^^^^^^^^^^^^^^^^^ private method
316.41 s
> |
316.41 s
> ::: crates/gammalooprs/src/uv/export.rs:125:5
316.41 s
> |
316.41 s
> 125 | / pub(crate) fn export_uv_forest_graph(
316.41 s
> 126 | | &self,
316.41 s
> 127 | | graph_id: usize,
316.41 s
> 128 | | orientation: Option<OrientationProjection<'_>>,
316.41 s
> 129 | | generation_settings: &GenerationSettings,
316.41 s
> 130 | | export_settings: &UVForestExportSettings,
316.41 s
> 131 | | ) -> Result<UVForestExport> {
316.41 s
> | |_______________________________- private method defined here
316.41 s
>
316.41 s
> error[E0624] : method `export_uv_forest_graph` is private
316.41 s
> --> tests/tests/uv.rs:5161:41
316.41 s
> |
316.41 s
> 5161 | let computed_forest = integrand.export_uv_forest_graph(
316.41 s
> | ^^^^^^^^^^^^^^^^^^^^^^ private method
316.41 s
> |
316.41 s
> ::: crates/gammalooprs/src/uv/export.rs:125:5
316.41 s
> |
316.41 s
> 125 | / pub(crate) fn export_uv_forest_graph(
316.41 s
> 126 | | &self,
316.41 s
> 127 | | graph_id: usize,
316.41 s
> 128 | | orientation: Option<OrientationProjection<'_>>,
316.41 s
> 129 | | generation_settings: &GenerationSettings,
316.41 s
> 130 | | export_settings: &UVForestExportSettings,
316.41 s
> 131 | | ) -> Result<UVForestExport> {
316.41 s
> | |_______________________________- private method defined here
316.41 s
>
316.41 s
> error[E0624] : method `export_uv_forest_graph` is private
316.41 s
> --> tests/tests/uv.rs:5724:51
316.41 s
> |
316.41 s
> 5724 | let structural_forest = integrand.export_uv_forest_graph(
316.41 s
> | ^^^^^^^^^^^^^^^^^^^^^^ private method
316.41 s
> |
316.41 s
> ::: crates/gammalooprs/src/uv/export.rs:125:5
316.41 s
> |
316.41 s
> 125 | / pub(crate) fn export_uv_forest_graph(
316.41 s
> 126 | | &self,
316.41 s
> 127 | | graph_id: usize,
316.41 s
> 128 | | orientation: Option<OrientationProjection<'_>>,
316.41 s
> 129 | | generation_settings: &GenerationSettings,
316.41 s
> 130 | | export_settings: &UVForestExportSettings,
316.41 s
> 131 | | ) -> Result<UVForestExport> {
316.41 s
> | |_______________________________- private method defined here
316.41 s
>
316.41 s
> Some errors have detailed explanations: E0061, E0609, E0616, E0624.
316.41 s
> For more information about an error, try `rustc --explain E0061`.
316.41 s
> error : could not compile `gammaloop-integration-tests` (test "uv") due to 13 previous errors
316.41 s
> warning : build failed, waiting for other jobs to finish...
316.41 s
For full logs, run:
316.41 s
nix log /nix/store/yq41fja0qvn1pcayl6m3fb5q6zl3fd3g-gammaloop-workspace-check-0.1.0.drv
316.45 s
Build failed.