1. 0.01 s $ /nix/store/bhv6xyvqw6gjs3j488gi1z6wdv18bdpa-coreutils-9.11/bin/timeout --kill-after=15s 7200s /nix/store/bxgja2ppiqi6w2bgn0r07d7mgnl1k6k2-nix-2.34.8/bin/nix --extra-experimental-features nix-command --extra-experimental-features flakes flake clone git+https://github.com/alphal00p/gammaloop --dest /tmp/nix-ci-worker/stable-pwd/repo/
  2. 0.81 s Cloning into '/tmp/nix-ci-worker/stable-pwd/repo'...
  3. 2.40 s remote: Enumerating objects: 162134, done.
  4. 2.51 s remote: Counting objects: 0% (1/3710) remote: Counting objects: 1% (38/3710) remote: Counting objects: 2% (75/3710) remote: Counting objects: 3% (112/3710) remote: Counting objects: 4% (149/3710) remote: Counting objects: 5% (186/3710) remote: Counting objects: 6% (223/3710) remote: Counting objects: 7% (260/3710) remote: Counting objects: 8% (297/3710) remote: Counting objects: 9% (334/3710) remote: Counting objects: 10% (371/3710) remote: Counting objects: 11% (409/3710) remote: Counting objects: 12% (446/3710) remote: Counting objects: 13% (483/3710) remote: Counting objects: 14% (520/3710) remote: Counting objects: 15% (557/3710) remote: Counting objects: 16% (594/3710) remote: Counting objects: 17% (631/3710) remote: Counting objects: 18% (668/3710) remote: Counting objects: 19% (705/3710) remote: Counting objects: 20% (742/3710) remote: Counting objects: 21% (780/3710) remote: Counting objects: 22% (817/3710) remote: Counting objects: 23% (854/3710) remote: Counting objects: 24% (891/3710) remote: Counting objects: 25% (928/3710) remote: Counting objects: 26% (965/3710) remote: Counting objects: 27% (1002/3710) remote: Counting objects: 28% (1039/3710) remote: Counting objects: 29% (1076/3710) remote: Counting objects: 30% (1113/3710) remote: Counting objects: 31% (1151/3710) remote: Counting objects: 32% (1188/3710) remote: Counting objects: 33% (1225/3710) remote: Counting objects: 34% (1262/3710) remote: Counting objects: 35% (1299/3710) remote: Counting objects: 36% (1336/3710) remote: Counting objects: 37% (1373/3710) remote: Counting objects: 38% (1410/3710) remote: Counting objects: 39% (1447/3710) remote: Counting objects: 40% (1484/3710) remote: Counting objects: 41% (1522/3710) remote: Counting objects: 42% (1559/3710) remote: Counting objects: 43% (1596/3710) remote: Counting objects: 44% (1633/3710) remote: Counting objects: 45% (1670/3710) remote: Counting objects: 46% (1707/3710) remote: Counting objects: 47% (1744/3710) remote: Counting objects: 48% (1781/3710) remote: Counting objects: 49% (1818/3710) remote: Counting objects: 50% (1855/3710) remote: Counting objects: 51% (1893/3710) remote: Counting objects: 52% (1930/3710) remote: Counting objects: 53% (1967/3710) remote: Counting objects: 54% (2004/3710) remote: Counting objects: 55% (2041/3710) remote: Counting objects: 56% (2078/3710) remote: Counting objects: 57% (2115/3710) remote: Counting objects: 58% (2152/3710) remote: Counting objects: 59% (2189/3710) remote: Counting objects: 60% (2226/3710) remote: Counting objects: 61% (2264/3710) remote: Counting objects: 62% (2301/3710) remote: Counting objects: 63% (2338/3710) remote: Counting objects: 64% (2375/3710) remote: Counting objects: 65% (2412/3710) remote: Counting objects: 66% (2449/3710) remote: Counting objects: 67% (2486/3710) remote: Counting objects: 68% (2523/3710) remote: Counting objects: 69% (2560/3710) remote: Counting objects: 70% (2597/3710) remote: Counting objects: 71% (2635/3710) remote: Counting objects: 72% (2672/3710) remote: Counting objects: 73% (2709/3710) remote: Counting objects: 74% (2746/3710) remote: Counting objects: 75% (2783/3710) remote: Counting objects: 76% (2820/3710) remote: Counting objects: 77% (2857/3710) remote: Counting objects: 78% (2894/3710) remote: Counting objects: 79% (2931/3710) remote: Counting objects: 80% (2968/3710) remote: Counting objects: 81% (3006/3710) remote: Counting objects: 82% (3043/3710) remote: Counting objects: 83% (3080/3710) remote: Counting objects: 84% (3117/3710) remote: Counting objects: 85% (3154/3710) remote: Counting objects: 86% (3191/3710) remote: Counting objects: 87% (3228/3710) remote: Counting objects: 88% (3265/3710) remote: Counting objects: 89% (3302/3710) remote: Counting objects: 90% (3339/3710) remote: Counting objects: 91% (3377/3710) remote: Counting objects: 92% (3414/3710) remote: Counting objects: 93% (3451/3710) remote: Counting objects: 94% (3488/3710) remote: Counting objects: 95% (3525/3710) remote: Counting objects: 96% (3562/3710) remote: Counting objects: 97% (3599/3710) remote: Counting objects: 98% (3636/3710) remote: Counting objects: 99% (3673/3710) remote: Counting objects: 100% (3710/3710) remote: Counting objects: 100% (3710/3710), done.
  5. 4.45 s remote: Compressing objects: 0% (1/1481) remote: Compressing objects: 1% (15/1481) remote: Compressing objects: 2% (30/1481) remote: Compressing objects: 3% (45/1481) remote: Compressing objects: 4% (60/1481) remote: Compressing objects: 5% (75/1481) remote: Compressing objects: 6% (89/1481) remote: Compressing objects: 7% (104/1481) remote: Compressing objects: 8% (119/1481) remote: Compressing objects: 9% (134/1481) remote: Compressing objects: 10% (149/1481) remote: Compressing objects: 11% (163/1481) remote: Compressing objects: 12% (178/1481) remote: Compressing objects: 13% (193/1481) remote: Compressing objects: 14% (208/1481) remote: Compressing objects: 15% (223/1481) remote: Compressing objects: 16% (237/1481) remote: Compressing objects: 17% (252/1481) remote: Compressing objects: 18% (267/1481) remote: Compressing objects: 19% (282/1481) remote: Compressing objects: 20% (297/1481) remote: Compressing objects: 21% (312/1481) remote: Compressing objects: 22% (326/1481) remote: Compressing objects: 23% (341/1481) remote: Compressing objects: 24% (356/1481) remote: Compressing objects: 25% (371/1481) remote: Compressing objects: 26% (386/1481) remote: Compressing objects: 27% (400/1481) remote: Compressing objects: 28% (415/1481) remote: Compressing objects: 29% (430/1481) remote: Compressing objects: 30% (445/1481) remote: Compressing objects: 30% (457/1481) remote: Compressing objects: 31% (460/1481) remote: Compressing objects: 32% (474/1481) remote: Compressing objects: 33% (489/1481) remote: Compressing objects: 34% (504/1481) remote: Compressing objects: 35% (519/1481) remote: Compressing objects: 36% (534/1481) remote: Compressing objects: 37% (548/1481) remote: Compressing objects: 38% (563/1481) remote: Compressing objects: 39% (578/1481) remote: Compressing objects: 40% (593/1481) remote: Compressing objects: 41% (608/1481) remote: Compressing objects: 41% (609/1481) remote: Compressing objects: 42% (623/1481) remote: Compressing objects: 43% (637/1481) remote: Compressing objects: 44% (652/1481) remote: Compressing objects: 45% (667/1481) remote: Compressing objects: 46% (682/1481) remote: Compressing objects: 47% (697/1481) remote: Compressing objects: 48% (711/1481) remote: Compressing objects: 49% (726/1481) remote: Compressing objects: 50% (741/1481) remote: Compressing objects: 51% (756/1481) remote: Compressing objects: 52% (771/1481) remote: Compressing objects: 53% (785/1481) remote: Compressing objects: 54% (800/1481) remote: Compressing objects: 55% (815/1481) remote: Compressing objects: 56% (830/1481) remote: Compressing objects: 57% (845/1481) remote: Compressing objects: 58% (859/1481) remote: Compressing objects: 59% (874/1481) remote: Compressing objects: 60% (889/1481) remote: Compressing objects: 61% (904/1481) remote: Compressing objects: 62% (919/1481) remote: Compressing objects: 63% (934/1481) remote: Compressing objects: 64% (948/1481) remote: Compressing objects: 65% (963/1481) remote: Compressing objects: 66% (978/1481) remote: Compressing objects: 67% (993/1481) remote: Compressing objects: 68% (1008/1481) remote: Compressing objects: 69% (1022/1481) remote: Compressing objects: 70% (1037/1481) remote: Compressing objects: 71% (1052/1481) remote: Compressing objects: 72% (1067/1481) remote: Compressing objects: 73% (1082/1481) remote: Compressing objects: 74% (1096/1481) remote: Compressing objects: 75% (1111/1481) remote: Compressing objects: 76% (1126/1481) remote: Compressing objects: 77% (1141/1481) remote: Compressing objects: 78% (1156/1481) remote: Compressing objects: 79% (1170/1481) remote: Compressing objects: 80% (1185/1481) remote: Compressing objects: 81% (1200/1481) remote: Compressing objects: 82% (1215/1481) remote: Compressing objects: 83% (1230/1481) remote: Compressing objects: 84% (1245/1481) remote: Compressing objects: 85% (1259/1481) remote: Compressing objects: 86% (1274/1481) remote: Compressing objects: 87% (1289/1481) remote: Compressing objects: 88% (1304/1481) remote: Compressing objects: 89% (1319/1481) remote: Compressing objects: 90% (1333/1481) remote: Compressing objects: 91% (1348/1481) remote: Compressing objects: 92% (1363/1481) remote: Compressing objects: 93% (1378/1481) remote: Compressing objects: 94% (1393/1481) remote: Compressing objects: 95% (1407/1481) remote: Compressing objects: 96% (1422/1481) remote: Compressing objects: 97% (1437/1481) remote: Compressing objects: 98% (1452/1481) remote: Compressing objects: 99% (1467/1481) remote: Compressing objects: 100% (1481/1481) remote: Compressing objects: 100% (1481/1481), done.
  6. 19.87 s Receiving objects: 0% (1/162134) Receiving objects: 1% (1622/162134) Receiving objects: 2% (3243/162134) Receiving objects: 3% (4865/162134) Receiving objects: 4% (6486/162134), 13.25 MiB | 26.54 MiB/s Receiving objects: 5% (8107/162134), 13.25 MiB | 26.54 MiB/s Receiving objects: 5% (9134/162134), 13.25 MiB | 26.54 MiB/s Receiving objects: 6% (9729/162134), 28.78 MiB | 28.80 MiB/s Receiving objects: 7% (11350/162134), 39.18 MiB | 26.13 MiB/s Receiving objects: 8% (12971/162134), 39.18 MiB | 26.13 MiB/s Receiving objects: 9% (14593/162134), 39.18 MiB | 26.13 MiB/s Receiving objects: 10% (16214/162134), 39.18 MiB | 26.13 MiB/s Receiving objects: 11% (17835/162134), 39.18 MiB | 26.13 MiB/s Receiving objects: 11% (17922/162134), 39.18 MiB | 26.13 MiB/s Receiving objects: 12% (19457/162134), 59.01 MiB | 29.52 MiB/s Receiving objects: 13% (21078/162134), 59.01 MiB | 29.52 MiB/s Receiving objects: 14% (22699/162134), 59.01 MiB | 29.52 MiB/s Receiving objects: 15% (24321/162134), 74.63 MiB | 29.86 MiB/s Receiving objects: 16% (25942/162134), 74.63 MiB | 29.86 MiB/s Receiving objects: 16% (27540/162134), 89.87 MiB | 29.95 MiB/s Receiving objects: 17% (27563/162134), 89.87 MiB | 29.95 MiB/s Receiving objects: 18% (29185/162134), 89.87 MiB | 29.95 MiB/s Receiving objects: 19% (30806/162134), 105.50 MiB | 30.13 MiB/s Receiving objects: 20% (32427/162134), 105.50 MiB | 30.13 MiB/s Receiving objects: 21% (34049/162134), 105.50 MiB | 30.13 MiB/s Receiving objects: 21% (34533/162134), 105.50 MiB | 30.13 MiB/s Receiving objects: 22% (35670/162134), 121.67 MiB | 30.41 MiB/s Receiving objects: 23% (37291/162134), 121.67 MiB | 30.41 MiB/s Receiving objects: 24% (38913/162134), 121.67 MiB | 30.41 MiB/s Receiving objects: 25% (40534/162134), 137.83 MiB | 30.62 MiB/s Receiving objects: 26% (42155/162134), 137.83 MiB | 30.62 MiB/s Receiving objects: 26% (43150/162134), 154.56 MiB | 31.39 MiB/s Receiving objects: 27% (43777/162134), 154.56 MiB | 31.39 MiB/s Receiving objects: 28% (45398/162134), 154.56 MiB | 31.39 MiB/s Receiving objects: 29% (47019/162134), 154.56 MiB | 31.39 MiB/s Receiving objects: 30% (48641/162134), 154.56 MiB | 31.39 MiB/s Receiving objects: 31% (50262/162134), 154.56 MiB | 31.39 MiB/s Receiving objects: 32% (51883/162134), 154.56 MiB | 31.39 MiB/s Receiving objects: 33% (53505/162134), 154.56 MiB | 31.39 MiB/s Receiving objects: 34% (55126/162134), 154.56 MiB | 31.39 MiB/s Receiving objects: 35% (56747/162134), 154.56 MiB | 31.39 MiB/s Receiving objects: 36% (58369/162134), 154.56 MiB | 31.39 MiB/s Receiving objects: 37% (59990/162134), 171.36 MiB | 31.66 MiB/s Receiving objects: 38% (61611/162134), 171.36 MiB | 31.66 MiB/s Receiving objects: 39% (63233/162134), 171.36 MiB | 31.66 MiB/s Receiving objects: 40% (64854/162134), 171.36 MiB | 31.66 MiB/s Receiving objects: 41% (66475/162134), 171.36 MiB | 31.66 MiB/s Receiving objects: 41% (66505/162134), 171.36 MiB | 31.66 MiB/s Receiving objects: 42% (68097/162134), 188.27 MiB | 33.10 MiB/s Receiving objects: 43% (69718/162134), 188.27 MiB | 33.10 MiB/s Receiving objects: 44% (71339/162134), 188.27 MiB | 33.10 MiB/s Receiving objects: 45% (72961/162134), 188.27 MiB | 33.10 MiB/s Receiving objects: 46% (74582/162134), 188.27 MiB | 33.10 MiB/s Receiving objects: 47% (76203/162134), 204.69 MiB | 32.34 MiB/s Receiving objects: 48% (77825/162134), 204.69 MiB | 32.34 MiB/s Receiving objects: 48% (77862/162134), 221.96 MiB | 32.71 MiB/s Receiving objects: 48% (78212/162134), 256.85 MiB | 33.61 MiB/s Receiving objects: 49% (79446/162134), 274.34 MiB | 33.91 MiB/s Receiving objects: 50% (81067/162134), 274.34 MiB | 33.91 MiB/s Receiving objects: 50% (82015/162134), 292.73 MiB | 34.40 MiB/s Receiving objects: 51% (82689/162134), 292.73 MiB | 34.40 MiB/s Receiving objects: 52% (84310/162134), 310.73 MiB | 34.68 MiB/s Receiving objects: 53% (85932/162134), 310.73 MiB | 34.68 MiB/s Receiving objects: 54% (87553/162134), 310.73 MiB | 34.68 MiB/s Receiving objects: 54% (88283/162134), 310.73 MiB | 34.68 MiB/s Receiving objects: 55% (89174/162134), 327.55 MiB | 34.70 MiB/s Receiving objects: 56% (90796/162134), 327.55 MiB | 34.70 MiB/s Receiving objects: 57% (92417/162134), 327.55 MiB | 34.70 MiB/s Receiving objects: 58% (94038/162134), 327.55 MiB | 34.70 MiB/s Receiving objects: 59% (95660/162134), 327.55 MiB | 34.70 MiB/s Receiving objects: 60% (97281/162134), 327.55 MiB | 34.70 MiB/s Receiving objects: 61% (98902/162134), 327.55 MiB | 34.70 MiB/s Receiving objects: 62% (100524/162134), 333.63 MiB | 32.29 MiB/s Receiving objects: 63% (102145/162134), 333.63 MiB | 32.29 MiB/s Receiving objects: 64% (103766/162134), 333.63 MiB | 32.29 MiB/s Receiving objects: 65% (105388/162134), 333.63 MiB | 32.29 MiB/s Receiving objects: 66% (107009/162134), 333.63 MiB | 32.29 MiB/s Receiving objects: 67% (108630/162134), 333.63 MiB | 32.29 MiB/s Receiving objects: 68% (110252/162134), 333.63 MiB | 32.29 MiB/s Receiving objects: 69% (111873/162134), 333.63 MiB | 32.29 MiB/s Receiving objects: 70% (113494/162134), 333.63 MiB | 32.29 MiB/s Receiving objects: 71% (115116/162134), 333.63 MiB | 32.29 MiB/s Receiving objects: 72% (116737/162134), 333.63 MiB | 32.29 MiB/s Receiving objects: 73% (118358/162134), 333.63 MiB | 32.29 MiB/s Receiving objects: 74% (119980/162134), 333.63 MiB | 32.29 MiB/s Receiving objects: 75% (121601/162134), 333.63 MiB | 32.29 MiB/s Receiving objects: 75% (122918/162134), 333.63 MiB | 32.29 MiB/s Receiving objects: 76% (123222/162134), 352.45 MiB | 32.83 MiB/s Receiving objects: 77% (124844/162134), 352.45 MiB | 32.83 MiB/s Receiving objects: 78% (126465/162134), 368.51 MiB | 32.56 MiB/s Receiving objects: 79% (128086/162134), 368.51 MiB | 32.56 MiB/s Receiving objects: 80% (129708/162134), 368.51 MiB | 32.56 MiB/s Receiving objects: 81% (131329/162134), 368.51 MiB | 32.56 MiB/s Receiving objects: 82% (132950/162134), 368.51 MiB | 32.56 MiB/s Receiving objects: 82% (133433/162134), 384.50 MiB | 32.28 MiB/s Receiving objects: 83% (134572/162134), 400.23 MiB | 31.86 MiB/s Receiving objects: 84% (136193/162134), 400.23 MiB | 31.86 MiB/s Receiving objects: 85% (137814/162134), 400.23 MiB | 31.86 MiB/s Receiving objects: 85% (139129/162134), 400.23 MiB | 31.86 MiB/s Receiving objects: 86% (139436/162134), 417.82 MiB | 31.89 MiB/s Receiving objects: 87% (141057/162134), 417.82 MiB | 31.89 MiB/s Receiving objects: 88% (142678/162134), 417.82 MiB | 31.89 MiB/s Receiving objects: 89% (144300/162134), 417.82 MiB | 31.89 MiB/s Receiving objects: 90% (145921/162134), 433.71 MiB | 31.33 MiB/s Receiving objects: 90% (147112/162134), 433.71 MiB | 31.33 MiB/s Receiving objects: 91% (147542/162134), 433.71 MiB | 31.33 MiB/s Receiving objects: 92% (149164/162134), 453.76 MiB | 31.80 MiB/s Receiving objects: 93% (150785/162134), 453.76 MiB | 31.80 MiB/s Receiving objects: 94% (152406/162134), 453.76 MiB | 31.80 MiB/s Receiving objects: 95% (154028/162134), 472.29 MiB | 32.18 MiB/s Receiving objects: 96% (155649/162134), 472.29 MiB | 32.18 MiB/s Receiving objects: 96% (156618/162134), 472.29 MiB | 32.18 MiB/s Receiving objects: 97% (157270/162134), 472.29 MiB | 32.18 MiB/s Receiving objects: 98% (158892/162134), 490.53 MiB | 34.88 MiB/s Receiving objects: 99% (160513/162134), 490.53 MiB | 34.88 MiB/s remote: Total 162134 (delta 2584), reused 2717 (delta 2211), pack-reused 158424 (from 3)
  7. 19.88 s Receiving objects: 100% (162134/162134), 490.53 MiB | 34.88 MiB/s Receiving objects: 100% (162134/162134), 500.56 MiB | 32.46 MiB/s, done.
  8. 26.31 s Resolving deltas: 0% (0/105592) Resolving deltas: 1% (1056/105592) Resolving deltas: 2% (2112/105592) Resolving deltas: 3% (3168/105592) Resolving deltas: 4% (4224/105592) Resolving deltas: 5% (5280/105592) Resolving deltas: 6% (6337/105592) Resolving deltas: 7% (7392/105592) Resolving deltas: 8% (8448/105592) Resolving deltas: 9% (9504/105592) Resolving deltas: 10% (10560/105592) Resolving deltas: 11% (11616/105592) Resolving deltas: 12% (12672/105592) Resolving deltas: 13% (13729/105592) Resolving deltas: 14% (14783/105592) Resolving deltas: 14% (15266/105592) Resolving deltas: 15% (15839/105592) Resolving deltas: 16% (16895/105592) Resolving deltas: 17% (17951/105592) Resolving deltas: 18% (19007/105592) Resolving deltas: 19% (20063/105592) Resolving deltas: 20% (21119/105592) Resolving deltas: 21% (22175/105592) Resolving deltas: 22% (23231/105592) Resolving deltas: 23% (24287/105592) Resolving deltas: 24% (25343/105592) Resolving deltas: 25% (26399/105592) Resolving deltas: 26% (27454/105592) Resolving deltas: 27% (28510/105592) Resolving deltas: 28% (29566/105592) Resolving deltas: 29% (30622/105592) Resolving deltas: 30% (31680/105592) Resolving deltas: 31% (32734/105592) Resolving deltas: 32% (33790/105592) Resolving deltas: 33% (34846/105592) Resolving deltas: 34% (35902/105592) Resolving deltas: 34% (36710/105592) Resolving deltas: 35% (36958/105592) Resolving deltas: 36% (38014/105592) Resolving deltas: 37% (39070/105592) Resolving deltas: 38% (40125/105592) Resolving deltas: 39% (41181/105592) Resolving deltas: 40% (42237/105592) Resolving deltas: 41% (43293/105592) Resolving deltas: 42% (44349/105592) Resolving deltas: 43% (45405/105592) Resolving deltas: 43% (46231/105592) Resolving deltas: 44% (46461/105592) Resolving deltas: 45% (47517/105592) Resolving deltas: 46% (48575/105592) Resolving deltas: 47% (49629/105592) Resolving deltas: 48% (50685/105592) Resolving deltas: 49% (51741/105592) Resolving deltas: 50% (52796/105592) Resolving deltas: 50% (53112/105592) Resolving deltas: 51% (53852/105592) Resolving deltas: 52% (54908/105592) Resolving deltas: 53% (55964/105592) Resolving deltas: 54% (57020/105592) Resolving deltas: 55% (58076/105592) Resolving deltas: 56% (59133/105592) Resolving deltas: 57% (60188/105592) Resolving deltas: 58% (61244/105592) Resolving deltas: 59% (62301/105592) Resolving deltas: 60% (63356/105592) Resolving deltas: 61% (64412/105592) Resolving deltas: 62% (65468/105592) Resolving deltas: 63% (66523/105592) Resolving deltas: 64% (67579/105592) Resolving deltas: 65% (68635/105592) Resolving deltas: 66% (69691/105592) Resolving deltas: 67% (70747/105592) Resolving deltas: 68% (71803/105592) Resolving deltas: 69% (72859/105592) Resolving deltas: 70% (73915/105592) Resolving deltas: 71% (74971/105592) Resolving deltas: 72% (76027/105592) Resolving deltas: 73% (77083/105592) Resolving deltas: 74% (78139/105592) Resolving deltas: 75% (79194/105592) Resolving deltas: 76% (80250/105592) Resolving deltas: 77% (81306/105592) Resolving deltas: 78% (82362/105592) Resolving deltas: 79% (83418/105592) Resolving deltas: 79% (83826/105592) Resolving deltas: 80% (84474/105592) Resolving deltas: 81% (85530/105592) Resolving deltas: 82% (86586/105592) Resolving deltas: 83% (87642/105592) Resolving deltas: 84% (88698/105592) Resolving deltas: 85% (89755/105592) Resolving deltas: 86% (90810/105592) Resolving deltas: 87% (91866/105592) Resolving deltas: 88% (92921/105592) Resolving deltas: 89% (93977/105592) Resolving deltas: 90% (95033/105592) Resolving deltas: 91% (96089/105592) Resolving deltas: 92% (97145/105592) Resolving deltas: 93% (98201/105592) Resolving deltas: 94% (99257/105592) Resolving deltas: 95% (100313/105592) Resolving deltas: 95% (100712/105592) Resolving deltas: 96% (101369/105592) Resolving deltas: 97% (102425/105592) Resolving deltas: 98% (103481/105592) Resolving deltas: 99% (104537/105592) Resolving deltas: 100% (105592/105592) Resolving deltas: 100% (105592/105592), done.
  9. 27.88 s Fetching commit 1b8d7b36dded9aad41a05d8ce52cedf6617978e8 for codex/ninja-shared-types ...
  10. 27.88 s $ /nix/store/b1wn5clix1mz4vpfih7x9cnj9qfh7c6h-git-2.54.0/bin/git fetch origin 1b8d7b36dded9aad41a05d8ce52cedf6617978e8
  11. 28.72 s From https://github.com/alphal00p/gammaloop
  12. 28.72 s * branch 1b8d7b36dded9aad41a05d8ce52cedf6617978e8 -> FETCH_HEAD
  13. 28.82 s $ /nix/store/bhv6xyvqw6gjs3j488gi1z6wdv18bdpa-coreutils-9.11/bin/timeout --kill-after=15s 7200s /nix/store/b1wn5clix1mz4vpfih7x9cnj9qfh7c6h-git-2.54.0/bin/git -c advice.detachedHead=false checkout 1b8d7b36dded9aad41a05d8ce52cedf6617978e8
  14. 29.63 s HEAD is now at 1b8d7b36d nix-ci: enable NixCI for final review
  15. 29.67 s $ /nix/store/bhv6xyvqw6gjs3j488gi1z6wdv18bdpa-coreutils-9.11/bin/timeout --kill-after=15s 7200s /nix/store/bxgja2ppiqi6w2bgn0r07d7mgnl1k6k2-nix-2.34.8/bin/nix --extra-experimental-features nix-command --extra-experimental-features flakes --log-format internal-json run .#packages.x86_64-linux.nix-ci-check-gammaloop-nextest-clinnet --print-build-logs
  16. 30.40 s warning: ignoring untrusted flake configuration setting 'extra-substituters'.
  17. 30.40 s Pass '--accept-flake-config' to trust it
  18. 30.40 s warning: ignoring untrusted flake configuration setting 'extra-trusted-public-keys'.
  19. 30.40 s Pass '--accept-flake-config' to trust it
  20. 43.20 s
  21. 52.43 s evaluating derivation 'gdo you want to allow configuration setting 'extra-substituters' to be set to 'https://cache.nix-ci.com' (y/N)? do you want to permanently mark this value as untrusted (y/N)? warning: ignoring untrusted flake configuration setting 'extra-substituters'.
  22. 52.43 s Pass '--accept-flake-config' to trust it
  23. 52.43 s do you want to allow configuration setting 'extra-trusted-public-keys' to be set to 'nix-ci:g3xV5BDTLtIBZr/A00IU1x0EtKKlb7YLgBN2SgYgM6A=' (y/N)? do you want to permanently mark this value as untrusted (y/N)? warning: ignoring untrusted flake configuration setting 'extra-trusted-public-keys'.
  24. 52.43 s Pass '--accept-flake-config' to trust it
  25. 61.33 s copying '/nix/store/yjzy evaluating derivation 'g copying '/nix/store/yjzy evaluating derivation 'g copying '/nix/store/yjzy evaluating derivation 'g copying '/nix/store/yjzy evaluating derivation 'g copying '/nix/store/yjzy evaluating derivation 'g copying '/nix/store/yjzy evaluating derivation 'g copying '/nix/store/yjzy evaluating derivation 'g copying '/nix/store/yjzy evaluating derivation 'g copying '/nix/store/yjzy evaluating derivation 'g
  26. 67.41 s querying info about miss
  27. 83.88 s [0/16 built] [0/1 built] [1/0/1 built] building ggammaloop-nextest-clinnet> Nextest worker budget: 16
  28. 83.93 s gammaloop-nextest-clinnet> Extracting 4 binaries (including 1 non-test binary), 1 build script output directory, and 1 linked path to /build/source
  29. 84.09 s gammaloop-nextest-clinnet> Extracted 16 files to /build/source in 0.17s
  30. 84.16 s gammaloop-nextest-clinnet> ------------
  31. 84.16 s gammaloop-nextest-clinnet> Nextest run ID a3d9598e-0c34-4766-889c-0e9b008e0305 with nextest profile: ci_gammaloop
  32. 84.16 s gammaloop-nextest-clinnet> Starting 38 tests across 3 binaries
  33. 263.08 s gammaloop-nextest-clinnet> FAIL [ 178.846s] (32/38) clinnet::public_typst_behavior public_linnest_endpoint_anchor_distances_stay_local
  34. 263.08 s gammaloop-nextest-clinnet> stdout ---
  35. 263.08 s gammaloop-nextest-clinnet>
  36. 263.08 s gammaloop-nextest-clinnet> running 1 test
  37. 263.08 s gammaloop-nextest-clinnet> test public_linnest_endpoint_anchor_distances_stay_local has been running for over 60 seconds
  38. 263.08 s gammaloop-nextest-clinnet> test public_linnest_endpoint_anchor_distances_stay_local ... FAILED
  39. 263.08 s gammaloop-nextest-clinnet>
  40. 263.08 s gammaloop-nextest-clinnet> failures:
  41. 263.08 s gammaloop-nextest-clinnet>
  42. 263.08 s gammaloop-nextest-clinnet> failures:
  43. 263.08 s gammaloop-nextest-clinnet> public_linnest_endpoint_anchor_distances_stay_local
  44. 263.08 s gammaloop-nextest-clinnet>
  45. 263.08 s gammaloop-nextest-clinnet> test result: FAILED. 0 passed; 1 failed; 0 ignored; 0 measured; 17 filtered out; finished in 178.79s
  46. 263.08 s gammaloop-nextest-clinnet>
  47. 263.08 s gammaloop-nextest-clinnet> stderr ---
  48. 263.08 s gammaloop-nextest-clinnet>
  49. 263.08 s gammaloop-nextest-clinnet> thread 'public_linnest_endpoint_anchor_distances_stay_local' (288) panicked at crates/clinnet/tests/public_typst_behavior.rs:81:55:
  50. 263.08 s gammaloop-nextest-clinnet> called `Result::unwrap()` on an `Err` value: typst failed while compiling template /build/.tmpt0rSrq/.clinnet/templates/linnest-public-behavior.svg
  51. 263.08 s gammaloop-nextest-clinnet>
  52. 263.08 s gammaloop-nextest-clinnet> Command executed:
  53. 263.08 s gammaloop-nextest-clinnet> "typst" "c" "/build/.tmpt0rSrq/.clinnet/templates/linnest-public-behavior.typ" "/build/.tmpt0rSrq/.clinnet/templates/linnest-public-behavior.svg" "--root" "/build/.tmpt0rSrq/.clinnet/templates"
  54. 263.08 s gammaloop-nextest-clinnet>
  55. 263.08 s gammaloop-nextest-clinnet> Typst stdout:
  56. 263.08 s gammaloop-nextest-clinnet>
  57. 263.08 s gammaloop-nextest-clinnet>
  58. 263.08 s gammaloop-nextest-clinnet> Typst stderr:
  59. 263.08 s gammaloop-nextest-clinnet>
  60. 263.08 s gammaloop-nextest-clinnet>
  61. 263.08 s gammaloop-nextest-clinnet> Location:
  62. 263.08 s gammaloop-nextest-clinnet> crates/clinnet/src/lib.rs:741:13
  63. 263.08 s gammaloop-nextest-clinnet> stack backtrace:
  64. 263.08 s gammaloop-nextest-clinnet> 0: __rustc::rust_begin_unwind
  65. 263.08 s gammaloop-nextest-clinnet> 1: core::panicking::panic_fmt
  66. 263.08 s gammaloop-nextest-clinnet> 2: core::result::unwrap_failed
  67. 263.08 s gammaloop-nextest-clinnet> 3: public_typst_behavior::render
  68. 263.08 s gammaloop-nextest-clinnet> 4: <std::sync::once::Once>::call_once_force::<<std::sync::once_lock::OnceLock<alloc::string::String>>::initialize<<std::sync::once_lock::OnceLock<alloc::string::String>>::get_or_init<public_typst_behavior::linnest_public_svg::{closure#0}>::{closure#0}, !>::{closure#0}>::{closure#0}
  69. 263.08 s gammaloop-nextest-clinnet> 5: <std::sys::sync::once::futex::Once>::call
  70. 263.08 s gammaloop-nextest-clinnet> 6: <std::sync::once_lock::OnceLock<alloc::string::String>>::initialize::<<std::sync::once_lock::OnceLock<alloc::string::String>>::get_or_init<public_typst_behavior::linnest_public_svg::{closure#0}>::{closure#0}, !>
  71. 263.08 s gammaloop-nextest-clinnet> 7: <public_typst_behavior::public_linnest_endpoint_anchor_distances_stay_local::{closure#0} as core::ops::function::FnOnce<()>>::call_once
  72. 263.08 s gammaloop-nextest-clinnet> note: Some details are omitted, run with `RUST_BACKTRACE=full` for a verbose backtrace.
  73. 263.08 s gammaloop-nextest-clinnet>
  74. 268.90 s gammaloop-nextest-clinnet> FAIL [ 184.385s] (33/38) clinnet::public_typst_behavior public_linnest_overlays_follow_the_unit
  75. 268.90 s gammaloop-nextest-clinnet> stdout ---
  76. 268.90 s gammaloop-nextest-clinnet>
  77. 268.90 s gammaloop-nextest-clinnet> running 1 test
  78. 268.90 s gammaloop-nextest-clinnet> test public_linnest_overlays_follow_the_unit has been running for over 60 seconds
  79. 268.90 s gammaloop-nextest-clinnet> test public_linnest_overlays_follow_the_unit ... FAILED
  80. 268.90 s gammaloop-nextest-clinnet>
  81. 268.90 s gammaloop-nextest-clinnet> failures:
  82. 268.90 s gammaloop-nextest-clinnet>
  83. 268.90 s gammaloop-nextest-clinnet> failures:
  84. 268.90 s gammaloop-nextest-clinnet> public_linnest_overlays_follow_the_unit
  85. 268.90 s gammaloop-nextest-clinnet>
  86. 268.90 s gammaloop-nextest-clinnet> test result: FAILED. 0 passed; 1 failed; 0 ignored; 0 measured; 17 filtered out; finished in 184.36s
  87. 268.90 s gammaloop-nextest-clinnet>
  88. 268.90 s gammaloop-nextest-clinnet> stderr ---
  89. 268.90 s gammaloop-nextest-clinnet>
  90. 268.90 s gammaloop-nextest-clinnet> thread 'public_linnest_overlays_follow_the_unit' (316) panicked at crates/clinnet/tests/public_typst_behavior.rs:81:55:
  91. 268.90 s gammaloop-nextest-clinnet> called `Result::unwrap()` on an `Err` value: typst failed while compiling template /build/.tmp222iZw/.clinnet/templates/linnest-public-behavior.svg
  92. 268.90 s gammaloop-nextest-clinnet>
  93. 268.90 s gammaloop-nextest-clinnet> Command executed:
  94. 268.90 s gammaloop-nextest-clinnet> "typst" "c" "/build/.tmp222iZw/.clinnet/templates/linnest-public-behavior.typ" "/build/.tmp222iZw/.clinnet/templates/linnest-public-behavior.svg" "--root" "/build/.tmp222iZw/.clinnet/templates"
  95. 268.90 s gammaloop-nextest-clinnet>
  96. 268.90 s gammaloop-nextest-clinnet> Typst stdout:
  97. 268.90 s gammaloop-nextest-clinnet>
  98. 268.90 s gammaloop-nextest-clinnet>
  99. 268.90 s gammaloop-nextest-clinnet> Typst stderr:
  100. 268.90 s gammaloop-nextest-clinnet>
  101. 268.90 s gammaloop-nextest-clinnet>
  102. 268.90 s gammaloop-nextest-clinnet> Location:
  103. 268.90 s gammaloop-nextest-clinnet> crates/clinnet/src/lib.rs:741:13
  104. 268.90 s gammaloop-nextest-clinnet> stack backtrace:
  105. 268.90 s gammaloop-nextest-clinnet> 0: __rustc::rust_begin_unwind
  106. 268.90 s gammaloop-nextest-clinnet> 1: core::panicking::panic_fmt
  107. 268.90 s gammaloop-nextest-clinnet> 2: core::result::unwrap_failed
  108. 268.90 s gammaloop-nextest-clinnet> 3: public_typst_behavior::render
  109. 268.90 s gammaloop-nextest-clinnet> 4: <std::sync::once::Once>::call_once_force::<<std::sync::once_lock::OnceLock<alloc::string::String>>::initialize<<std::sync::once_lock::OnceLock<alloc::string::String>>::get_or_init<public_typst_behavior::linnest_public_svg::{closure#0}>::{closure#0}, !>::{closure#0}>::{closure#0}
  110. 268.90 s gammaloop-nextest-clinnet> 5: <std::sys::sync::once::futex::Once>::call
  111. 268.90 s gammaloop-nextest-clinnet> 6: <std::sync::once_lock::OnceLock<alloc::string::String>>::initialize::<<std::sync::once_lock::OnceLock<alloc::string::String>>::get_or_init<public_typst_behavior::linnest_public_svg::{closure#0}>::{closure#0}, !>
  112. 268.90 s gammaloop-nextest-clinnet> 7: <public_typst_behavior::public_linnest_overlays_follow_the_unit::{closure#0} as core::ops::function::FnOnce<()>>::call_once
  113. 268.90 s gammaloop-nextest-clinnet> note: Some details are omitted, run with `RUST_BACKTRACE=full` for a verbose backtrace.
  114. 268.90 s gammaloop-nextest-clinnet>
  115. 281.78 s gammaloop-nextest-clinnet> FAIL [ 197.409s] (34/38) clinnet::public_typst_behavior public_linnest_fixture_assertions_hold
  116. 281.78 s gammaloop-nextest-clinnet> stdout ---
  117. 281.78 s gammaloop-nextest-clinnet>
  118. 281.78 s gammaloop-nextest-clinnet> running 1 test
  119. 281.78 s gammaloop-nextest-clinnet> test public_linnest_fixture_assertions_hold has been running for over 60 seconds
  120. 281.78 s gammaloop-nextest-clinnet> test public_linnest_fixture_assertions_hold ... FAILED
  121. 281.78 s gammaloop-nextest-clinnet>
  122. 281.78 s gammaloop-nextest-clinnet> failures:
  123. 281.78 s gammaloop-nextest-clinnet>
  124. 281.78 s gammaloop-nextest-clinnet> failures:
  125. 281.78 s gammaloop-nextest-clinnet> public_linnest_fixture_assertions_hold
  126. 281.78 s gammaloop-nextest-clinnet>
  127. 281.78 s gammaloop-nextest-clinnet> test result: FAILED. 0 passed; 1 failed; 0 ignored; 0 measured; 17 filtered out; finished in 197.36s
  128. 281.78 s gammaloop-nextest-clinnet>
  129. 281.79 s gammaloop-nextest-clinnet> stderr ---
  130. 281.79 s gammaloop-nextest-clinnet>
  131. 281.79 s gammaloop-nextest-clinnet> thread 'public_linnest_fixture_assertions_hold' (291) panicked at crates/clinnet/tests/public_typst_behavior.rs:81:55:
  132. 281.79 s gammaloop-nextest-clinnet> called `Result::unwrap()` on an `Err` value: typst failed while compiling template /build/.tmpR0Vm3q/.clinnet/templates/linnest-public-behavior.svg
  133. 281.79 s gammaloop-nextest-clinnet>
  134. 281.79 s gammaloop-nextest-clinnet> Command executed:
  135. 281.79 s gammaloop-nextest-clinnet> "typst" "c" "/build/.tmpR0Vm3q/.clinnet/templates/linnest-public-behavior.typ" "/build/.tmpR0Vm3q/.clinnet/templates/linnest-public-behavior.svg" "--root" "/build/.tmpR0Vm3q/.clinnet/templates"
  136. 281.79 s gammaloop-nextest-clinnet>
  137. 281.79 s gammaloop-nextest-clinnet> Typst stdout:
  138. 281.79 s gammaloop-nextest-clinnet>
  139. 281.79 s gammaloop-nextest-clinnet>
  140. 281.79 s gammaloop-nextest-clinnet> Typst stderr:
  141. 281.79 s gammaloop-nextest-clinnet>
  142. 281.79 s gammaloop-nextest-clinnet>
  143. 281.79 s gammaloop-nextest-clinnet> Location:
  144. 281.79 s gammaloop-nextest-clinnet> crates/clinnet/src/lib.rs:741:13
  145. 281.79 s gammaloop-nextest-clinnet> stack backtrace:
  146. 281.79 s gammaloop-nextest-clinnet> 0: __rustc::rust_begin_unwind
  147. 281.79 s gammaloop-nextest-clinnet> 1: core::panicking::panic_fmt
  148. 281.79 s gammaloop-nextest-clinnet> 2: core::result::unwrap_failed
  149. 281.79 s gammaloop-nextest-clinnet> 3: public_typst_behavior::render
  150. 281.79 s gammaloop-nextest-clinnet> 4: <std::sync::once::Once>::call_once_force::<<std::sync::once_lock::OnceLock<alloc::string::String>>::initialize<<std::sync::once_lock::OnceLock<alloc::string::String>>::get_or_init<public_typst_behavior::linnest_public_svg::{closure#0}>::{closure#0}, !>::{closure#0}>::{closure#0}
  151. 281.79 s gammaloop-nextest-clinnet> 5: <std::sys::sync::once::futex::Once>::call
  152. 281.79 s gammaloop-nextest-clinnet> 6: <std::sync::once_lock::OnceLock<alloc::string::String>>::initialize::<<std::sync::once_lock::OnceLock<alloc::string::String>>::get_or_init<public_typst_behavior::linnest_public_svg::{closure#0}>::{closure#0}, !>
  153. 281.79 s gammaloop-nextest-clinnet> 7: <public_typst_behavior::public_linnest_fixture_assertions_hold::{closure#0} as core::ops::function::FnOnce<()>>::call_once
  154. 281.79 s gammaloop-nextest-clinnet> note: Some details are omitted, run with `RUST_BACKTRACE=full` for a verbose backtrace.
  155. 281.79 s gammaloop-nextest-clinnet>
  156. 301.35 s gammaloop-nextest-clinnet> ------------
  157. 301.35 s gammaloop-nextest-clinnet> Summary [ 217.185s] 38 tests run: 35 passed (4 slow), 3 failed, 0 skipped
  158. 301.35 s gammaloop-nextest-clinnet> FAIL [ 178.846s] (32/38) clinnet::public_typst_behavior public_linnest_endpoint_anchor_distances_stay_local
  159. 301.35 s gammaloop-nextest-clinnet> stdout ---
  160. 301.35 s gammaloop-nextest-clinnet>
  161. 301.35 s gammaloop-nextest-clinnet> running 1 test
  162. 301.35 s gammaloop-nextest-clinnet> test public_linnest_endpoint_anchor_distances_stay_local has been running for over 60 seconds
  163. 301.35 s gammaloop-nextest-clinnet> test public_linnest_endpoint_anchor_distances_stay_local ... FAILED
  164. 301.35 s gammaloop-nextest-clinnet>
  165. 301.35 s gammaloop-nextest-clinnet> failures:
  166. 301.35 s gammaloop-nextest-clinnet>
  167. 301.35 s gammaloop-nextest-clinnet> failures:
  168. 301.35 s gammaloop-nextest-clinnet> public_linnest_endpoint_anchor_distances_stay_local
  169. 301.35 s gammaloop-nextest-clinnet>
  170. 301.35 s gammaloop-nextest-clinnet> test result: FAILED. 0 passed; 1 failed; 0 ignored; 0 measured; 17 filtered out; finished in 178.79s
  171. 301.35 s gammaloop-nextest-clinnet>
  172. 301.35 s gammaloop-nextest-clinnet> stderr ---
  173. 301.35 s gammaloop-nextest-clinnet>
  174. 301.35 s gammaloop-nextest-clinnet> thread 'public_linnest_endpoint_anchor_distances_stay_local' (288) panicked at crates/clinnet/tests/public_typst_behavior.rs:81:55:
  175. 301.35 s gammaloop-nextest-clinnet> called `Result::unwrap()` on an `Err` value: typst failed while compiling template /build/.tmpt0rSrq/.clinnet/templates/linnest-public-behavior.svg
  176. 301.35 s gammaloop-nextest-clinnet>
  177. 301.35 s gammaloop-nextest-clinnet> Command executed:
  178. 301.35 s gammaloop-nextest-clinnet> "typst" "c" "/build/.tmpt0rSrq/.clinnet/templates/linnest-public-behavior.typ" "/build/.tmpt0rSrq/.clinnet/templates/linnest-public-behavior.svg" "--root" "/build/.tmpt0rSrq/.clinnet/templates"
  179. 301.35 s gammaloop-nextest-clinnet>
  180. 301.35 s gammaloop-nextest-clinnet> Typst stdout:
  181. 301.35 s gammaloop-nextest-clinnet>
  182. 301.35 s gammaloop-nextest-clinnet>
  183. 301.35 s gammaloop-nextest-clinnet> Typst stderr:
  184. 301.35 s gammaloop-nextest-clinnet>
  185. 301.35 s gammaloop-nextest-clinnet>
  186. 301.35 s gammaloop-nextest-clinnet> Location:
  187. 301.35 s gammaloop-nextest-clinnet> crates/clinnet/src/lib.rs:741:13
  188. 301.35 s gammaloop-nextest-clinnet> stack backtrace:
  189. 301.35 s gammaloop-nextest-clinnet> 0: __rustc::rust_begin_unwind
  190. 301.35 s gammaloop-nextest-clinnet> 1: core::panicking::panic_fmt
  191. 301.35 s gammaloop-nextest-clinnet> 2: core::result::unwrap_failed
  192. 301.35 s gammaloop-nextest-clinnet> 3: public_typst_behavior::render
  193. 301.35 s gammaloop-nextest-clinnet> 4: <std::sync::once::Once>::call_once_force::<<std::sync::once_lock::OnceLock<alloc::string::String>>::initialize<<std::sync::once_lock::OnceLock<alloc::string::String>>::get_or_init<public_typst_behavior::linnest_public_svg::{closure#0}>::{closure#0}, !>::{closure#0}>::{closure#0}
  194. 301.35 s gammaloop-nextest-clinnet> 5: <std::sys::sync::once::futex::Once>::call
  195. 301.35 s gammaloop-nextest-clinnet> 6: <std::sync::once_lock::OnceLock<alloc::string::String>>::initialize::<<std::sync::once_lock::OnceLock<alloc::string::String>>::get_or_init<public_typst_behavior::linnest_public_svg::{closure#0}>::{closure#0}, !>
  196. 301.35 s gammaloop-nextest-clinnet> 7: <public_typst_behavior::public_linnest_endpoint_anchor_distances_stay_local::{closure#0} as core::ops::function::FnOnce<()>>::call_once
  197. 301.35 s gammaloop-nextest-clinnet> note: Some details are omitted, run with `RUST_BACKTRACE=full` for a verbose backtrace.
  198. 301.35 s gammaloop-nextest-clinnet>
  199. 301.35 s gammaloop-nextest-clinnet> FAIL [ 184.385s] (33/38) clinnet::public_typst_behavior public_linnest_overlays_follow_the_unit
  200. 301.35 s gammaloop-nextest-clinnet> stdout ---
  201. 301.35 s gammaloop-nextest-clinnet>
  202. 301.35 s gammaloop-nextest-clinnet> running 1 test
  203. 301.35 s gammaloop-nextest-clinnet> test public_linnest_overlays_follow_the_unit has been running for over 60 seconds
  204. 301.35 s gammaloop-nextest-clinnet> test public_linnest_overlays_follow_the_unit ... FAILED
  205. 301.35 s gammaloop-nextest-clinnet>
  206. 301.35 s gammaloop-nextest-clinnet> failures:
  207. 301.35 s gammaloop-nextest-clinnet>
  208. 301.35 s gammaloop-nextest-clinnet> failures:
  209. 301.35 s gammaloop-nextest-clinnet> public_linnest_overlays_follow_the_unit
  210. 301.35 s gammaloop-nextest-clinnet>
  211. 301.35 s gammaloop-nextest-clinnet> test result: FAILED. 0 passed; 1 failed; 0 ignored; 0 measured; 17 filtered out; finished in 184.36s
  212. 301.35 s gammaloop-nextest-clinnet>
  213. 301.35 s gammaloop-nextest-clinnet> stderr ---
  214. 301.35 s gammaloop-nextest-clinnet>
  215. 301.35 s gammaloop-nextest-clinnet> thread 'public_linnest_overlays_follow_the_unit' (316) panicked at crates/clinnet/tests/public_typst_behavior.rs:81:55:
  216. 301.35 s gammaloop-nextest-clinnet> called `Result::unwrap()` on an `Err` value: typst failed while compiling template /build/.tmp222iZw/.clinnet/templates/linnest-public-behavior.svg
  217. 301.35 s gammaloop-nextest-clinnet>
  218. 301.35 s gammaloop-nextest-clinnet> Command executed:
  219. 301.35 s gammaloop-nextest-clinnet> "typst" "c" "/build/.tmp222iZw/.clinnet/templates/linnest-public-behavior.typ" "/build/.tmp222iZw/.clinnet/templates/linnest-public-behavior.svg" "--root" "/build/.tmp222iZw/.clinnet/templates"
  220. 301.35 s gammaloop-nextest-clinnet>
  221. 301.35 s gammaloop-nextest-clinnet> Typst stdout:
  222. 301.35 s gammaloop-nextest-clinnet>
  223. 301.35 s gammaloop-nextest-clinnet>
  224. 301.35 s gammaloop-nextest-clinnet> Typst stderr:
  225. 301.35 s gammaloop-nextest-clinnet>
  226. 301.35 s gammaloop-nextest-clinnet>
  227. 301.35 s gammaloop-nextest-clinnet> Location:
  228. 301.35 s gammaloop-nextest-clinnet> crates/clinnet/src/lib.rs:741:13
  229. 301.35 s gammaloop-nextest-clinnet> stack backtrace:
  230. 301.35 s gammaloop-nextest-clinnet> 0: __rustc::rust_begin_unwind
  231. 301.35 s gammaloop-nextest-clinnet> 1: core::panicking::panic_fmt
  232. 301.35 s gammaloop-nextest-clinnet> 2: core::result::unwrap_failed
  233. 301.35 s gammaloop-nextest-clinnet> 3: public_typst_behavior::render
  234. 301.35 s gammaloop-nextest-clinnet> 4: <std::sync::once::Once>::call_once_force::<<std::sync::once_lock::OnceLock<alloc::string::String>>::initialize<<std::sync::once_lock::OnceLock<alloc::string::String>>::get_or_init<public_typst_behavior::linnest_public_svg::{closure#0}>::{closure#0}, !>::{closure#0}>::{closure#0}
  235. 301.35 s gammaloop-nextest-clinnet> 5: <std::sys::sync::once::futex::Once>::call
  236. 301.35 s gammaloop-nextest-clinnet> 6: <std::sync::once_lock::OnceLock<alloc::string::String>>::initialize::<<std::sync::once_lock::OnceLock<alloc::string::String>>::get_or_init<public_typst_behavior::linnest_public_svg::{closure#0}>::{closure#0}, !>
  237. 301.35 s gammaloop-nextest-clinnet> 7: <public_typst_behavior::public_linnest_overlays_follow_the_unit::{closure#0} as core::ops::function::FnOnce<()>>::call_once
  238. 301.35 s gammaloop-nextest-clinnet> note: Some details are omitted, run with `RUST_BACKTRACE=full` for a verbose backtrace.
  239. 301.35 s gammaloop-nextest-clinnet>
  240. 301.35 s gammaloop-nextest-clinnet> FAIL [ 197.409s] (34/38) clinnet::public_typst_behavior public_linnest_fixture_assertions_hold
  241. 301.35 s gammaloop-nextest-clinnet> stdout ---
  242. 301.35 s gammaloop-nextest-clinnet>
  243. 301.35 s gammaloop-nextest-clinnet> running 1 test
  244. 301.35 s gammaloop-nextest-clinnet> test public_linnest_fixture_assertions_hold has been running for over 60 seconds
  245. 301.35 s gammaloop-nextest-clinnet> test public_linnest_fixture_assertions_hold ... FAILED
  246. 301.35 s gammaloop-nextest-clinnet>
  247. 301.35 s gammaloop-nextest-clinnet> failures:
  248. 301.35 s gammaloop-nextest-clinnet>
  249. 301.35 s gammaloop-nextest-clinnet> failures:
  250. 301.35 s gammaloop-nextest-clinnet> public_linnest_fixture_assertions_hold
  251. 301.35 s gammaloop-nextest-clinnet>
  252. 301.35 s gammaloop-nextest-clinnet> test result: FAILED. 0 passed; 1 failed; 0 ignored; 0 measured; 17 filtered out; finished in 197.36s
  253. 301.35 s gammaloop-nextest-clinnet>
  254. 301.35 s gammaloop-nextest-clinnet> stderr ---
  255. 301.35 s gammaloop-nextest-clinnet>
  256. 301.35 s gammaloop-nextest-clinnet> thread 'public_linnest_fixture_assertions_hold' (291) panicked at crates/clinnet/tests/public_typst_behavior.rs:81:55:
  257. 301.35 s gammaloop-nextest-clinnet> called `Result::unwrap()` on an `Err` value: typst failed while compiling template /build/.tmpR0Vm3q/.clinnet/templates/linnest-public-behavior.svg
  258. 301.35 s gammaloop-nextest-clinnet>
  259. 301.35 s gammaloop-nextest-clinnet> Command executed:
  260. 301.35 s gammaloop-nextest-clinnet> "typst" "c" "/build/.tmpR0Vm3q/.clinnet/templates/linnest-public-behavior.typ" "/build/.tmpR0Vm3q/.clinnet/templates/linnest-public-behavior.svg" "--root" "/build/.tmpR0Vm3q/.clinnet/templates"
  261. 301.35 s gammaloop-nextest-clinnet>
  262. 301.35 s gammaloop-nextest-clinnet> Typst stdout:
  263. 301.35 s gammaloop-nextest-clinnet>
  264. 301.35 s gammaloop-nextest-clinnet>
  265. 301.35 s gammaloop-nextest-clinnet> Typst stderr:
  266. 301.35 s gammaloop-nextest-clinnet>
  267. 301.35 s gammaloop-nextest-clinnet>
  268. 301.35 s gammaloop-nextest-clinnet> Location:
  269. 301.35 s gammaloop-nextest-clinnet> crates/clinnet/src/lib.rs:741:13
  270. 301.35 s gammaloop-nextest-clinnet> stack backtrace:
  271. 301.35 s gammaloop-nextest-clinnet> 0: __rustc::rust_begin_unwind
  272. 301.35 s gammaloop-nextest-clinnet> 1: core::panicking::panic_fmt
  273. 301.35 s gammaloop-nextest-clinnet> 2: core::result::unwrap_failed
  274. 301.35 s gammaloop-nextest-clinnet> 3: public_typst_behavior::render
  275. 301.35 s gammaloop-nextest-clinnet> 4: <std::sync::once::Once>::call_once_force::<<std::sync::once_lock::OnceLock<alloc::string::String>>::initialize<<std::sync::once_lock::OnceLock<alloc::string::String>>::get_or_init<public_typst_behavior::linnest_public_svg::{closure#0}>::{closure#0}, !>::{closure#0}>::{closure#0}
  276. 301.35 s gammaloop-nextest-clinnet> 5: <std::sys::sync::once::futex::Once>::call
  277. 301.35 s gammaloop-nextest-clinnet> 6: <std::sync::once_lock::OnceLock<alloc::string::String>>::initialize::<<std::sync::once_lock::OnceLock<alloc::string::String>>::get_or_init<public_typst_behavior::linnest_public_svg::{closure#0}>::{closure#0}, !>
  278. 301.35 s gammaloop-nextest-clinnet> 7: <public_typst_behavior::public_linnest_fixture_assertions_hold::{closure#0} as core::ops::function::FnOnce<()>>::call_once
  279. 301.35 s gammaloop-nextest-clinnet> note: Some details are omitted, run with `RUST_BACKTRACE=full` for a verbose backtrace.
  280. 301.35 s gammaloop-nextest-clinnet>
  281. 301.37 s gammaloop-nextest-clinnet> error: test run failed
  282. 302.18 s gammaloop-nextest-clinnet>
  283. 302.18 s gammaloop-nextest-clinnet> ========== nextest test summary ==========
  284. 302.18 s gammaloop-nextest-clinnet> report: target/nextest/ci_gammaloop/junit.xml
  285. 302.18 s gammaloop-nextest-clinnet> tests: 38, failures: 3, errors: 0
  286. 302.18 s gammaloop-nextest-clinnet>
  287. 302.18 s gammaloop-nextest-clinnet> 1. clinnet::public_typst_behavior::public_linnest_endpoint_anchor_distances_stay_local
  288. 302.18 s gammaloop-nextest-clinnet> failure: test failure with exit code 101
  289. 302.18 s gammaloop-nextest-clinnet> thread 'public_linnest_endpoint_anchor_distances_stay_local' (288) panicked at crates/clinnet/tests/public_typst_behavior.rs:81:55:
  290. 302.18 s gammaloop-nextest-clinnet> called `Result::unwrap()` on an `Err` value: typst failed while compiling template /build/.tmpt0rSrq/.clinnet/templates/linnest-public-behavior.svg
  291. 302.18 s gammaloop-nextest-clinnet>
  292. 302.18 s gammaloop-nextest-clinnet> Command executed:
  293. 302.18 s gammaloop-nextest-clinnet> "typst" "c" "/build/.tmpt0rSrq/.clinnet/templates/linnest-public-behavior.typ" "/build/.tmpt0rSrq/.clinnet/templates/linnest-public-behavior.svg" "--root" "/build/.tmpt0rSrq/.clinnet/templates"
  294. 302.18 s gammaloop-nextest-clinnet>
  295. 302.18 s gammaloop-nextest-clinnet> Typst stdout:
  296. 302.18 s gammaloop-nextest-clinnet>
  297. 302.18 s gammaloop-nextest-clinnet>
  298. 302.18 s gammaloop-nextest-clinnet> Typst stderr:
  299. 302.18 s gammaloop-nextest-clinnet>
  300. 302.18 s gammaloop-nextest-clinnet>
  301. 302.18 s gammaloop-nextest-clinnet> Location:
  302. 302.18 s gammaloop-nextest-clinnet> crates/clinnet/src/lib.rs:741:13
  303. 302.18 s gammaloop-nextest-clinnet> stack backtrace:
  304. 302.18 s gammaloop-nextest-clinnet> 0: __rustc::rust_begin_unwind
  305. 302.18 s gammaloop-nextest-clinnet> 1: core::panicking::panic_fmt
  306. 302.18 s gammaloop-nextest-clinnet> 2: core::result::unwrap_failed
  307. 302.18 s gammaloop-nextest-clinnet> 3: public_typst_behavior::render
  308. 302.18 s gammaloop-nextest-clinnet> 4: <std::sync::once::Once>::call_once_force::<<std::sync::once_lock::OnceLock<alloc::string::String>>::initialize<<std::sync::once_lock::OnceLock<alloc::string::String>>::get_or_init<public_typst_behavior::linnest_public_svg::{closure#0}>::{closure#0}, !>::{closure#0}>::{closure#0}
  309. 302.18 s gammaloop-nextest-clinnet> 5: <std::sys::sync::once::futex::Once>::call
  310. 302.18 s gammaloop-nextest-clinnet> 6: <std::sync::once_lock::OnceLock<alloc::string::String>>::initialize::<<std::sync::once_lock::OnceLock<alloc::string::String>>::get_or_init<public_typst_behavior::linnest_public_svg::{closure#0}>::{closure#0}, !>
  311. 302.18 s gammaloop-nextest-clinnet> 7: <public_typst_behavior::public_linnest_endpoint_anchor_distances_stay_local::{closure#0} as core::ops::function::FnOnce<()>>::call_once
  312. 302.18 s gammaloop-nextest-clinnet> note: Some details are omitted, run with `RUST_BACKTRACE=full` for a verbose backtrace.
  313. 302.18 s gammaloop-nextest-clinnet> system-out
  314. 302.18 s gammaloop-nextest-clinnet> running 1 test
  315. 302.18 s gammaloop-nextest-clinnet> test public_linnest_endpoint_anchor_distances_stay_local has been running for over 60 seconds
  316. 302.18 s gammaloop-nextest-clinnet> test public_linnest_endpoint_anchor_distances_stay_local ... FAILED
  317. 302.18 s gammaloop-nextest-clinnet>
  318. 302.18 s gammaloop-nextest-clinnet> failures:
  319. 302.18 s gammaloop-nextest-clinnet>
  320. 302.18 s gammaloop-nextest-clinnet> failures:
  321. 302.18 s gammaloop-nextest-clinnet> public_linnest_endpoint_anchor_distances_stay_local
  322. 302.18 s gammaloop-nextest-clinnet>
  323. 302.18 s gammaloop-nextest-clinnet> test result: FAILED. 0 passed; 1 failed; 0 ignored; 0 measured; 17 filtered out; finished in 178.79s
  324. 302.18 s gammaloop-nextest-clinnet> system-err
  325. 302.18 s gammaloop-nextest-clinnet> thread 'public_linnest_endpoint_anchor_distances_stay_local' (288) panicked at crates/clinnet/tests/public_typst_behavior.rs:81:55:
  326. 302.18 s gammaloop-nextest-clinnet> called `Result::unwrap()` on an `Err` value: typst failed while compiling template /build/.tmpt0rSrq/.clinnet/templates/linnest-public-behavior.svg
  327. 302.18 s gammaloop-nextest-clinnet>
  328. 302.18 s gammaloop-nextest-clinnet> Command executed:
  329. 302.18 s gammaloop-nextest-clinnet> "typst" "c" "/build/.tmpt0rSrq/.clinnet/templates/linnest-public-behavior.typ" "/build/.tmpt0rSrq/.clinnet/templates/linnest-public-behavior.svg" "--root" "/build/.tmpt0rSrq/.clinnet/templates"
  330. 302.18 s gammaloop-nextest-clinnet>
  331. 302.18 s gammaloop-nextest-clinnet> Typst stdout:
  332. 302.18 s gammaloop-nextest-clinnet>
  333. 302.18 s gammaloop-nextest-clinnet>
  334. 302.18 s gammaloop-nextest-clinnet> Typst stderr:
  335. 302.18 s gammaloop-nextest-clinnet>
  336. 302.18 s gammaloop-nextest-clinnet>
  337. 302.18 s gammaloop-nextest-clinnet> Location:
  338. 302.18 s gammaloop-nextest-clinnet> crates/clinnet/src/lib.rs:741:13
  339. 302.18 s gammaloop-nextest-clinnet> stack backtrace:
  340. 302.18 s gammaloop-nextest-clinnet> 0: __rustc::rust_begin_unwind
  341. 302.18 s gammaloop-nextest-clinnet> 1: core::panicking::panic_fmt
  342. 302.18 s gammaloop-nextest-clinnet> 2: core::result::unwrap_failed
  343. 302.18 s gammaloop-nextest-clinnet> 3: public_typst_behavior::render
  344. 302.18 s gammaloop-nextest-clinnet> 4: <std::sync::once::Once>::call_once_force::<<std::sync::once_lock::OnceLock<alloc::string::String>>::initialize<<std::sync::once_lock::OnceLock<alloc::string::String>>::get_or_init<public_typst_behavior::linnest_public_svg::{closure#0}>::{closure#0}, !>::{closure#0}>::{closure#0}
  345. 302.19 s gammaloop-nextest-clinnet> 5: <std::sys::sync::once::futex::Once>::call
  346. 302.19 s gammaloop-nextest-clinnet> 6: <std::sync::once_lock::OnceLock<alloc::string::String>>::initialize::<<std::sync::once_lock::OnceLock<alloc::string::String>>::get_or_init<public_typst_behavior::linnest_public_svg::{closure#0}>::{closure#0}, !>
  347. 302.19 s gammaloop-nextest-clinnet> 7: <public_typst_behavior::public_linnest_endpoint_anchor_distances_stay_local::{closure#0} as core::ops::function::FnOnce<()>>::call_once
  348. 302.19 s gammaloop-nextest-clinnet> note: Some details are omitted, run with `RUST_BACKTRACE=full` for a verbose backtrace.
  349. 302.19 s gammaloop-nextest-clinnet>
  350. 302.19 s gammaloop-nextest-clinnet> 2. clinnet::public_typst_behavior::public_linnest_overlays_follow_the_unit
  351. 302.19 s gammaloop-nextest-clinnet> failure: test failure with exit code 101
  352. 302.19 s gammaloop-nextest-clinnet> thread 'public_linnest_overlays_follow_the_unit' (316) panicked at crates/clinnet/tests/public_typst_behavior.rs:81:55:
  353. 302.19 s gammaloop-nextest-clinnet> called `Result::unwrap()` on an `Err` value: typst failed while compiling template /build/.tmp222iZw/.clinnet/templates/linnest-public-behavior.svg
  354. 302.19 s gammaloop-nextest-clinnet>
  355. 302.19 s gammaloop-nextest-clinnet> Command executed:
  356. 302.19 s gammaloop-nextest-clinnet> "typst" "c" "/build/.tmp222iZw/.clinnet/templates/linnest-public-behavior.typ" "/build/.tmp222iZw/.clinnet/templates/linnest-public-behavior.svg" "--root" "/build/.tmp222iZw/.clinnet/templates"
  357. 302.19 s gammaloop-nextest-clinnet>
  358. 302.19 s gammaloop-nextest-clinnet> Typst stdout:
  359. 302.19 s gammaloop-nextest-clinnet>
  360. 302.19 s gammaloop-nextest-clinnet>
  361. 302.19 s gammaloop-nextest-clinnet> Typst stderr:
  362. 302.19 s gammaloop-nextest-clinnet>
  363. 302.19 s gammaloop-nextest-clinnet>
  364. 302.19 s gammaloop-nextest-clinnet> Location:
  365. 302.19 s gammaloop-nextest-clinnet> crates/clinnet/src/lib.rs:741:13
  366. 302.19 s gammaloop-nextest-clinnet> stack backtrace:
  367. 302.19 s gammaloop-nextest-clinnet> 0: __rustc::rust_begin_unwind
  368. 302.19 s gammaloop-nextest-clinnet> 1: core::panicking::panic_fmt
  369. 302.19 s gammaloop-nextest-clinnet> 2: core::result::unwrap_failed
  370. 302.19 s gammaloop-nextest-clinnet> 3: public_typst_behavior::render
  371. 302.19 s gammaloop-nextest-clinnet> 4: <std::sync::once::Once>::call_once_force::<<std::sync::once_lock::OnceLock<alloc::string::String>>::initialize<<std::sync::once_lock::OnceLock<alloc::string::String>>::get_or_init<public_typst_behavior::linnest_public_svg::{closure#0}>::{closure#0}, !>::{closure#0}>::{closure#0}
  372. 302.19 s gammaloop-nextest-clinnet> 5: <std::sys::sync::once::futex::Once>::call
  373. 302.19 s gammaloop-nextest-clinnet> 6: <std::sync::once_lock::OnceLock<alloc::string::String>>::initialize::<<std::sync::once_lock::OnceLock<alloc::string::String>>::get_or_init<public_typst_behavior::linnest_public_svg::{closure#0}>::{closure#0}, !>
  374. 302.19 s gammaloop-nextest-clinnet> 7: <public_typst_behavior::public_linnest_overlays_follow_the_unit::{closure#0} as core::ops::function::FnOnce<()>>::call_once
  375. 302.19 s gammaloop-nextest-clinnet> note: Some details are omitted, run with `RUST_BACKTRACE=full` for a verbose backtrace.
  376. 302.19 s gammaloop-nextest-clinnet> system-out
  377. 302.19 s gammaloop-nextest-clinnet> running 1 test
  378. 302.19 s gammaloop-nextest-clinnet> test public_linnest_overlays_follow_the_unit has been running for over 60 seconds
  379. 302.19 s gammaloop-nextest-clinnet> test public_linnest_overlays_follow_the_unit ... FAILED
  380. 302.19 s gammaloop-nextest-clinnet>
  381. 302.19 s gammaloop-nextest-clinnet> failures:
  382. 302.19 s gammaloop-nextest-clinnet>
  383. 302.19 s gammaloop-nextest-clinnet> failures:
  384. 302.19 s gammaloop-nextest-clinnet> public_linnest_overlays_follow_the_unit
  385. 302.19 s gammaloop-nextest-clinnet>
  386. 302.19 s gammaloop-nextest-clinnet> test result: FAILED. 0 passed; 1 failed; 0 ignored; 0 measured; 17 filtered out; finished in 184.36s
  387. 302.19 s gammaloop-nextest-clinnet> system-err
  388. 302.19 s gammaloop-nextest-clinnet> thread 'public_linnest_overlays_follow_the_unit' (316) panicked at crates/clinnet/tests/public_typst_behavior.rs:81:55:
  389. 302.19 s gammaloop-nextest-clinnet> called `Result::unwrap()` on an `Err` value: typst failed while compiling template /build/.tmp222iZw/.clinnet/templates/linnest-public-behavior.svg
  390. 302.19 s gammaloop-nextest-clinnet>
  391. 302.19 s gammaloop-nextest-clinnet> Command executed:
  392. 302.19 s gammaloop-nextest-clinnet> "typst" "c" "/build/.tmp222iZw/.clinnet/templates/linnest-public-behavior.typ" "/build/.tmp222iZw/.clinnet/templates/linnest-public-behavior.svg" "--root" "/build/.tmp222iZw/.clinnet/templates"
  393. 302.19 s gammaloop-nextest-clinnet>
  394. 302.19 s gammaloop-nextest-clinnet> Typst stdout:
  395. 302.19 s gammaloop-nextest-clinnet>
  396. 302.19 s gammaloop-nextest-clinnet>
  397. 302.19 s gammaloop-nextest-clinnet> Typst stderr:
  398. 302.19 s gammaloop-nextest-clinnet>
  399. 302.19 s gammaloop-nextest-clinnet>
  400. 302.19 s gammaloop-nextest-clinnet> Location:
  401. 302.19 s gammaloop-nextest-clinnet> crates/clinnet/src/lib.rs:741:13
  402. 302.19 s gammaloop-nextest-clinnet> stack backtrace:
  403. 302.19 s gammaloop-nextest-clinnet> 0: __rustc::rust_begin_unwind
  404. 302.19 s gammaloop-nextest-clinnet> 1: core::panicking::panic_fmt
  405. 302.19 s gammaloop-nextest-clinnet> 2: core::result::unwrap_failed
  406. 302.19 s gammaloop-nextest-clinnet> 3: public_typst_behavior::render
  407. 302.19 s gammaloop-nextest-clinnet> 4: <std::sync::once::Once>::call_once_force::<<std::sync::once_lock::OnceLock<alloc::string::String>>::initialize<<std::sync::once_lock::OnceLock<alloc::string::String>>::get_or_init<public_typst_behavior::linnest_public_svg::{closure#0}>::{closure#0}, !>::{closure#0}>::{closure#0}
  408. 302.19 s gammaloop-nextest-clinnet> 5: <std::sys::sync::once::futex::Once>::call
  409. 302.19 s gammaloop-nextest-clinnet> 6: <std::sync::once_lock::OnceLock<alloc::string::String>>::initialize::<<std::sync::once_lock::OnceLock<alloc::string::String>>::get_or_init<public_typst_behavior::linnest_public_svg::{closure#0}>::{closure#0}, !>
  410. 302.19 s gammaloop-nextest-clinnet> 7: <public_typst_behavior::public_linnest_overlays_follow_the_unit::{closure#0} as core::ops::function::FnOnce<()>>::call_once
  411. 302.19 s gammaloop-nextest-clinnet> note: Some details are omitted, run with `RUST_BACKTRACE=full` for a verbose backtrace.
  412. 302.19 s gammaloop-nextest-clinnet>
  413. 302.19 s gammaloop-nextest-clinnet> 3. clinnet::public_typst_behavior::public_linnest_fixture_assertions_hold
  414. 302.19 s gammaloop-nextest-clinnet> failure: test failure with exit code 101
  415. 302.19 s gammaloop-nextest-clinnet> thread 'public_linnest_fixture_assertions_hold' (291) panicked at crates/clinnet/tests/public_typst_behavior.rs:81:55:
  416. 302.19 s gammaloop-nextest-clinnet> called `Result::unwrap()` on an `Err` value: typst failed while compiling template /build/.tmpR0Vm3q/.clinnet/templates/linnest-public-behavior.svg
  417. 302.19 s gammaloop-nextest-clinnet>
  418. 302.19 s gammaloop-nextest-clinnet> Command executed:
  419. 302.19 s gammaloop-nextest-clinnet> "typst" "c" "/build/.tmpR0Vm3q/.clinnet/templates/linnest-public-behavior.typ" "/build/.tmpR0Vm3q/.clinnet/templates/linnest-public-behavior.svg" "--root" "/build/.tmpR0Vm3q/.clinnet/templates"
  420. 302.19 s gammaloop-nextest-clinnet>
  421. 302.19 s gammaloop-nextest-clinnet> Typst stdout:
  422. 302.19 s gammaloop-nextest-clinnet>
  423. 302.19 s gammaloop-nextest-clinnet>
  424. 302.19 s gammaloop-nextest-clinnet> Typst stderr:
  425. 302.19 s gammaloop-nextest-clinnet>
  426. 302.19 s gammaloop-nextest-clinnet>
  427. 302.19 s gammaloop-nextest-clinnet> Location:
  428. 302.19 s gammaloop-nextest-clinnet> crates/clinnet/src/lib.rs:741:13
  429. 302.19 s gammaloop-nextest-clinnet> stack backtrace:
  430. 302.19 s gammaloop-nextest-clinnet> 0: __rustc::rust_begin_unwind
  431. 302.19 s gammaloop-nextest-clinnet> 1: core::panicking::panic_fmt
  432. 302.19 s gammaloop-nextest-clinnet> 2: core::result::unwrap_failed
  433. 302.19 s gammaloop-nextest-clinnet> 3: public_typst_behavior::render
  434. 302.19 s gammaloop-nextest-clinnet> 4: <std::sync::once::Once>::call_once_force::<<std::sync::once_lock::OnceLock<alloc::string::String>>::initialize<<std::sync::once_lock::OnceLock<alloc::string::String>>::get_or_init<public_typst_behavior::linnest_public_svg::{closure#0}>::{closure#0}, !>::{closure#0}>::{closure#0}
  435. 302.19 s gammaloop-nextest-clinnet> 5: <std::sys::sync::once::futex::Once>::call
  436. 302.19 s gammaloop-nextest-clinnet> 6: <std::sync::once_lock::OnceLock<alloc::string::String>>::initialize::<<std::sync::once_lock::OnceLock<alloc::string::String>>::get_or_init<public_typst_behavior::linnest_public_svg::{closure#0}>::{closure#0}, !>
  437. 302.19 s gammaloop-nextest-clinnet> 7: <public_typst_behavior::public_linnest_fixture_assertions_hold::{closure#0} as core::ops::function::FnOnce<()>>::call_once
  438. 302.19 s gammaloop-nextest-clinnet> note: Some details are omitted, run with `RUST_BACKTRACE=full` for a verbose backtrace.
  439. 302.19 s gammaloop-nextest-clinnet> system-out
  440. 302.19 s gammaloop-nextest-clinnet> running 1 test
  441. 302.19 s gammaloop-nextest-clinnet> test public_linnest_fixture_assertions_hold has been running for over 60 seconds
  442. 302.19 s gammaloop-nextest-clinnet> test public_linnest_fixture_assertions_hold ... FAILED
  443. 302.19 s gammaloop-nextest-clinnet>
  444. 302.19 s gammaloop-nextest-clinnet> failures:
  445. 302.19 s gammaloop-nextest-clinnet>
  446. 302.19 s gammaloop-nextest-clinnet> failures:
  447. 302.19 s gammaloop-nextest-clinnet> public_linnest_fixture_assertions_hold
  448. 302.19 s gammaloop-nextest-clinnet>
  449. 302.19 s gammaloop-nextest-clinnet> test result: FAILED. 0 passed; 1 failed; 0 ignored; 0 measured; 17 filtered out; finished in 197.36s
  450. 302.19 s gammaloop-nextest-clinnet> system-err
  451. 302.19 s gammaloop-nextest-clinnet> thread 'public_linnest_fixture_assertions_hold' (291) panicked at crates/clinnet/tests/public_typst_behavior.rs:81:55:
  452. 302.19 s gammaloop-nextest-clinnet> called `Result::unwrap()` on an `Err` value: typst failed while compiling template /build/.tmpR0Vm3q/.clinnet/templates/linnest-public-behavior.svg
  453. 302.19 s gammaloop-nextest-clinnet>
  454. 302.19 s gammaloop-nextest-clinnet> Command executed:
  455. 302.19 s gammaloop-nextest-clinnet> "typst" "c" "/build/.tmpR0Vm3q/.clinnet/templates/linnest-public-behavior.typ" "/build/.tmpR0Vm3q/.clinnet/templates/linnest-public-behavior.svg" "--root" "/build/.tmpR0Vm3q/.clinnet/templates"
  456. 302.19 s gammaloop-nextest-clinnet>
  457. 302.19 s gammaloop-nextest-clinnet> Typst stdout:
  458. 302.19 s gammaloop-nextest-clinnet>
  459. 302.19 s gammaloop-nextest-clinnet>
  460. 302.19 s gammaloop-nextest-clinnet> Typst stderr:
  461. 302.19 s gammaloop-nextest-clinnet>
  462. 302.19 s gammaloop-nextest-clinnet>
  463. 302.19 s gammaloop-nextest-clinnet> Location:
  464. 302.19 s gammaloop-nextest-clinnet> crates/clinnet/src/lib.rs:741:13
  465. 302.19 s gammaloop-nextest-clinnet> stack backtrace:
  466. 302.19 s gammaloop-nextest-clinnet> 0: __rustc::rust_begin_unwind
  467. 302.19 s gammaloop-nextest-clinnet> 1: core::panicking::panic_fmt
  468. 302.19 s gammaloop-nextest-clinnet> 2: core::result::unwrap_failed
  469. 302.19 s gammaloop-nextest-clinnet> 3: public_typst_behavior::render
  470. 302.19 s gammaloop-nextest-clinnet> 4: <std::sync::once::Once>::call_once_force::<<std::sync::once_lock::OnceLock<alloc::string::String>>::initialize<<std::sync::once_lock::OnceLock<alloc::string::String>>::get_or_init<public_typst_behavior::linnest_public_svg::{closure#0}>::{closure#0}, !>::{closure#0}>::{closure#0}
  471. 302.19 s gammaloop-nextest-clinnet> 5: <std::sys::sync::once::futex::Once>::call
  472. 302.19 s gammaloop-nextest-clinnet> 6: <std::sync::once_lock::OnceLock<alloc::string::String>>::initialize::<<std::sync::once_lock::OnceLock<alloc::string::String>>::get_or_init<public_typst_behavior::linnest_public_svg::{closure#0}>::{closure#0}, !>
  473. 302.19 s gammaloop-nextest-clinnet> 7: <public_typst_behavior::public_linnest_fixture_assertions_hold::{closure#0} as core::ops::function::FnOnce<()>>::call_once
  474. 302.19 s gammaloop-nextest-clinnet> note: Some details are omitted, run with `RUST_BACKTRACE=full` for a verbose backtrace.
  475. 302.19 s gammaloop-nextest-clinnet> =========================================
  476. 304.80 s [0/1 built (1 failed)] [0 built (1 failed)]error: Cannot build '/nix/store/4pqspwvh8pi9s2vg9g6mfsggpl9ynwzx-gammaloop-nextest-clinnet.drv'.
  477. 304.80 s Reason: builder failed with exit code 100.
  478. 304.80 s Output paths:
  479. 304.80 s /nix/store/v9zka7gxdrym1pq03r0i4w2q43fgdwcq-gammaloop-nextest-clinnet
  480. 304.80 s Last 449 log lines:
  481. 304.80 s > Nextest worker budget: 16
  482. 304.80 s > Extracting 4 binaries (including 1 non-test binary), 1 build script output directory, and 1 linked path to /build/source
  483. 304.80 s > Extracted 16 files to /build/source in 0.17s
  484. 304.80 s > ------------
  485. 304.80 s > Nextest run ID a3d9598e-0c34-4766-889c-0e9b008e0305 with nextest profile: ci_gammaloop
  486. 304.80 s > Starting 38 tests across 3 binaries
  487. 304.80 s > FAIL [ 178.846s] (32/38) clinnet::public_typst_behavior public_linnest_endpoint_anchor_distances_stay_local
  488. 304.80 s > stdout ---
  489. 304.80 s >
  490. 304.80 s > running 1 test
  491. 304.80 s > test public_linnest_endpoint_anchor_distances_stay_local has been running for over 60 seconds
  492. 304.80 s > test public_linnest_endpoint_anchor_distances_stay_local ... FAILED
  493. 304.80 s >
  494. 304.80 s > failures:
  495. 304.80 s >
  496. 304.80 s > failures:
  497. 304.80 s > public_linnest_endpoint_anchor_distances_stay_local
  498. 304.80 s >
  499. 304.80 s > test result: FAILED. 0 passed; 1 failed; 0 ignored; 0 measured; 17 filtered out; finished in 178.79s
  500. 304.80 s >
  501. 304.80 s > stderr ---
  502. 304.80 s >
  503. 304.80 s > thread 'public_linnest_endpoint_anchor_distances_stay_local' (288) panicked at crates/clinnet/tests/public_typst_behavior.rs:81:55:
  504. 304.80 s > called `Result::unwrap()` on an `Err` value: typst failed while compiling template /build/.tmpt0rSrq/.clinnet/templates/linnest-public-behavior.svg
  505. 304.80 s >
  506. 304.80 s > Command executed:
  507. 304.80 s > "typst" "c" "/build/.tmpt0rSrq/.clinnet/templates/linnest-public-behavior.typ" "/build/.tmpt0rSrq/.clinnet/templates/linnest-public-behavior.svg" "--root" "/build/.tmpt0rSrq/.clinnet/templates"
  508. 304.80 s >
  509. 304.80 s > Typst stdout:
  510. 304.80 s >
  511. 304.80 s >
  512. 304.80 s > Typst stderr:
  513. 304.80 s >
  514. 304.80 s >
  515. 304.80 s > Location:
  516. 304.80 s > crates/clinnet/src/lib.rs:741:13
  517. 304.80 s > stack backtrace:
  518. 304.80 s > 0: __rustc::rust_begin_unwind
  519. 304.80 s > 1: core::panicking::panic_fmt
  520. 304.80 s > 2: core::result::unwrap_failed
  521. 304.80 s > 3: public_typst_behavior::render
  522. 304.80 s > 4: <std::sync::once::Once>::call_once_force::<<std::sync::once_lock::OnceLock<alloc::string::String>>::initialize<<std::sync::once_lock::OnceLock<alloc::string::String>>::get_or_init<public_typst_behavior::linnest_public_svg::{closure#0}>::{closure#0}, !>::{closure#0}>::{closure#0}
  523. 304.80 s > 5: <std::sys::sync::once::futex::Once>::call
  524. 304.80 s > 6: <std::sync::once_lock::OnceLock<alloc::string::String>>::initialize::<<std::sync::once_lock::OnceLock<alloc::string::String>>::get_or_init<public_typst_behavior::linnest_public_svg::{closure#0}>::{closure#0}, !>
  525. 304.80 s > 7: <public_typst_behavior::public_linnest_endpoint_anchor_distances_stay_local::{closure#0} as core::ops::function::FnOnce<()>>::call_once
  526. 304.80 s > note: Some details are omitted, run with `RUST_BACKTRACE=full` for a verbose backtrace.
  527. 304.80 s >
  528. 304.80 s > FAIL [ 184.385s] (33/38) clinnet::public_typst_behavior public_linnest_overlays_follow_the_unit
  529. 304.80 s > stdout ---
  530. 304.80 s >
  531. 304.80 s > running 1 test
  532. 304.80 s > test public_linnest_overlays_follow_the_unit has been running for over 60 seconds
  533. 304.80 s > test public_linnest_overlays_follow_the_unit ... FAILED
  534. 304.80 s >
  535. 304.80 s > failures:
  536. 304.80 s >
  537. 304.80 s > failures:
  538. 304.80 s > public_linnest_overlays_follow_the_unit
  539. 304.80 s >
  540. 304.80 s > test result: FAILED. 0 passed; 1 failed; 0 ignored; 0 measured; 17 filtered out; finished in 184.36s
  541. 304.80 s >
  542. 304.80 s > stderr ---
  543. 304.80 s >
  544. 304.80 s > thread 'public_linnest_overlays_follow_the_unit' (316) panicked at crates/clinnet/tests/public_typst_behavior.rs:81:55:
  545. 304.80 s > called `Result::unwrap()` on an `Err` value: typst failed while compiling template /build/.tmp222iZw/.clinnet/templates/linnest-public-behavior.svg
  546. 304.80 s >
  547. 304.80 s > Command executed:
  548. 304.80 s > "typst" "c" "/build/.tmp222iZw/.clinnet/templates/linnest-public-behavior.typ" "/build/.tmp222iZw/.clinnet/templates/linnest-public-behavior.svg" "--root" "/build/.tmp222iZw/.clinnet/templates"
  549. 304.80 s >
  550. 304.80 s > Typst stdout:
  551. 304.80 s >
  552. 304.80 s >
  553. 304.80 s > Typst stderr:
  554. 304.80 s >
  555. 304.80 s >
  556. 304.80 s > Location:
  557. 304.80 s > crates/clinnet/src/lib.rs:741:13
  558. 304.80 s > stack backtrace:
  559. 304.80 s > 0: __rustc::rust_begin_unwind
  560. 304.80 s > 1: core::panicking::panic_fmt
  561. 304.80 s > 2: core::result::unwrap_failed
  562. 304.80 s > 3: public_typst_behavior::render
  563. 304.80 s > 4: <std::sync::once::Once>::call_once_force::<<std::sync::once_lock::OnceLock<alloc::string::String>>::initialize<<std::sync::once_lock::OnceLock<alloc::string::String>>::get_or_init<public_typst_behavior::linnest_public_svg::{closure#0}>::{closure#0}, !>::{closure#0}>::{closure#0}
  564. 304.80 s > 5: <std::sys::sync::once::futex::Once>::call
  565. 304.80 s > 6: <std::sync::once_lock::OnceLock<alloc::string::String>>::initialize::<<std::sync::once_lock::OnceLock<alloc::string::String>>::get_or_init<public_typst_behavior::linnest_public_svg::{closure#0}>::{closure#0}, !>
  566. 304.80 s > 7: <public_typst_behavior::public_linnest_overlays_follow_the_unit::{closure#0} as core::ops::function::FnOnce<()>>::call_once
  567. 304.80 s > note: Some details are omitted, run with `RUST_BACKTRACE=full` for a verbose backtrace.
  568. 304.80 s >
  569. 304.80 s > FAIL [ 197.409s] (34/38) clinnet::public_typst_behavior public_linnest_fixture_assertions_hold
  570. 304.80 s > stdout ---
  571. 304.80 s >
  572. 304.80 s > running 1 test
  573. 304.80 s > test public_linnest_fixture_assertions_hold has been running for over 60 seconds
  574. 304.80 s > test public_linnest_fixture_assertions_hold ... FAILED
  575. 304.80 s >
  576. 304.80 s > failures:
  577. 304.80 s >
  578. 304.80 s > failures:
  579. 304.80 s > public_linnest_fixture_assertions_hold
  580. 304.80 s >
  581. 304.80 s > test result: FAILED. 0 passed; 1 failed; 0 ignored; 0 measured; 17 filtered out; finished in 197.36s
  582. 304.80 s >
  583. 304.80 s > stderr ---
  584. 304.80 s >
  585. 304.80 s > thread 'public_linnest_fixture_assertions_hold' (291) panicked at crates/clinnet/tests/public_typst_behavior.rs:81:55:
  586. 304.80 s > called `Result::unwrap()` on an `Err` value: typst failed while compiling template /build/.tmpR0Vm3q/.clinnet/templates/linnest-public-behavior.svg
  587. 304.80 s >
  588. 304.80 s > Command executed:
  589. 304.80 s > "typst" "c" "/build/.tmpR0Vm3q/.clinnet/templates/linnest-public-behavior.typ" "/build/.tmpR0Vm3q/.clinnet/templates/linnest-public-behavior.svg" "--root" "/build/.tmpR0Vm3q/.clinnet/templates"
  590. 304.80 s >
  591. 304.80 s > Typst stdout:
  592. 304.80 s >
  593. 304.80 s >
  594. 304.80 s > Typst stderr:
  595. 304.80 s >
  596. 304.80 s >
  597. 304.80 s > Location:
  598. 304.80 s > crates/clinnet/src/lib.rs:741:13
  599. 304.80 s > stack backtrace:
  600. 304.80 s > 0: __rustc::rust_begin_unwind
  601. 304.80 s > 1: core::panicking::panic_fmt
  602. 304.80 s > 2: core::result::unwrap_failed
  603. 304.80 s > 3: public_typst_behavior::render
  604. 304.80 s > 4: <std::sync::once::Once>::call_once_force::<<std::sync::once_lock::OnceLock<alloc::string::String>>::initialize<<std::sync::once_lock::OnceLock<alloc::string::String>>::get_or_init<public_typst_behavior::linnest_public_svg::{closure#0}>::{closure#0}, !>::{closure#0}>::{closure#0}
  605. 304.80 s > 5: <std::sys::sync::once::futex::Once>::call
  606. 304.80 s > 6: <std::sync::once_lock::OnceLock<alloc::string::String>>::initialize::<<std::sync::once_lock::OnceLock<alloc::string::String>>::get_or_init<public_typst_behavior::linnest_public_svg::{closure#0}>::{closure#0}, !>
  607. 304.80 s > 7: <public_typst_behavior::public_linnest_fixture_assertions_hold::{closure#0} as core::ops::function::FnOnce<()>>::call_once
  608. 304.80 s > note: Some details are omitted, run with `RUST_BACKTRACE=full` for a verbose backtrace.
  609. 304.80 s >
  610. 304.80 s > ------------
  611. 304.80 s > Summary [ 217.185s] 38 tests run: 35 passed (4 slow), 3 failed, 0 skipped
  612. 304.80 s > FAIL [ 178.846s] (32/38) clinnet::public_typst_behavior public_linnest_endpoint_anchor_distances_stay_local
  613. 304.80 s > stdout ---
  614. 304.80 s >
  615. 304.80 s > running 1 test
  616. 304.80 s > test public_linnest_endpoint_anchor_distances_stay_local has been running for over 60 seconds
  617. 304.80 s > test public_linnest_endpoint_anchor_distances_stay_local ... FAILED
  618. 304.80 s >
  619. 304.80 s > failures:
  620. 304.80 s >
  621. 304.80 s > failures:
  622. 304.80 s > public_linnest_endpoint_anchor_distances_stay_local
  623. 304.80 s >
  624. 304.80 s > test result: FAILED. 0 passed; 1 failed; 0 ignored; 0 measured; 17 filtered out; finished in 178.79s
  625. 304.80 s >
  626. 304.80 s > stderr ---
  627. 304.80 s >
  628. 304.80 s > thread 'public_linnest_endpoint_anchor_distances_stay_local' (288) panicked at crates/clinnet/tests/public_typst_behavior.rs:81:55:
  629. 304.80 s > called `Result::unwrap()` on an `Err` value: typst failed while compiling template /build/.tmpt0rSrq/.clinnet/templates/linnest-public-behavior.svg
  630. 304.80 s >
  631. 304.80 s > Command executed:
  632. 304.80 s > "typst" "c" "/build/.tmpt0rSrq/.clinnet/templates/linnest-public-behavior.typ" "/build/.tmpt0rSrq/.clinnet/templates/linnest-public-behavior.svg" "--root" "/build/.tmpt0rSrq/.clinnet/templates"
  633. 304.80 s >
  634. 304.80 s > Typst stdout:
  635. 304.80 s >
  636. 304.80 s >
  637. 304.80 s > Typst stderr:
  638. 304.80 s >
  639. 304.80 s >
  640. 304.80 s > Location:
  641. 304.80 s > crates/clinnet/src/lib.rs:741:13
  642. 304.80 s > stack backtrace:
  643. 304.80 s > 0: __rustc::rust_begin_unwind
  644. 304.80 s > 1: core::panicking::panic_fmt
  645. 304.80 s > 2: core::result::unwrap_failed
  646. 304.80 s > 3: public_typst_behavior::render
  647. 304.80 s > 4: <std::sync::once::Once>::call_once_force::<<std::sync::once_lock::OnceLock<alloc::string::String>>::initialize<<std::sync::once_lock::OnceLock<alloc::string::String>>::get_or_init<public_typst_behavior::linnest_public_svg::{closure#0}>::{closure#0}, !>::{closure#0}>::{closure#0}
  648. 304.80 s > 5: <std::sys::sync::once::futex::Once>::call
  649. 304.80 s > 6: <std::sync::once_lock::OnceLock<alloc::string::String>>::initialize::<<std::sync::once_lock::OnceLock<alloc::string::String>>::get_or_init<public_typst_behavior::linnest_public_svg::{closure#0}>::{closure#0}, !>
  650. 304.80 s > 7: <public_typst_behavior::public_linnest_endpoint_anchor_distances_stay_local::{closure#0} as core::ops::function::FnOnce<()>>::call_once
  651. 304.80 s > note: Some details are omitted, run with `RUST_BACKTRACE=full` for a verbose backtrace.
  652. 304.80 s >
  653. 304.80 s > FAIL [ 184.385s] (33/38) clinnet::public_typst_behavior public_linnest_overlays_follow_the_unit
  654. 304.80 s > stdout ---
  655. 304.80 s >
  656. 304.80 s > running 1 test
  657. 304.80 s > test public_linnest_overlays_follow_the_unit has been running for over 60 seconds
  658. 304.80 s > test public_linnest_overlays_follow_the_unit ... FAILED
  659. 304.80 s >
  660. 304.80 s > failures:
  661. 304.80 s >
  662. 304.80 s > failures:
  663. 304.80 s > public_linnest_overlays_follow_the_unit
  664. 304.80 s >
  665. 304.80 s > test result: FAILED. 0 passed; 1 failed; 0 ignored; 0 measured; 17 filtered out; finished in 184.36s
  666. 304.80 s >
  667. 304.80 s > stderr ---
  668. 304.80 s >
  669. 304.80 s > thread 'public_linnest_overlays_follow_the_unit' (316) panicked at crates/clinnet/tests/public_typst_behavior.rs:81:55:
  670. 304.80 s > called `Result::unwrap()` on an `Err` value: typst failed while compiling template /build/.tmp222iZw/.clinnet/templates/linnest-public-behavior.svg
  671. 304.80 s >
  672. 304.80 s > Command executed:
  673. 304.80 s > "typst" "c" "/build/.tmp222iZw/.clinnet/templates/linnest-public-behavior.typ" "/build/.tmp222iZw/.clinnet/templates/linnest-public-behavior.svg" "--root" "/build/.tmp222iZw/.clinnet/templates"
  674. 304.80 s >
  675. 304.80 s > Typst stdout:
  676. 304.80 s >
  677. 304.80 s >
  678. 304.80 s > Typst stderr:
  679. 304.80 s >
  680. 304.80 s >
  681. 304.80 s > Location:
  682. 304.80 s > crates/clinnet/src/lib.rs:741:13
  683. 304.80 s > stack backtrace:
  684. 304.80 s > 0: __rustc::rust_begin_unwind
  685. 304.80 s > 1: core::panicking::panic_fmt
  686. 304.80 s > 2: core::result::unwrap_failed
  687. 304.80 s > 3: public_typst_behavior::render
  688. 304.80 s > 4: <std::sync::once::Once>::call_once_force::<<std::sync::once_lock::OnceLock<alloc::string::String>>::initialize<<std::sync::once_lock::OnceLock<alloc::string::String>>::get_or_init<public_typst_behavior::linnest_public_svg::{closure#0}>::{closure#0}, !>::{closure#0}>::{closure#0}
  689. 304.80 s > 5: <std::sys::sync::once::futex::Once>::call
  690. 304.80 s > 6: <std::sync::once_lock::OnceLock<alloc::string::String>>::initialize::<<std::sync::once_lock::OnceLock<alloc::string::String>>::get_or_init<public_typst_behavior::linnest_public_svg::{closure#0}>::{closure#0}, !>
  691. 304.80 s > 7: <public_typst_behavior::public_linnest_overlays_follow_the_unit::{closure#0} as core::ops::function::FnOnce<()>>::call_once
  692. 304.80 s > note: Some details are omitted, run with `RUST_BACKTRACE=full` for a verbose backtrace.
  693. 304.80 s >
  694. 304.80 s > FAIL [ 197.409s] (34/38) clinnet::public_typst_behavior public_linnest_fixture_assertions_hold
  695. 304.80 s > stdout ---
  696. 304.80 s >
  697. 304.80 s > running 1 test
  698. 304.80 s > test public_linnest_fixture_assertions_hold has been running for over 60 seconds
  699. 304.80 s > test public_linnest_fixture_assertions_hold ... FAILED
  700. 304.80 s >
  701. 304.80 s > failures:
  702. 304.80 s >
  703. 304.80 s > failures:
  704. 304.80 s > public_linnest_fixture_assertions_hold
  705. 304.80 s >
  706. 304.80 s > test result: FAILED. 0 passed; 1 failed; 0 ignored; 0 measured; 17 filtered out; finished in 197.36s
  707. 304.80 s >
  708. 304.80 s > stderr ---
  709. 304.80 s >
  710. 304.80 s > thread 'public_linnest_fixture_assertions_hold' (291) panicked at crates/clinnet/tests/public_typst_behavior.rs:81:55:
  711. 304.80 s > called `Result::unwrap()` on an `Err` value: typst failed while compiling template /build/.tmpR0Vm3q/.clinnet/templates/linnest-public-behavior.svg
  712. 304.80 s >
  713. 304.80 s > Command executed:
  714. 304.80 s > "typst" "c" "/build/.tmpR0Vm3q/.clinnet/templates/linnest-public-behavior.typ" "/build/.tmpR0Vm3q/.clinnet/templates/linnest-public-behavior.svg" "--root" "/build/.tmpR0Vm3q/.clinnet/templates"
  715. 304.80 s >
  716. 304.80 s > Typst stdout:
  717. 304.80 s >
  718. 304.80 s >
  719. 304.80 s > Typst stderr:
  720. 304.80 s >
  721. 304.80 s >
  722. 304.80 s > Location:
  723. 304.80 s > crates/clinnet/src/lib.rs:741:13
  724. 304.80 s > stack backtrace:
  725. 304.80 s > 0: __rustc::rust_begin_unwind
  726. 304.80 s > 1: core::panicking::panic_fmt
  727. 304.80 s > 2: core::result::unwrap_failed
  728. 304.80 s > 3: public_typst_behavior::render
  729. 304.80 s > 4: <std::sync::once::Once>::call_once_force::<<std::sync::once_lock::OnceLock<alloc::string::String>>::initialize<<std::sync::once_lock::OnceLock<alloc::string::String>>::get_or_init<public_typst_behavior::linnest_public_svg::{closure#0}>::{closure#0}, !>::{closure#0}>::{closure#0}
  730. 304.80 s > 5: <std::sys::sync::once::futex::Once>::call
  731. 304.80 s > 6: <std::sync::once_lock::OnceLock<alloc::string::String>>::initialize::<<std::sync::once_lock::OnceLock<alloc::string::String>>::get_or_init<public_typst_behavior::linnest_public_svg::{closure#0}>::{closure#0}, !>
  732. 304.80 s > 7: <public_typst_behavior::public_linnest_fixture_assertions_hold::{closure#0} as core::ops::function::FnOnce<()>>::call_once
  733. 304.80 s > note: Some details are omitted, run with `RUST_BACKTRACE=full` for a verbose backtrace.
  734. 304.80 s >
  735. 304.80 s > error: test run failed
  736. 304.80 s >
  737. 304.80 s > ========== nextest test summary ==========
  738. 304.80 s > report: target/nextest/ci_gammaloop/junit.xml
  739. 304.80 s > tests: 38, failures: 3, errors: 0
  740. 304.80 s >
  741. 304.80 s > 1. clinnet::public_typst_behavior::public_linnest_endpoint_anchor_distances_stay_local
  742. 304.80 s > failure: test failure with exit code 101
  743. 304.80 s > thread 'public_linnest_endpoint_anchor_distances_stay_local' (288) panicked at crates/clinnet/tests/public_typst_behavior.rs:81:55:
  744. 304.80 s > called `Result::unwrap()` on an `Err` value: typst failed while compiling template /build/.tmpt0rSrq/.clinnet/templates/linnest-public-behavior.svg
  745. 304.80 s >
  746. 304.80 s > Command executed:
  747. 304.80 s > "typst" "c" "/build/.tmpt0rSrq/.clinnet/templates/linnest-public-behavior.typ" "/build/.tmpt0rSrq/.clinnet/templates/linnest-public-behavior.svg" "--root" "/build/.tmpt0rSrq/.clinnet/templates"
  748. 304.80 s >
  749. 304.80 s > Typst stdout:
  750. 304.80 s >
  751. 304.80 s >
  752. 304.80 s > Typst stderr:
  753. 304.80 s >
  754. 304.80 s >
  755. 304.80 s > Location:
  756. 304.80 s > crates/clinnet/src/lib.rs:741:13
  757. 304.80 s > stack backtrace:
  758. 304.80 s > 0: __rustc::rust_begin_unwind
  759. 304.80 s > 1: core::panicking::panic_fmt
  760. 304.80 s > 2: core::result::unwrap_failed
  761. 304.80 s > 3: public_typst_behavior::render
  762. 304.80 s > 4: <std::sync::once::Once>::call_once_force::<<std::sync::once_lock::OnceLock<alloc::string::String>>::initialize<<std::sync::once_lock::OnceLock<alloc::string::String>>::get_or_init<public_typst_behavior::linnest_public_svg::{closure#0}>::{closure#0}, !>::{closure#0}>::{closure#0}
  763. 304.80 s > 5: <std::sys::sync::once::futex::Once>::call
  764. 304.80 s > 6: <std::sync::once_lock::OnceLock<alloc::string::String>>::initialize::<<std::sync::once_lock::OnceLock<alloc::string::String>>::get_or_init<public_typst_behavior::linnest_public_svg::{closure#0}>::{closure#0}, !>
  765. 304.80 s > 7: <public_typst_behavior::public_linnest_endpoint_anchor_distances_stay_local::{closure#0} as core::ops::function::FnOnce<()>>::call_once
  766. 304.80 s > note: Some details are omitted, run with `RUST_BACKTRACE=full` for a verbose backtrace.
  767. 304.80 s > system-out
  768. 304.80 s > running 1 test
  769. 304.80 s > test public_linnest_endpoint_anchor_distances_stay_local has been running for over 60 seconds
  770. 304.80 s > test public_linnest_endpoint_anchor_distances_stay_local ... FAILED
  771. 304.80 s >
  772. 304.80 s > failures:
  773. 304.80 s >
  774. 304.80 s > failures:
  775. 304.80 s > public_linnest_endpoint_anchor_distances_stay_local
  776. 304.80 s >
  777. 304.80 s > test result: FAILED. 0 passed; 1 failed; 0 ignored; 0 measured; 17 filtered out; finished in 178.79s
  778. 304.80 s > system-err
  779. 304.81 s > thread 'public_linnest_endpoint_anchor_distances_stay_local' (288) panicked at crates/clinnet/tests/public_typst_behavior.rs:81:55:
  780. 304.81 s > called `Result::unwrap()` on an `Err` value: typst failed while compiling template /build/.tmpt0rSrq/.clinnet/templates/linnest-public-behavior.svg
  781. 304.81 s >
  782. 304.81 s > Command executed:
  783. 304.81 s > "typst" "c" "/build/.tmpt0rSrq/.clinnet/templates/linnest-public-behavior.typ" "/build/.tmpt0rSrq/.clinnet/templates/linnest-public-behavior.svg" "--root" "/build/.tmpt0rSrq/.clinnet/templates"
  784. 304.81 s >
  785. 304.81 s > Typst stdout:
  786. 304.81 s >
  787. 304.81 s >
  788. 304.81 s > Typst stderr:
  789. 304.81 s >
  790. 304.81 s >
  791. 304.81 s > Location:
  792. 304.81 s > crates/clinnet/src/lib.rs:741:13
  793. 304.81 s > stack backtrace:
  794. 304.81 s > 0: __rustc::rust_begin_unwind
  795. 304.81 s > 1: core::panicking::panic_fmt
  796. 304.81 s > 2: core::result::unwrap_failed
  797. 304.81 s > 3: public_typst_behavior::render
  798. 304.81 s > 4: <std::sync::once::Once>::call_once_force::<<std::sync::once_lock::OnceLock<alloc::string::String>>::initialize<<std::sync::once_lock::OnceLock<alloc::string::String>>::get_or_init<public_typst_behavior::linnest_public_svg::{closure#0}>::{closure#0}, !>::{closure#0}>::{closure#0}
  799. 304.81 s > 5: <std::sys::sync::once::futex::Once>::call
  800. 304.81 s > 6: <std::sync::once_lock::OnceLock<alloc::string::String>>::initialize::<<std::sync::once_lock::OnceLock<alloc::string::String>>::get_or_init<public_typst_behavior::linnest_public_svg::{closure#0}>::{closure#0}, !>
  801. 304.81 s > 7: <public_typst_behavior::public_linnest_endpoint_anchor_distances_stay_local::{closure#0} as core::ops::function::FnOnce<()>>::call_once
  802. 304.81 s > note: Some details are omitted, run with `RUST_BACKTRACE=full` for a verbose backtrace.
  803. 304.81 s >
  804. 304.81 s > 2. clinnet::public_typst_behavior::public_linnest_overlays_follow_the_unit
  805. 304.81 s > failure: test failure with exit code 101
  806. 304.81 s > thread 'public_linnest_overlays_follow_the_unit' (316) panicked at crates/clinnet/tests/public_typst_behavior.rs:81:55:
  807. 304.81 s > called `Result::unwrap()` on an `Err` value: typst failed while compiling template /build/.tmp222iZw/.clinnet/templates/linnest-public-behavior.svg
  808. 304.81 s >
  809. 304.81 s > Command executed:
  810. 304.81 s > "typst" "c" "/build/.tmp222iZw/.clinnet/templates/linnest-public-behavior.typ" "/build/.tmp222iZw/.clinnet/templates/linnest-public-behavior.svg" "--root" "/build/.tmp222iZw/.clinnet/templates"
  811. 304.81 s >
  812. 304.81 s > Typst stdout:
  813. 304.81 s >
  814. 304.81 s >
  815. 304.81 s > Typst stderr:
  816. 304.81 s >
  817. 304.81 s >
  818. 304.81 s > Location:
  819. 304.81 s > crates/clinnet/src/lib.rs:741:13
  820. 304.81 s > stack backtrace:
  821. 304.81 s > 0: __rustc::rust_begin_unwind
  822. 304.81 s > 1: core::panicking::panic_fmt
  823. 304.81 s > 2: core::result::unwrap_failed
  824. 304.81 s > 3: public_typst_behavior::render
  825. 304.81 s > 4: <std::sync::once::Once>::call_once_force::<<std::sync::once_lock::OnceLock<alloc::string::String>>::initialize<<std::sync::once_lock::OnceLock<alloc::string::String>>::get_or_init<public_typst_behavior::linnest_public_svg::{closure#0}>::{closure#0}, !>::{closure#0}>::{closure#0}
  826. 304.81 s > 5: <std::sys::sync::once::futex::Once>::call
  827. 304.81 s > 6: <std::sync::once_lock::OnceLock<alloc::string::String>>::initialize::<<std::sync::once_lock::OnceLock<alloc::string::String>>::get_or_init<public_typst_behavior::linnest_public_svg::{closure#0}>::{closure#0}, !>
  828. 304.81 s > 7: <public_typst_behavior::public_linnest_overlays_follow_the_unit::{closure#0} as core::ops::function::FnOnce<()>>::call_once
  829. 304.81 s > note: Some details are omitted, run with `RUST_BACKTRACE=full` for a verbose backtrace.
  830. 304.81 s > system-out
  831. 304.81 s > running 1 test
  832. 304.81 s > test public_linnest_overlays_follow_the_unit has been running for over 60 seconds
  833. 304.81 s > test public_linnest_overlays_follow_the_unit ... FAILED
  834. 304.81 s >
  835. 304.81 s > failures:
  836. 304.81 s >
  837. 304.81 s > failures:
  838. 304.81 s > public_linnest_overlays_follow_the_unit
  839. 304.81 s >
  840. 304.81 s > test result: FAILED. 0 passed; 1 failed; 0 ignored; 0 measured; 17 filtered out; finished in 184.36s
  841. 304.81 s > system-err
  842. 304.81 s > thread 'public_linnest_overlays_follow_the_unit' (316) panicked at crates/clinnet/tests/public_typst_behavior.rs:81:55:
  843. 304.81 s > called `Result::unwrap()` on an `Err` value: typst failed while compiling template /build/.tmp222iZw/.clinnet/templates/linnest-public-behavior.svg
  844. 304.81 s >
  845. 304.81 s > Command executed:
  846. 304.81 s > "typst" "c" "/build/.tmp222iZw/.clinnet/templates/linnest-public-behavior.typ" "/build/.tmp222iZw/.clinnet/templates/linnest-public-behavior.svg" "--root" "/build/.tmp222iZw/.clinnet/templates"
  847. 304.81 s >
  848. 304.81 s > Typst stdout:
  849. 304.81 s >
  850. 304.81 s >
  851. 304.81 s > Typst stderr:
  852. 304.81 s >
  853. 304.81 s >
  854. 304.81 s > Location:
  855. 304.81 s > crates/clinnet/src/lib.rs:741:13
  856. 304.81 s > stack backtrace:
  857. 304.81 s > 0: __rustc::rust_begin_unwind
  858. 304.81 s > 1: core::panicking::panic_fmt
  859. 304.81 s > 2: core::result::unwrap_failed
  860. 304.81 s > 3: public_typst_behavior::render
  861. 304.81 s > 4: <std::sync::once::Once>::call_once_force::<<std::sync::once_lock::OnceLock<alloc::string::String>>::initialize<<std::sync::once_lock::OnceLock<alloc::string::String>>::get_or_init<public_typst_behavior::linnest_public_svg::{closure#0}>::{closure#0}, !>::{closure#0}>::{closure#0}
  862. 304.81 s > 5: <std::sys::sync::once::futex::Once>::call
  863. 304.81 s > 6: <std::sync::once_lock::OnceLock<alloc::string::String>>::initialize::<<std::sync::once_lock::OnceLock<alloc::string::String>>::get_or_init<public_typst_behavior::linnest_public_svg::{closure#0}>::{closure#0}, !>
  864. 304.81 s > 7: <public_typst_behavior::public_linnest_overlays_follow_the_unit::{closure#0} as core::ops::function::FnOnce<()>>::call_once
  865. 304.81 s > note: Some details are omitted, run with `RUST_BACKTRACE=full` for a verbose backtrace.
  866. 304.81 s >
  867. 304.81 s > 3. clinnet::public_typst_behavior::public_linnest_fixture_assertions_hold
  868. 304.81 s > failure: test failure with exit code 101
  869. 304.81 s > thread 'public_linnest_fixture_assertions_hold' (291) panicked at crates/clinnet/tests/public_typst_behavior.rs:81:55:
  870. 304.81 s > called `Result::unwrap()` on an `Err` value: typst failed while compiling template /build/.tmpR0Vm3q/.clinnet/templates/linnest-public-behavior.svg
  871. 304.81 s >
  872. 304.81 s > Command executed:
  873. 304.81 s > "typst" "c" "/build/.tmpR0Vm3q/.clinnet/templates/linnest-public-behavior.typ" "/build/.tmpR0Vm3q/.clinnet/templates/linnest-public-behavior.svg" "--root" "/build/.tmpR0Vm3q/.clinnet/templates"
  874. 304.81 s >
  875. 304.81 s > Typst stdout:
  876. 304.81 s >
  877. 304.81 s >
  878. 304.81 s > Typst stderr:
  879. 304.81 s >
  880. 304.81 s >
  881. 304.81 s > Location:
  882. 304.81 s > crates/clinnet/src/lib.rs:741:13
  883. 304.81 s > stack backtrace:
  884. 304.81 s > 0: __rustc::rust_begin_unwind
  885. 304.81 s > 1: core::panicking::panic_fmt
  886. 304.81 s > 2: core::result::unwrap_failed
  887. 304.81 s > 3: public_typst_behavior::render
  888. 304.81 s > 4: <std::sync::once::Once>::call_once_force::<<std::sync::once_lock::OnceLock<alloc::string::String>>::initialize<<std::sync::once_lock::OnceLock<alloc::string::String>>::get_or_init<public_typst_behavior::linnest_public_svg::{closure#0}>::{closure#0}, !>::{closure#0}>::{closure#0}
  889. 304.81 s > 5: <std::sys::sync::once::futex::Once>::call
  890. 304.81 s > 6: <std::sync::once_lock::OnceLock<alloc::string::String>>::initialize::<<std::sync::once_lock::OnceLock<alloc::string::String>>::get_or_init<public_typst_behavior::linnest_public_svg::{closure#0}>::{closure#0}, !>
  891. 304.81 s > 7: <public_typst_behavior::public_linnest_fixture_assertions_hold::{closure#0} as core::ops::function::FnOnce<()>>::call_once
  892. 304.81 s > note: Some details are omitted, run with `RUST_BACKTRACE=full` for a verbose backtrace.
  893. 304.81 s > system-out
  894. 304.81 s > running 1 test
  895. 304.81 s > test public_linnest_fixture_assertions_hold has been running for over 60 seconds
  896. 304.81 s > test public_linnest_fixture_assertions_hold ... FAILED
  897. 304.81 s >
  898. 304.81 s > failures:
  899. 304.81 s >
  900. 304.81 s > failures:
  901. 304.81 s > public_linnest_fixture_assertions_hold
  902. 304.81 s >
  903. 304.81 s > test result: FAILED. 0 passed; 1 failed; 0 ignored; 0 measured; 17 filtered out; finished in 197.36s
  904. 304.81 s > system-err
  905. 304.81 s > thread 'public_linnest_fixture_assertions_hold' (291) panicked at crates/clinnet/tests/public_typst_behavior.rs:81:55:
  906. 304.81 s > called `Result::unwrap()` on an `Err` value: typst failed while compiling template /build/.tmpR0Vm3q/.clinnet/templates/linnest-public-behavior.svg
  907. 304.81 s >
  908. 304.81 s > Command executed:
  909. 304.81 s > "typst" "c" "/build/.tmpR0Vm3q/.clinnet/templates/linnest-public-behavior.typ" "/build/.tmpR0Vm3q/.clinnet/templates/linnest-public-behavior.svg" "--root" "/build/.tmpR0Vm3q/.clinnet/templates"
  910. 304.81 s >
  911. 304.81 s > Typst stdout:
  912. 304.81 s >
  913. 304.81 s >
  914. 304.81 s > Typst stderr:
  915. 304.81 s >
  916. 304.81 s >
  917. 304.81 s > Location:
  918. 304.81 s > crates/clinnet/src/lib.rs:741:13
  919. 304.81 s > stack backtrace:
  920. 304.81 s > 0: __rustc::rust_begin_unwind
  921. 304.81 s > 1: core::panicking::panic_fmt
  922. 304.81 s > 2: core::result::unwrap_failed
  923. 304.81 s > 3: public_typst_behavior::render
  924. 304.81 s > 4: <std::sync::once::Once>::call_once_force::<<std::sync::once_lock::OnceLock<alloc::string::String>>::initialize<<std::sync::once_lock::OnceLock<alloc::string::String>>::get_or_init<public_typst_behavior::linnest_public_svg::{closure#0}>::{closure#0}, !>::{closure#0}>::{closure#0}
  925. 304.81 s > 5: <std::sys::sync::once::futex::Once>::call
  926. 304.81 s > 6: <std::sync::once_lock::OnceLock<alloc::string::String>>::initialize::<<std::sync::once_lock::OnceLock<alloc::string::String>>::get_or_init<public_typst_behavior::linnest_public_svg::{closure#0}>::{closure#0}, !>
  927. 304.81 s > 7: <public_typst_behavior::public_linnest_fixture_assertions_hold::{closure#0} as core::ops::function::FnOnce<()>>::call_once
  928. 304.81 s > note: Some details are omitted, run with `RUST_BACKTRACE=full` for a verbose backtrace.
  929. 304.81 s > =========================================
  930. 304.81 s For full logs, run:
  931. 304.81 s nix log /nix/store/4pqspwvh8pi9s2vg9g6mfsggpl9ynwzx-gammaloop-nextest-clinnet.drv
  932. 305.42 s Run failed.