test packages.x86_64-linux.nix-ci-check-gammaloop-nextest-clinnet

Reproduce this run
Retry Run
  1. 0.01 s $ /nix/store/bhv6xyvqw6gjs3j488gi1z6wdv18bdpa-coreutils-9.11/bin/timeout --kill-after=15s 7200s /nix/store/bxgja2ppiqi6w2bgn0r07d7mgnl1k6k2-nix-2.34.8/bin/nix --extra-experimental-features nix-command --extra-experimental-features flakes flake clone git+https://github.com/alphal00p/gammaloop --dest /tmp/nix-ci-worker/stable-pwd/repo/
  2. 0.39 s Cloning into '/tmp/nix-ci-worker/stable-pwd/repo'...
  3. 3.05 s remote: Enumerating objects: 145322 remote: Enumerating objects: 162134, done.
  4. 3.30 s remote: Counting objects: 0% (1/16812) remote: Counting objects: 1% (169/16812) remote: Counting objects: 2% (337/16812) remote: Counting objects: 3% (505/16812) remote: Counting objects: 4% (673/16812) remote: Counting objects: 5% (841/16812) remote: Counting objects: 6% (1009/16812) remote: Counting objects: 7% (1177/16812) remote: Counting objects: 8% (1345/16812) remote: Counting objects: 9% (1514/16812) remote: Counting objects: 10% (1682/16812) remote: Counting objects: 11% (1850/16812) remote: Counting objects: 12% (2018/16812) remote: Counting objects: 13% (2186/16812) remote: Counting objects: 14% (2354/16812) remote: Counting objects: 15% (2522/16812) remote: Counting objects: 16% (2690/16812) remote: Counting objects: 17% (2859/16812) remote: Counting objects: 18% (3027/16812) remote: Counting objects: 19% (3195/16812) remote: Counting objects: 20% (3363/16812) remote: Counting objects: 21% (3531/16812) remote: Counting objects: 22% (3699/16812) remote: Counting objects: 23% (3867/16812) remote: Counting objects: 24% (4035/16812) remote: Counting objects: 25% (4203/16812) remote: Counting objects: 26% (4372/16812) remote: Counting objects: 27% (4540/16812) remote: Counting objects: 28% (4708/16812) remote: Counting objects: 29% (4876/16812) remote: Counting objects: 30% (5044/16812) remote: Counting objects: 31% (5212/16812) remote: Counting objects: 32% (5380/16812) remote: Counting objects: 33% (5548/16812) remote: Counting objects: 34% (5717/16812) remote: Counting objects: 35% (5885/16812) remote: Counting objects: 36% (6053/16812) remote: Counting objects: 37% (6221/16812) remote: Counting objects: 38% (6389/16812) remote: Counting objects: 39% (6557/16812) remote: Counting objects: 40% (6725/16812) remote: Counting objects: 41% (6893/16812) remote: Counting objects: 42% (7062/16812) remote: Counting objects: 43% (7230/16812) remote: Counting objects: 44% (7398/16812) remote: Counting objects: 45% (7566/16812) remote: Counting objects: 46% (7734/16812) remote: Counting objects: 47% (7902/16812) remote: Counting objects: 48% (8070/16812) remote: Counting objects: 49% (8238/16812) remote: Counting objects: 50% (8406/16812) remote: Counting objects: 51% (8575/16812) remote: Counting objects: 52% (8743/16812) remote: Counting objects: 53% (8911/16812) remote: Counting objects: 54% (9079/16812) remote: Counting objects: 55% (9247/16812) remote: Counting objects: 56% (9415/16812) remote: Counting objects: 57% (9583/16812) remote: Counting objects: 58% (9751/16812) remote: Counting objects: 59% (9920/16812) remote: Counting objects: 60% (10088/16812) remote: Counting objects: 61% (10256/16812) remote: Counting objects: 62% (10424/16812) remote: Counting objects: 63% (10592/16812) remote: Counting objects: 64% (10760/16812) remote: Counting objects: 65% (10928/16812) remote: Counting objects: 66% (11096/16812) remote: Counting objects: 67% (11265/16812) remote: Counting objects: 68% (11433/16812) remote: Counting objects: 69% (11601/16812) remote: Counting objects: 70% (11769/16812) remote: Counting objects: 71% (11937/16812) remote: Counting objects: 72% (12105/16812) remote: Counting objects: 73% (12273/16812) remote: Counting objects: 74% (12441/16812) remote: Counting objects: 75% (12609/16812) remote: Counting objects: 76% (12778/16812) remote: Counting objects: 77% (12946/16812) remote: Counting objects: 78% (13114/16812) remote: Counting objects: 79% (13282/16812) remote: Counting objects: 80% (13450/16812) remote: Counting objects: 81% (13618/16812) remote: Counting objects: 82% (13786/16812) remote: Counting objects: 83% (13954/16812) remote: Counting objects: 84% (14123/16812) remote: Counting objects: 85% (14291/16812) remote: Counting objects: 86% (14459/16812) remote: Counting objects: 87% (14627/16812) remote: Counting objects: 88% (14795/16812) remote: Counting objects: 89% (14963/16812) remote: Counting objects: 90% (15131/16812) remote: Counting objects: 91% (15299/16812) remote: Counting objects: 92% (15468/16812) remote: Counting objects: 93% (15636/16812) remote: Counting objects: 94% (15804/16812) remote: Counting objects: 95% (15972/16812) remote: Counting objects: 96% (16140/16812) remote: Counting objects: 97% (16308/16812) remote: Counting objects: 98% (16476/16812) remote: Counting objects: 99% (16644/16812) remote: Counting objects: 100% (16812/16812) remote: Counting objects: 100% (16812/16812), done.
  5. 9.05 s remote: Compressing objects: 0% (1/3844) remote: Compressing objects: 1% (39/3844) remote: Compressing objects: 2% (77/3844) remote: Compressing objects: 3% (116/3844) remote: Compressing objects: 4% (154/3844) remote: Compressing objects: 5% (193/3844) remote: Compressing objects: 6% (231/3844) remote: Compressing objects: 7% (270/3844) remote: Compressing objects: 8% (308/3844) remote: Compressing objects: 9% (346/3844) remote: Compressing objects: 10% (385/3844) remote: Compressing objects: 11% (423/3844) remote: Compressing objects: 12% (462/3844) remote: Compressing objects: 12% (490/3844) remote: Compressing objects: 13% (500/3844) remote: Compressing objects: 13% (538/3844) remote: Compressing objects: 14% (539/3844) remote: Compressing objects: 15% (577/3844) remote: Compressing objects: 16% (616/3844) remote: Compressing objects: 16% (625/3844) remote: Compressing objects: 17% (654/3844) remote: Compressing objects: 18% (692/3844) remote: Compressing objects: 19% (731/3844) remote: Compressing objects: 19% (763/3844) remote: Compressing objects: 20% (769/3844) remote: Compressing objects: 21% (808/3844) remote: Compressing objects: 22% (846/3844) remote: Compressing objects: 23% (885/3844) remote: Compressing objects: 24% (923/3844) remote: Compressing objects: 25% (961/3844) remote: Compressing objects: 25% (972/3844) remote: Compressing objects: 26% (1000/3844) remote: Compressing objects: 27% (1038/3844) remote: Compressing objects: 28% (1077/3844) remote: Compressing objects: 29% (1115/3844) remote: Compressing objects: 30% (1154/3844) remote: Compressing objects: 31% (1192/3844) remote: Compressing objects: 32% (1231/3844) remote: Compressing objects: 33% (1269/3844) remote: Compressing objects: 34% (1307/3844) remote: Compressing objects: 35% (1346/3844) remote: Compressing objects: 36% (1384/3844) remote: Compressing objects: 37% (1423/3844) remote: Compressing objects: 38% (1461/3844) remote: Compressing objects: 39% (1500/3844) remote: Compressing objects: 40% (1538/3844) remote: Compressing objects: 41% (1577/3844) remote: Compressing objects: 42% (1615/3844) remote: Compressing objects: 43% (1653/3844) remote: Compressing objects: 44% (1692/3844) remote: Compressing objects: 45% (1730/3844) remote: Compressing objects: 46% (1769/3844) remote: Compressing objects: 47% (1807/3844) remote: Compressing objects: 48% (1846/3844) remote: Compressing objects: 49% (1884/3844) remote: Compressing objects: 50% (1922/3844) remote: Compressing objects: 51% (1961/3844) remote: Compressing objects: 52% (1999/3844) remote: Compressing objects: 53% (2038/3844) remote: Compressing objects: 54% (2076/3844) remote: Compressing objects: 55% (2115/3844) remote: Compressing objects: 56% (2153/3844) remote: Compressing objects: 57% (2192/3844) remote: Compressing objects: 58% (2230/3844) remote: Compressing objects: 59% (2268/3844) remote: Compressing objects: 60% (2307/3844) remote: Compressing objects: 61% (2345/3844) remote: Compressing objects: 62% (2384/3844) remote: Compressing objects: 63% (2422/3844) remote: Compressing objects: 64% (2461/3844) remote: Compressing objects: 65% (2499/3844) remote: Compressing objects: 66% (2538/3844) remote: Compressing objects: 67% (2576/3844) remote: Compressing objects: 68% (2614/3844) remote: Compressing objects: 69% (2653/3844) remote: Compressing objects: 70% (2691/3844) remote: Compressing objects: 71% (2730/3844) remote: Compressing objects: 72% (2768/3844) remote: Compressing objects: 73% (2807/3844) remote: Compressing objects: 74% (2845/3844) remote: Compressing objects: 75% (2883/3844) remote: Compressing objects: 76% (2922/3844) remote: Compressing objects: 77% (2960/3844) remote: Compressing objects: 78% (2999/3844) remote: Compressing objects: 79% (3037/3844) remote: Compressing objects: 80% (3076/3844) remote: Compressing objects: 81% (3114/3844) remote: Compressing objects: 82% (3153/3844) remote: Compressing objects: 83% (3191/3844) remote: Compressing objects: 84% (3229/3844) remote: Compressing objects: 85% (3268/3844) remote: Compressing objects: 86% (3306/3844) remote: Compressing objects: 87% (3345/3844) remote: Compressing objects: 88% (3383/3844) remote: Compressing objects: 89% (3422/3844) remote: Compressing objects: 90% (3460/3844) remote: Compressing objects: 91% (3499/3844) remote: Compressing objects: 92% (3537/3844) remote: Compressing objects: 93% (3575/3844) remote: Compressing objects: 94% (3614/3844) remote: Compressing objects: 95% (3652/3844) remote: Compressing objects: 96% (3691/3844) remote: Compressing objects: 97% (3729/3844) remote: Compressing objects: 98% (3768/3844) remote: Compressing objects: 99% (3806/3844) remote: Compressing objects: 100% (3844/3844) remote: Compressing objects: 100% (3844/3844), done.
  6. 26.17 s Receiving objects: 0% (1/162134) Receiving objects: 1% (1622/162134) Receiving objects: 2% (3243/162134), 14.46 MiB | 28.91 MiB/s Receiving objects: 3% (4865/162134), 14.46 MiB | 28.91 MiB/s Receiving objects: 3% (5911/162134), 28.58 MiB | 28.52 MiB/s Receiving objects: 4% (6486/162134), 28.58 MiB | 28.52 MiB/s Receiving objects: 5% (8107/162134), 28.58 MiB | 28.52 MiB/s Receiving objects: 6% (9729/162134), 28.58 MiB | 28.52 MiB/s Receiving objects: 7% (11350/162134), 43.90 MiB | 29.22 MiB/s Receiving objects: 7% (11667/162134), 58.90 MiB | 29.42 MiB/s Receiving objects: 8% (12971/162134), 58.90 MiB | 29.42 MiB/s Receiving objects: 9% (14593/162134), 58.90 MiB | 29.42 MiB/s Receiving objects: 10% (16214/162134), 58.90 MiB | 29.42 MiB/s Receiving objects: 11% (17835/162134), 73.90 MiB | 29.53 MiB/s Receiving objects: 12% (19457/162134), 73.90 MiB | 29.53 MiB/s Receiving objects: 12% (19624/162134), 80.23 MiB | 26.72 MiB/s Receiving objects: 13% (21078/162134), 80.23 MiB | 26.72 MiB/s Receiving objects: 14% (22699/162134), 80.23 MiB | 26.72 MiB/s Receiving objects: 15% (24321/162134), 80.23 MiB | 26.72 MiB/s Receiving objects: 16% (25942/162134), 80.23 MiB | 26.72 MiB/s Receiving objects: 17% (27563/162134), 80.23 MiB | 26.72 MiB/s Receiving objects: 18% (29185/162134), 80.23 MiB | 26.72 MiB/s Receiving objects: 19% (30806/162134), 80.23 MiB | 26.72 MiB/s Receiving objects: 20% (32427/162134), 80.23 MiB | 26.72 MiB/s Receiving objects: 21% (34049/162134), 80.23 MiB | 26.72 MiB/s Receiving objects: 22% (35670/162134), 80.23 MiB | 26.72 MiB/s Receiving objects: 23% (37291/162134), 80.23 MiB | 26.72 MiB/s Receiving objects: 24% (38913/162134), 80.23 MiB | 26.72 MiB/s Receiving objects: 25% (40534/162134), 80.23 MiB | 26.72 MiB/s Receiving objects: 26% (42155/162134), 80.23 MiB | 26.72 MiB/s Receiving objects: 27% (43777/162134), 92.66 MiB | 26.46 MiB/s Receiving objects: 28% (45398/162134), 92.66 MiB | 26.46 MiB/s Receiving objects: 29% (47019/162134), 92.66 MiB | 26.46 MiB/s Receiving objects: 30% (48641/162134), 92.66 MiB | 26.46 MiB/s Receiving objects: 31% (50262/162134), 92.66 MiB | 26.46 MiB/s Receiving objects: 31% (50765/162134), 109.31 MiB | 27.31 MiB/s Receiving objects: 32% (51883/162134), 109.31 MiB | 27.31 MiB/s Receiving objects: 33% (53505/162134), 109.31 MiB | 27.31 MiB/s Receiving objects: 34% (55126/162134), 109.31 MiB | 27.31 MiB/s Receiving objects: 35% (56747/162134), 109.31 MiB | 27.31 MiB/s Receiving objects: 36% (58369/162134), 122.03 MiB | 27.10 MiB/s Receiving objects: 37% (59990/162134), 122.03 MiB | 27.10 MiB/s Receiving objects: 38% (61611/162134), 122.03 MiB | 27.10 MiB/s Receiving objects: 38% (62179/162134), 122.03 MiB | 27.10 MiB/s Receiving objects: 39% (63233/162134), 135.40 MiB | 26.86 MiB/s Receiving objects: 40% (64854/162134), 135.40 MiB | 26.86 MiB/s Receiving objects: 41% (66475/162134), 135.40 MiB | 26.86 MiB/s Receiving objects: 42% (68097/162134), 135.40 MiB | 26.86 MiB/s Receiving objects: 42% (68210/162134), 162.38 MiB | 26.33 MiB/s Receiving objects: 43% (69718/162134), 162.38 MiB | 26.33 MiB/s Receiving objects: 44% (71339/162134), 162.38 MiB | 26.33 MiB/s Receiving objects: 45% (72961/162134), 162.38 MiB | 26.33 MiB/s Receiving objects: 46% (74582/162134), 162.38 MiB | 26.33 MiB/s Receiving objects: 47% (76203/162134), 176.19 MiB | 26.06 MiB/s Receiving objects: 48% (77825/162134), 176.19 MiB | 26.06 MiB/s Receiving objects: 49% (79446/162134), 176.19 MiB | 26.06 MiB/s Receiving objects: 50% (81067/162134), 176.19 MiB | 26.06 MiB/s Receiving objects: 51% (82689/162134), 176.19 MiB | 26.06 MiB/s Receiving objects: 51% (83407/162134), 176.19 MiB | 26.06 MiB/s Receiving objects: 52% (84310/162134), 190.19 MiB | 25.82 MiB/s Receiving objects: 53% (85932/162134), 190.19 MiB | 25.82 MiB/s Receiving objects: 54% (87553/162134), 190.19 MiB | 25.82 MiB/s Receiving objects: 55% (89174/162134), 190.19 MiB | 25.82 MiB/s Receiving objects: 55% (89771/162134), 219.49 MiB | 28.14 MiB/s Receiving objects: 55% (89807/162134), 249.64 MiB | 28.30 MiB/s Receiving objects: 56% (90796/162134), 249.64 MiB | 28.30 MiB/s Receiving objects: 57% (92417/162134), 249.64 MiB | 28.30 MiB/s Receiving objects: 58% (94038/162134), 265.12 MiB | 28.76 MiB/s Receiving objects: 58% (95190/162134), 281.07 MiB | 29.33 MiB/s Receiving objects: 59% (95660/162134), 281.07 MiB | 29.33 MiB/s Receiving objects: 60% (97281/162134), 281.07 MiB | 29.33 MiB/s Receiving objects: 61% (98902/162134), 281.07 MiB | 29.33 MiB/s Receiving objects: 62% (100524/162134), 297.22 MiB | 29.90 MiB/s Receiving objects: 62% (101149/162134), 297.22 MiB | 29.90 MiB/s Receiving objects: 63% (102145/162134), 313.42 MiB | 30.43 MiB/s Receiving objects: 64% (103766/162134), 313.42 MiB | 30.43 MiB/s Receiving objects: 65% (105388/162134), 313.42 MiB | 30.43 MiB/s Receiving objects: 66% (107009/162134), 313.42 MiB | 30.43 MiB/s Receiving objects: 67% (108630/162134), 313.42 MiB | 30.43 MiB/s Receiving objects: 68% (110252/162134), 313.42 MiB | 30.43 MiB/s Receiving objects: 69% (111873/162134), 313.42 MiB | 30.43 MiB/s Receiving objects: 70% (113494/162134), 330.78 MiB | 31.20 MiB/s Receiving objects: 71% (115116/162134), 330.78 MiB | 31.20 MiB/s Receiving objects: 72% (116737/162134), 330.78 MiB | 31.20 MiB/s Receiving objects: 73% (118358/162134), 330.78 MiB | 31.20 MiB/s Receiving objects: 74% (119980/162134), 330.78 MiB | 31.20 MiB/s Receiving objects: 75% (121601/162134), 330.78 MiB | 31.20 MiB/s Receiving objects: 75% (121638/162134), 330.78 MiB | 31.20 MiB/s Receiving objects: 76% (123222/162134), 347.04 MiB | 31.58 MiB/s Receiving objects: 77% (124844/162134), 347.04 MiB | 31.58 MiB/s Receiving objects: 78% (126465/162134), 362.96 MiB | 31.83 MiB/s Receiving objects: 79% (128086/162134), 362.96 MiB | 31.83 MiB/s Receiving objects: 80% (129708/162134), 362.96 MiB | 31.83 MiB/s Receiving objects: 80% (130170/162134), 379.14 MiB | 32.14 MiB/s Receiving objects: 81% (131329/162134), 379.14 MiB | 32.14 MiB/s Receiving objects: 81% (132731/162134), 411.54 MiB | 32.46 MiB/s Receiving objects: 82% (132950/162134), 411.54 MiB | 32.46 MiB/s Receiving objects: 83% (134572/162134), 411.54 MiB | 32.46 MiB/s Receiving objects: 84% (136193/162134), 427.08 MiB | 32.37 MiB/s Receiving objects: 85% (137814/162134), 427.08 MiB | 32.37 MiB/s Receiving objects: 85% (139057/162134), 427.08 MiB | 32.37 MiB/s Receiving objects: 86% (139436/162134), 427.08 MiB | 32.37 MiB/s Receiving objects: 87% (141057/162134), 459.47 MiB | 32.37 MiB/s Receiving objects: 87% (142474/162134), 459.47 MiB | 32.37 MiB/s Receiving objects: 88% (142678/162134), 459.47 MiB | 32.37 MiB/s Receiving objects: 89% (144300/162134), 475.36 MiB | 32.05 MiB/s Receiving objects: 90% (145921/162134), 475.36 MiB | 32.05 MiB/s Receiving objects: 91% (147542/162134), 475.36 MiB | 32.05 MiB/s Receiving objects: 92% (149164/162134), 475.36 MiB | 32.05 MiB/s Receiving objects: 93% (150785/162134), 475.36 MiB | 32.05 MiB/s Receiving objects: 94% (152406/162134), 475.36 MiB | 32.05 MiB/s Receiving objects: 95% (154028/162134), 475.36 MiB | 32.05 MiB/s Receiving objects: 96% (155649/162134), 475.36 MiB | 32.05 MiB/s Receiving objects: 97% (157270/162134), 475.36 MiB | 32.05 MiB/s Receiving objects: 98% (158892/162134), 475.36 MiB | 32.05 MiB/s Receiving objects: 99% (160513/162134), 491.25 MiB | 32.01 MiB/s Receiving objects: 99% (161148/162134), 491.25 MiB | 32.01 MiB/s remote: Total 162134 (delta 14203), reused 13455 (delta 12950), pack-reused 145322 (from 3)
  7. 26.17 s Receiving objects: 100% (162134/162134), 499.92 MiB | 30.40 MiB/s Receiving objects: 100% (162134/162134), 500.72 MiB | 29.29 MiB/s, done.
  8. 32.67 s Resolving deltas: 0% (0/105841) Resolving deltas: 1% (1059/105841) Resolving deltas: 2% (2117/105841) Resolving deltas: 3% (3176/105841) Resolving deltas: 4% (4234/105841) Resolving deltas: 5% (5293/105841) Resolving deltas: 6% (6351/105841) Resolving deltas: 7% (7409/105841) Resolving deltas: 8% (8468/105841) Resolving deltas: 9% (9526/105841) Resolving deltas: 10% (10585/105841) Resolving deltas: 11% (11643/105841) Resolving deltas: 12% (12701/105841) Resolving deltas: 13% (13760/105841) Resolving deltas: 14% (14818/105841) Resolving deltas: 15% (15877/105841) Resolving deltas: 15% (16138/105841) Resolving deltas: 16% (16936/105841) Resolving deltas: 17% (17993/105841) Resolving deltas: 18% (19052/105841) Resolving deltas: 19% (20110/105841) Resolving deltas: 20% (21169/105841) Resolving deltas: 21% (22227/105841) Resolving deltas: 22% (23286/105841) Resolving deltas: 22% (23645/105841) Resolving deltas: 23% (24344/105841) Resolving deltas: 24% (25402/105841) Resolving deltas: 25% (26461/105841) Resolving deltas: 26% (27519/105841) Resolving deltas: 27% (28578/105841) Resolving deltas: 28% (29636/105841) Resolving deltas: 29% (30694/105841) Resolving deltas: 30% (31753/105841) Resolving deltas: 31% (32811/105841) Resolving deltas: 32% (33870/105841) Resolving deltas: 33% (34928/105841) Resolving deltas: 34% (35986/105841) Resolving deltas: 35% (37045/105841) Resolving deltas: 36% (38103/105841) Resolving deltas: 37% (39162/105841) Resolving deltas: 38% (40220/105841) Resolving deltas: 39% (41280/105841) Resolving deltas: 40% (42337/105841) Resolving deltas: 41% (43395/105841) Resolving deltas: 42% (44454/105841) Resolving deltas: 43% (45512/105841) Resolving deltas: 43% (46538/105841) Resolving deltas: 44% (46571/105841) Resolving deltas: 45% (47629/105841) Resolving deltas: 46% (48687/105841) Resolving deltas: 47% (49746/105841) Resolving deltas: 48% (50804/105841) Resolving deltas: 49% (51863/105841) Resolving deltas: 50% (52921/105841) Resolving deltas: 51% (53981/105841) Resolving deltas: 52% (55038/105841) Resolving deltas: 53% (56096/105841) Resolving deltas: 54% (57155/105841) Resolving deltas: 55% (58213/105841) Resolving deltas: 56% (59271/105841) Resolving deltas: 57% (60330/105841) Resolving deltas: 58% (61388/105841) Resolving deltas: 59% (62448/105841) Resolving deltas: 59% (63137/105841) Resolving deltas: 60% (63505/105841) Resolving deltas: 61% (64564/105841) Resolving deltas: 62% (65622/105841) Resolving deltas: 63% (66680/105841) Resolving deltas: 64% (67739/105841) Resolving deltas: 65% (68797/105841) Resolving deltas: 66% (69856/105841) Resolving deltas: 67% (70914/105841) Resolving deltas: 68% (71972/105841) Resolving deltas: 69% (73031/105841) Resolving deltas: 70% (74089/105841) Resolving deltas: 71% (75148/105841) Resolving deltas: 72% (76206/105841) Resolving deltas: 73% (77264/105841) Resolving deltas: 74% (78323/105841) Resolving deltas: 75% (79381/105841) Resolving deltas: 76% (80440/105841) Resolving deltas: 77% (81498/105841) Resolving deltas: 78% (82556/105841) Resolving deltas: 79% (83615/105841) Resolving deltas: 80% (84673/105841) Resolving deltas: 81% (85732/105841) Resolving deltas: 81% (86127/105841) Resolving deltas: 82% (86790/105841) Resolving deltas: 83% (87849/105841) Resolving deltas: 84% (88907/105841) Resolving deltas: 85% (89965/105841) Resolving deltas: 86% (91024/105841) Resolving deltas: 87% (92082/105841) Resolving deltas: 88% (93141/105841) Resolving deltas: 89% (94199/105841) Resolving deltas: 90% (95257/105841) Resolving deltas: 91% (96316/105841) Resolving deltas: 92% (97374/105841) Resolving deltas: 93% (98433/105841) Resolving deltas: 94% (99492/105841) Resolving deltas: 94% (100221/105841) Resolving deltas: 95% (100550/105841) Resolving deltas: 96% (101608/105841) Resolving deltas: 97% (102666/105841) Resolving deltas: 98% (103726/105841) Resolving deltas: 99% (104783/105841) Resolving deltas: 100% (105841/105841) Resolving deltas: 100% (105841/105841), done.
  9. 34.16 s Fetching commit 1b8d7b36dded9aad41a05d8ce52cedf6617978e8 for codex/ninja-shared-types ...
  10. 34.16 s $ /nix/store/b1wn5clix1mz4vpfih7x9cnj9qfh7c6h-git-2.54.0/bin/git fetch origin 1b8d7b36dded9aad41a05d8ce52cedf6617978e8
  11. 34.88 s From https://github.com/alphal00p/gammaloop
  12. 34.88 s * branch 1b8d7b36dded9aad41a05d8ce52cedf6617978e8 -> FETCH_HEAD
  13. 34.98 s $ /nix/store/bhv6xyvqw6gjs3j488gi1z6wdv18bdpa-coreutils-9.11/bin/timeout --kill-after=15s 7200s /nix/store/b1wn5clix1mz4vpfih7x9cnj9qfh7c6h-git-2.54.0/bin/git -c advice.detachedHead=false checkout 1b8d7b36dded9aad41a05d8ce52cedf6617978e8
  14. 35.75 s HEAD is now at 1b8d7b36d nix-ci: enable NixCI for final review
  15. 35.78 s $ /nix/store/bhv6xyvqw6gjs3j488gi1z6wdv18bdpa-coreutils-9.11/bin/timeout --kill-after=15s 7200s /nix/store/bxgja2ppiqi6w2bgn0r07d7mgnl1k6k2-nix-2.34.8/bin/nix --extra-experimental-features nix-command --extra-experimental-features flakes --log-format internal-json run .#packages.x86_64-linux.nix-ci-check-gammaloop-nextest-clinnet --print-build-logs
  16. 36.27 s warning: ignoring untrusted flake configuration setting 'extra-substituters'.
  17. 36.27 s Pass '--accept-flake-config' to trust it
  18. 36.27 s warning: ignoring untrusted flake configuration setting 'extra-trusted-public-keys'.
  19. 36.27 s Pass '--accept-flake-config' to trust it
  20. 46.00 s
  21. 46.56 s Building /nix/store/wjmi88614qakla0g6gk0571gsbmbh933-nix-ci-check-gammaloop-nextest-clinnet.drv
  22. 46.56 s [nix-ci-check-gammaloop-nextest-clinnet] structuredAttrs is enabled
  23. 46.63 s [nix-ci-check-gammaloop-nextest-clinnet:post-build] Uploading to the NixCI cache: /nix/store/s5p2nyff7f1snijpvjf5jb9jls2rmky5-nix-ci-check-gammaloop-nextest-clinnet
  24. 46.69 s [nix-ci-check-gammaloop-nextest-clinnet:post-build] warning: 'warn-short-path-literals' is deprecated, use 'lint-short-path-literals = ignore' instead
  25. 46.71 s [nix-ci-check-gammaloop-nextest-clinnet:post-build] copying 1 paths...
  26. 46.71 s [nix-ci-check-gammaloop-nextest-clinnet:post-build] copying path '/nix/store/s5p2nyff7f1snijpvjf5jb9jls2rmky5-nix-ci-check-gammaloop-nextest-clinnet' to 'https://cache.nix-ci.com'...
  27. 47.04 s [nix-ci-check-gammaloop-nextest-clinnet:post-build] warning: 'warn-short-path-literals' is deprecated, use 'lint-short-path-literals = ignore' instead
  28. 47.33 s [nix-ci-check-gammaloop-nextest-clinnet:post-build] copying 0 paths...
  29. 47.38 s Uploaded nix-ci-check-gammaloop-nextest-clinnet in 767ms
  30. 47.38 s Progress: 1 of 2 built
  31. 47.38 s Built nix-ci-check-gammaloop-nextest-clinnet in 824ms
  32. 47.38 s Progress: 2 of 2 built
  33. 47.69 s evaluating derivation 'gdo you want to allow configuration setting 'extra-substituters' to be set to 'https://cache.nix-ci.com' (y/N)? do you want to permanently mark this value as untrusted (y/N)? warning: ignoring untrusted flake configuration setting 'extra-substituters'.
  34. 47.69 s Pass '--accept-flake-config' to trust it
  35. 47.69 s do you want to allow configuration setting 'extra-trusted-public-keys' to be set to 'nix-ci:g3xV5BDTLtIBZr/A00IU1x0EtKKlb7YLgBN2SgYgM6A=' (y/N)? do you want to permanently mark this value as untrusted (y/N)? warning: ignoring untrusted flake configuration setting 'extra-trusted-public-keys'.
  36. 47.69 s Pass '--accept-flake-config' to trust it
  37. 60.79 s copying '/nix/store/yjzy evaluating derivation 'g copying '/nix/store/yjzy evaluating derivation 'g copying '/nix/store/yjzy evaluating derivation 'g copying '/nix/store/yjzy evaluating derivation 'g copying '/nix/store/yjzy evaluating derivation 'g copying '/nix/store/yjzy evaluating derivation 'g copying '/nix/store/yjzy evaluating derivation 'g copying '/nix/store/yjzy evaluating derivation 'g copying '/nix/store/yjzy evaluating derivation 'g querying gammaloop-nexte querying info about miss querying gammaloop-nexte [3.5 KiB DL] querying ga [20.7/16.8 KiB DL] query [43.9 KiB DL] querying g [53.7 KiB DL] querying g [55.0 KiB DL] querying i [0/24 built, 0/15 copied [0/23 built, 16/0/74 cop [0/22 built, 16/1/74 cop [0/19 built, 15/7/74 cop [0/18 built, 12/12/74 co [0/18 built, 12/13/74 co [0/16 built, 10/17/74 co [0/13 built, 7/20/74 cop [1/0/11 built, 5/23/74 c [1/0/10 built, 4/25/74 cgammaloop-nextest-binaries-clinnet (post)> Uploading to the NixCI cache: /nix/store/r6d9ks0lpr631mrcy43137c895a0w5ns-gammaloop-nextest-binaries-clinnet
  38. 61.34 s gammaloop-nextest-binaries-clinnet (post)> warning: 'warn-short-path-literals' is deprecated, use 'lint-short-path-literals = ignore' instead
  39. 61.41 s gammaloop-nextest-binaries-clinnet (post)> copying 1 paths...
  40. 61.41 s gammaloop-nextest-binaries-clinnet (post)> copying path '/nix/store/r6d9ks0lpr631mrcy43137c895a0w5ns-gammaloop-nextest-binaries-clinnet' to 'https://cache.nix-ci.com'...
  41. 62.45 s gammaloop-nextest-binaries-clinnet (post)> warning: 'warn-short-path-literals' is deprecated, use 'lint-short-path-literals = ignore' instead
  42. 62.96 s gammaloop-nextest-binaries-clinnet (post)> copying 0 paths...
  43. 64.43 s [1/10 built, 16/29/74 co [1/10 built, 16/30/74 co [1/10 built, 16/33/74 co [1/10 built, 15/37/74 co [1/9 built, 15/39/74 cop [1/9 built, 16/40/74 cop [1/9 built, 15/43/74 cop [1/9 built, 13/48/74 cop [1/9 built, 9/54/74 copi [1/9 built, 6/57/74 copi [1/9 built, 7/62/74 copi [1/9 built, 6/63/74 copi [1/9 built, 6/64/74 copi [1/8 built, 5/65/74 copi [1/1/8 built, 5/65/74 cobuilder.pl> Running phase: patchPhase
  44. 64.43 s builder.pl> Running phase: updateAutotoolsGnuConfigScriptsPhase
  45. 64.45 s builder.pl> Running phase: configurePhase
  46. 64.49 s builder.pl> no configure script, doing nothing
  47. 64.49 s builder.pl> Running phase: buildPhase
  48. 64.54 s builder.pl> Running phase: checkPhase
  49. 64.55 s [1/1/8 built, 5/66/74 cobuilder.pl> Running phase: installPhase
  50. 64.56 s [1/1/7 built, 4/67/74 cobuilder.pl> no Makefile or custom installPhase, doing nothing
  51. 64.57 s builder.pl> Running phase: fixupPhase
  52. 64.58 s builder.pl> shrinking RPATHs of ELF executables and libraries in /nix/store/zzmspl8wdn2a3ancrz8dg3kci887nw6d-builder.pl
  53. 64.58 s builder.pl> checking for references to /build/ in /nix/store/zzmspl8wdn2a3ancrz8dg3kci887nw6d-builder.pl...
  54. 64.61 s builder.pl> patching script interpreter paths in /nix/store/zzmspl8wdn2a3ancrz8dg3kci887nw6d-builder.pl
  55. 64.76 s builder.pl (post)> Uploading to the NixCI cache: /nix/store/zzmspl8wdn2a3ancrz8dg3kci887nw6d-builder.pl
  56. 65.98 s builder.pl (post)> warning: 'warn-short-path-literals' is deprecated, use 'lint-short-path-literals = ignore' instead
  57. 66.25 s builder.pl (post)> copying 0 paths...
  58. 67.35 s builder.pl (post)> warning: 'warn-short-path-literals' is deprecated, use 'lint-short-path-literals = ignore' instead
  59. 67.84 s builder.pl (post)> copying 0 paths...
  60. 68.46 s [2/5 built, 1/71/74 copi [2/5 built, 1/72/74 copi [2/5 built, 1/73/74 copi [2/4 built, 74 copied (6 [1/2/4 built, 74 copied typst> structuredAttrs is enabled
  61. 68.57 s typst> created 10 symlinks in user environment
  62. 68.95 s typst (post)> Uploading to the NixCI cache: /nix/store/5f1a3n27fy3y8pf6snxr2sbzwhk9brr2-typst-0.15.1-env
  63. 69.78 s typst (post)> warning: 'warn-short-path-literals' is deprecated, use 'lint-short-path-literals = ignore' instead
  64. 70.00 s typst (post)> copying 0 paths...
  65. 71.21 s typst (post)> warning: 'warn-short-path-literals' is deprecated, use 'lint-short-path-literals = ignore' instead
  66. 71.76 s typst (post)> copying 0 paths...
  67. 74.36 s [3/5 built, 74 copied (6 [1/3/4 built, 74 copied gammaloop-nextest-clinnet> Nextest worker budget: 16
  68. 74.38 s gammaloop-nextest-clinnet> Extracting 4 binaries (including 1 non-test binary), 1 build script output directory, and 1 linked path to /build/source
  69. 74.52 s gammaloop-nextest-clinnet> Extracted 16 files to /build/source in 0.14s
  70. 74.58 s gammaloop-nextest-clinnet> ------------
  71. 74.58 s gammaloop-nextest-clinnet> Nextest run ID 85d13a61-3752-4607-a14e-488baca52f8e with nextest profile: ci_gammaloop
  72. 74.58 s gammaloop-nextest-clinnet> Starting 38 tests across 3 binaries
  73. 183.56 s gammaloop-nextest-clinnet> FAIL [ 108.876s] (32/38) clinnet::public_typst_behavior public_linnest_labels_follow_their_carriers
  74. 183.56 s gammaloop-nextest-clinnet> stdout ---
  75. 183.56 s gammaloop-nextest-clinnet>
  76. 183.56 s gammaloop-nextest-clinnet> running 1 test
  77. 183.56 s gammaloop-nextest-clinnet> test public_linnest_labels_follow_their_carriers has been running for over 60 seconds
  78. 183.56 s gammaloop-nextest-clinnet> test public_linnest_labels_follow_their_carriers ... FAILED
  79. 183.56 s gammaloop-nextest-clinnet>
  80. 183.56 s gammaloop-nextest-clinnet> failures:
  81. 183.56 s gammaloop-nextest-clinnet>
  82. 183.56 s gammaloop-nextest-clinnet> failures:
  83. 183.56 s gammaloop-nextest-clinnet> public_linnest_labels_follow_their_carriers
  84. 183.56 s gammaloop-nextest-clinnet>
  85. 183.56 s gammaloop-nextest-clinnet> test result: FAILED. 0 passed; 1 failed; 0 ignored; 0 measured; 17 filtered out; finished in 108.86s
  86. 183.56 s gammaloop-nextest-clinnet>
  87. 183.56 s gammaloop-nextest-clinnet> stderr ---
  88. 183.56 s gammaloop-nextest-clinnet>
  89. 183.56 s gammaloop-nextest-clinnet> thread 'public_linnest_labels_follow_their_carriers' (273) panicked at crates/clinnet/tests/public_typst_behavior.rs:81:55:
  90. 183.56 s gammaloop-nextest-clinnet> called `Result::unwrap()` on an `Err` value: typst failed while compiling template /build/.tmpyPEQO4/.clinnet/templates/linnest-public-behavior.svg
  91. 183.56 s gammaloop-nextest-clinnet>
  92. 183.56 s gammaloop-nextest-clinnet> Command executed:
  93. 183.56 s gammaloop-nextest-clinnet> "typst" "c" "/build/.tmpyPEQO4/.clinnet/templates/linnest-public-behavior.typ" "/build/.tmpyPEQO4/.clinnet/templates/linnest-public-behavior.svg" "--root" "/build/.tmpyPEQO4/.clinnet/templates"
  94. 183.56 s gammaloop-nextest-clinnet>
  95. 183.56 s gammaloop-nextest-clinnet> Typst stdout:
  96. 183.56 s gammaloop-nextest-clinnet>
  97. 183.56 s gammaloop-nextest-clinnet>
  98. 183.56 s gammaloop-nextest-clinnet> Typst stderr:
  99. 183.56 s gammaloop-nextest-clinnet>
  100. 183.56 s gammaloop-nextest-clinnet>
  101. 183.56 s gammaloop-nextest-clinnet> Location:
  102. 183.56 s gammaloop-nextest-clinnet> crates/clinnet/src/lib.rs:741:13
  103. 183.56 s gammaloop-nextest-clinnet> stack backtrace:
  104. 183.56 s gammaloop-nextest-clinnet> 0: __rustc::rust_begin_unwind
  105. 183.56 s gammaloop-nextest-clinnet> 1: core::panicking::panic_fmt
  106. 183.56 s gammaloop-nextest-clinnet> 2: core::result::unwrap_failed
  107. 183.56 s gammaloop-nextest-clinnet> 3: public_typst_behavior::render
  108. 183.56 s gammaloop-nextest-clinnet> 4: <std::sync::once::Once>::call_once_force::<<std::sync::once_lock::OnceLock<alloc::string::String>>::initialize<<std::sync::once_lock::OnceLock<alloc::string::String>>::get_or_init<public_typst_behavior::linnest_public_svg::{closure#0}>::{closure#0}, !>::{closure#0}>::{closure#0}
  109. 183.56 s gammaloop-nextest-clinnet> 5: <std::sys::sync::once::futex::Once>::call
  110. 183.56 s gammaloop-nextest-clinnet> 6: <std::sync::once_lock::OnceLock<alloc::string::String>>::initialize::<<std::sync::once_lock::OnceLock<alloc::string::String>>::get_or_init<public_typst_behavior::linnest_public_svg::{closure#0}>::{closure#0}, !>
  111. 183.56 s gammaloop-nextest-clinnet> 7: <public_typst_behavior::public_linnest_labels_follow_their_carriers::{closure#0} as core::ops::function::FnOnce<()>>::call_once
  112. 183.56 s gammaloop-nextest-clinnet> note: Some details are omitted, run with `RUST_BACKTRACE=full` for a verbose backtrace.
  113. 183.56 s gammaloop-nextest-clinnet>
  114. 191.58 s gammaloop-nextest-clinnet> FAIL [ 116.742s] (33/38) clinnet::public_typst_behavior public_linnest_edge_styles_skip_fallbacks
  115. 191.58 s gammaloop-nextest-clinnet> stdout ---
  116. 191.58 s gammaloop-nextest-clinnet>
  117. 191.58 s gammaloop-nextest-clinnet> running 1 test
  118. 191.58 s gammaloop-nextest-clinnet> test public_linnest_edge_styles_skip_fallbacks has been running for over 60 seconds
  119. 191.58 s gammaloop-nextest-clinnet> test public_linnest_edge_styles_skip_fallbacks ... FAILED
  120. 191.58 s gammaloop-nextest-clinnet>
  121. 191.58 s gammaloop-nextest-clinnet> failures:
  122. 191.58 s gammaloop-nextest-clinnet>
  123. 191.58 s gammaloop-nextest-clinnet> failures:
  124. 191.58 s gammaloop-nextest-clinnet> public_linnest_edge_styles_skip_fallbacks
  125. 191.58 s gammaloop-nextest-clinnet>
  126. 191.58 s gammaloop-nextest-clinnet> test result: FAILED. 0 passed; 1 failed; 0 ignored; 0 measured; 17 filtered out; finished in 116.73s
  127. 191.58 s gammaloop-nextest-clinnet>
  128. 191.58 s gammaloop-nextest-clinnet> stderr ---
  129. 191.58 s gammaloop-nextest-clinnet>
  130. 191.58 s gammaloop-nextest-clinnet> thread 'public_linnest_edge_styles_skip_fallbacks' (268) panicked at crates/clinnet/tests/public_typst_behavior.rs:81:55:
  131. 191.58 s gammaloop-nextest-clinnet> called `Result::unwrap()` on an `Err` value: typst failed while compiling template /build/.tmp7ANJKW/.clinnet/templates/linnest-public-behavior.svg
  132. 191.58 s gammaloop-nextest-clinnet>
  133. 191.58 s gammaloop-nextest-clinnet> Command executed:
  134. 191.58 s gammaloop-nextest-clinnet> "typst" "c" "/build/.tmp7ANJKW/.clinnet/templates/linnest-public-behavior.typ" "/build/.tmp7ANJKW/.clinnet/templates/linnest-public-behavior.svg" "--root" "/build/.tmp7ANJKW/.clinnet/templates"
  135. 191.58 s gammaloop-nextest-clinnet>
  136. 191.58 s gammaloop-nextest-clinnet> Typst stdout:
  137. 191.58 s gammaloop-nextest-clinnet>
  138. 191.58 s gammaloop-nextest-clinnet>
  139. 191.58 s gammaloop-nextest-clinnet> Typst stderr:
  140. 191.58 s gammaloop-nextest-clinnet>
  141. 191.58 s gammaloop-nextest-clinnet>
  142. 191.58 s gammaloop-nextest-clinnet> Location:
  143. 191.58 s gammaloop-nextest-clinnet> crates/clinnet/src/lib.rs:741:13
  144. 191.58 s gammaloop-nextest-clinnet> stack backtrace:
  145. 191.58 s gammaloop-nextest-clinnet> 0: __rustc::rust_begin_unwind
  146. 191.58 s gammaloop-nextest-clinnet> 1: core::panicking::panic_fmt
  147. 191.58 s gammaloop-nextest-clinnet> 2: core::result::unwrap_failed
  148. 191.58 s gammaloop-nextest-clinnet> 3: public_typst_behavior::render
  149. 191.58 s gammaloop-nextest-clinnet> 4: <std::sync::once::Once>::call_once_force::<<std::sync::once_lock::OnceLock<alloc::string::String>>::initialize<<std::sync::once_lock::OnceLock<alloc::string::String>>::get_or_init<public_typst_behavior::linnest_public_svg::{closure#0}>::{closure#0}, !>::{closure#0}>::{closure#0}
  150. 191.58 s gammaloop-nextest-clinnet> 5: <std::sys::sync::once::futex::Once>::call
  151. 191.58 s gammaloop-nextest-clinnet> 6: <std::sync::once_lock::OnceLock<alloc::string::String>>::initialize::<<std::sync::once_lock::OnceLock<alloc::string::String>>::get_or_init<public_typst_behavior::linnest_public_svg::{closure#0}>::{closure#0}, !>
  152. 191.58 s gammaloop-nextest-clinnet> 7: <public_typst_behavior::public_linnest_edge_styles_skip_fallbacks::{closure#0} as core::ops::function::FnOnce<()>>::call_once
  153. 191.58 s gammaloop-nextest-clinnet> note: Some details are omitted, run with `RUST_BACKTRACE=full` for a verbose backtrace.
  154. 191.58 s gammaloop-nextest-clinnet>
  155. 213.48 s gammaloop-nextest-clinnet> FAIL [ 138.837s] (34/38) clinnet::public_typst_behavior public_linnest_momentum_layers_place_shafts_and_labels
  156. 213.48 s gammaloop-nextest-clinnet> stdout ---
  157. 213.48 s gammaloop-nextest-clinnet>
  158. 213.48 s gammaloop-nextest-clinnet> running 1 test
  159. 213.48 s gammaloop-nextest-clinnet> test public_linnest_momentum_layers_place_shafts_and_labels has been running for over 60 seconds
  160. 213.48 s gammaloop-nextest-clinnet> test public_linnest_momentum_layers_place_shafts_and_labels ... FAILED
  161. 213.48 s gammaloop-nextest-clinnet>
  162. 213.48 s gammaloop-nextest-clinnet> failures:
  163. 213.48 s gammaloop-nextest-clinnet>
  164. 213.48 s gammaloop-nextest-clinnet> failures:
  165. 213.48 s gammaloop-nextest-clinnet> public_linnest_momentum_layers_place_shafts_and_labels
  166. 213.48 s gammaloop-nextest-clinnet>
  167. 213.48 s gammaloop-nextest-clinnet> test result: FAILED. 0 passed; 1 failed; 0 ignored; 0 measured; 17 filtered out; finished in 138.80s
  168. 213.48 s gammaloop-nextest-clinnet>
  169. 213.48 s gammaloop-nextest-clinnet> stderr ---
  170. 213.48 s gammaloop-nextest-clinnet>
  171. 213.48 s gammaloop-nextest-clinnet> thread 'public_linnest_momentum_layers_place_shafts_and_labels' (291) panicked at crates/clinnet/tests/public_typst_behavior.rs:81:55:
  172. 213.48 s gammaloop-nextest-clinnet> called `Result::unwrap()` on an `Err` value: typst failed while compiling template /build/.tmpLTPDfU/.clinnet/templates/linnest-public-behavior.svg
  173. 213.48 s gammaloop-nextest-clinnet>
  174. 213.48 s gammaloop-nextest-clinnet> Command executed:
  175. 213.48 s gammaloop-nextest-clinnet> "typst" "c" "/build/.tmpLTPDfU/.clinnet/templates/linnest-public-behavior.typ" "/build/.tmpLTPDfU/.clinnet/templates/linnest-public-behavior.svg" "--root" "/build/.tmpLTPDfU/.clinnet/templates"
  176. 213.48 s gammaloop-nextest-clinnet>
  177. 213.48 s gammaloop-nextest-clinnet> Typst stdout:
  178. 213.48 s gammaloop-nextest-clinnet>
  179. 213.48 s gammaloop-nextest-clinnet>
  180. 213.48 s gammaloop-nextest-clinnet> Typst stderr:
  181. 213.48 s gammaloop-nextest-clinnet>
  182. 213.48 s gammaloop-nextest-clinnet>
  183. 213.48 s gammaloop-nextest-clinnet> Location:
  184. 213.48 s gammaloop-nextest-clinnet> crates/clinnet/src/lib.rs:741:13
  185. 213.48 s gammaloop-nextest-clinnet> stack backtrace:
  186. 213.48 s gammaloop-nextest-clinnet> 0: __rustc::rust_begin_unwind
  187. 213.48 s gammaloop-nextest-clinnet> 1: core::panicking::panic_fmt
  188. 213.48 s gammaloop-nextest-clinnet> 2: core::result::unwrap_failed
  189. 213.48 s gammaloop-nextest-clinnet> 3: public_typst_behavior::render
  190. 213.48 s gammaloop-nextest-clinnet> 4: <std::sync::once::Once>::call_once_force::<<std::sync::once_lock::OnceLock<alloc::string::String>>::initialize<<std::sync::once_lock::OnceLock<alloc::string::String>>::get_or_init<public_typst_behavior::linnest_public_svg::{closure#0}>::{closure#0}, !>::{closure#0}>::{closure#0}
  191. 213.48 s gammaloop-nextest-clinnet> 5: <std::sys::sync::once::futex::Once>::call
  192. 213.48 s gammaloop-nextest-clinnet> 6: <std::sync::once_lock::OnceLock<alloc::string::String>>::initialize::<<std::sync::once_lock::OnceLock<alloc::string::String>>::get_or_init<public_typst_behavior::linnest_public_svg::{closure#0}>::{closure#0}, !>
  193. 213.48 s gammaloop-nextest-clinnet> 7: <public_typst_behavior::public_linnest_momentum_layers_place_shafts_and_labels::{closure#0} as core::ops::function::FnOnce<()>>::call_once
  194. 213.48 s gammaloop-nextest-clinnet> note: Some details are omitted, run with `RUST_BACKTRACE=full` for a verbose backtrace.
  195. 213.48 s gammaloop-nextest-clinnet>
  196. 226.67 s gammaloop-nextest-clinnet> ------------
  197. 226.67 s gammaloop-nextest-clinnet> Summary [ 152.092s] 38 tests run: 35 passed (4 slow), 3 failed, 0 skipped
  198. 226.67 s gammaloop-nextest-clinnet> FAIL [ 108.876s] (32/38) clinnet::public_typst_behavior public_linnest_labels_follow_their_carriers
  199. 226.67 s gammaloop-nextest-clinnet> stdout ---
  200. 226.67 s gammaloop-nextest-clinnet>
  201. 226.67 s gammaloop-nextest-clinnet> running 1 test
  202. 226.67 s gammaloop-nextest-clinnet> test public_linnest_labels_follow_their_carriers has been running for over 60 seconds
  203. 226.67 s gammaloop-nextest-clinnet> test public_linnest_labels_follow_their_carriers ... FAILED
  204. 226.67 s gammaloop-nextest-clinnet>
  205. 226.67 s gammaloop-nextest-clinnet> failures:
  206. 226.67 s gammaloop-nextest-clinnet>
  207. 226.67 s gammaloop-nextest-clinnet> failures:
  208. 226.67 s gammaloop-nextest-clinnet> public_linnest_labels_follow_their_carriers
  209. 226.67 s gammaloop-nextest-clinnet>
  210. 226.68 s gammaloop-nextest-clinnet> test result: FAILED. 0 passed; 1 failed; 0 ignored; 0 measured; 17 filtered out; finished in 108.86s
  211. 226.68 s gammaloop-nextest-clinnet>
  212. 226.68 s gammaloop-nextest-clinnet> stderr ---
  213. 226.68 s gammaloop-nextest-clinnet>
  214. 226.68 s gammaloop-nextest-clinnet> thread 'public_linnest_labels_follow_their_carriers' (273) panicked at crates/clinnet/tests/public_typst_behavior.rs:81:55:
  215. 226.68 s gammaloop-nextest-clinnet> called `Result::unwrap()` on an `Err` value: typst failed while compiling template /build/.tmpyPEQO4/.clinnet/templates/linnest-public-behavior.svg
  216. 226.68 s gammaloop-nextest-clinnet>
  217. 226.68 s gammaloop-nextest-clinnet> Command executed:
  218. 226.68 s gammaloop-nextest-clinnet> "typst" "c" "/build/.tmpyPEQO4/.clinnet/templates/linnest-public-behavior.typ" "/build/.tmpyPEQO4/.clinnet/templates/linnest-public-behavior.svg" "--root" "/build/.tmpyPEQO4/.clinnet/templates"
  219. 226.68 s gammaloop-nextest-clinnet>
  220. 226.68 s gammaloop-nextest-clinnet> Typst stdout:
  221. 226.68 s gammaloop-nextest-clinnet>
  222. 226.68 s gammaloop-nextest-clinnet>
  223. 226.68 s gammaloop-nextest-clinnet> Typst stderr:
  224. 226.68 s gammaloop-nextest-clinnet>
  225. 226.68 s gammaloop-nextest-clinnet>
  226. 226.68 s gammaloop-nextest-clinnet> Location:
  227. 226.68 s gammaloop-nextest-clinnet> crates/clinnet/src/lib.rs:741:13
  228. 226.68 s gammaloop-nextest-clinnet> stack backtrace:
  229. 226.68 s gammaloop-nextest-clinnet> 0: __rustc::rust_begin_unwind
  230. 226.68 s gammaloop-nextest-clinnet> 1: core::panicking::panic_fmt
  231. 226.68 s gammaloop-nextest-clinnet> 2: core::result::unwrap_failed
  232. 226.68 s gammaloop-nextest-clinnet> 3: public_typst_behavior::render
  233. 226.68 s gammaloop-nextest-clinnet> 4: <std::sync::once::Once>::call_once_force::<<std::sync::once_lock::OnceLock<alloc::string::String>>::initialize<<std::sync::once_lock::OnceLock<alloc::string::String>>::get_or_init<public_typst_behavior::linnest_public_svg::{closure#0}>::{closure#0}, !>::{closure#0}>::{closure#0}
  234. 226.68 s gammaloop-nextest-clinnet> 5: <std::sys::sync::once::futex::Once>::call
  235. 226.68 s gammaloop-nextest-clinnet> 6: <std::sync::once_lock::OnceLock<alloc::string::String>>::initialize::<<std::sync::once_lock::OnceLock<alloc::string::String>>::get_or_init<public_typst_behavior::linnest_public_svg::{closure#0}>::{closure#0}, !>
  236. 226.68 s gammaloop-nextest-clinnet> 7: <public_typst_behavior::public_linnest_labels_follow_their_carriers::{closure#0} as core::ops::function::FnOnce<()>>::call_once
  237. 226.68 s gammaloop-nextest-clinnet> note: Some details are omitted, run with `RUST_BACKTRACE=full` for a verbose backtrace.
  238. 226.68 s gammaloop-nextest-clinnet>
  239. 226.68 s gammaloop-nextest-clinnet> FAIL [ 116.742s] (33/38) clinnet::public_typst_behavior public_linnest_edge_styles_skip_fallbacks
  240. 226.68 s gammaloop-nextest-clinnet> stdout ---
  241. 226.68 s gammaloop-nextest-clinnet>
  242. 226.68 s gammaloop-nextest-clinnet> running 1 test
  243. 226.68 s gammaloop-nextest-clinnet> test public_linnest_edge_styles_skip_fallbacks has been running for over 60 seconds
  244. 226.68 s gammaloop-nextest-clinnet> test public_linnest_edge_styles_skip_fallbacks ... FAILED
  245. 226.68 s gammaloop-nextest-clinnet>
  246. 226.68 s gammaloop-nextest-clinnet> failures:
  247. 226.68 s gammaloop-nextest-clinnet>
  248. 226.68 s gammaloop-nextest-clinnet> failures:
  249. 226.68 s gammaloop-nextest-clinnet> public_linnest_edge_styles_skip_fallbacks
  250. 226.68 s gammaloop-nextest-clinnet>
  251. 226.68 s gammaloop-nextest-clinnet> test result: FAILED. 0 passed; 1 failed; 0 ignored; 0 measured; 17 filtered out; finished in 116.73s
  252. 226.68 s gammaloop-nextest-clinnet>
  253. 226.68 s gammaloop-nextest-clinnet> stderr ---
  254. 226.68 s gammaloop-nextest-clinnet>
  255. 226.68 s gammaloop-nextest-clinnet> thread 'public_linnest_edge_styles_skip_fallbacks' (268) panicked at crates/clinnet/tests/public_typst_behavior.rs:81:55:
  256. 226.68 s gammaloop-nextest-clinnet> called `Result::unwrap()` on an `Err` value: typst failed while compiling template /build/.tmp7ANJKW/.clinnet/templates/linnest-public-behavior.svg
  257. 226.68 s gammaloop-nextest-clinnet>
  258. 226.68 s gammaloop-nextest-clinnet> Command executed:
  259. 226.68 s gammaloop-nextest-clinnet> "typst" "c" "/build/.tmp7ANJKW/.clinnet/templates/linnest-public-behavior.typ" "/build/.tmp7ANJKW/.clinnet/templates/linnest-public-behavior.svg" "--root" "/build/.tmp7ANJKW/.clinnet/templates"
  260. 226.68 s gammaloop-nextest-clinnet>
  261. 226.68 s gammaloop-nextest-clinnet> Typst stdout:
  262. 226.68 s gammaloop-nextest-clinnet>
  263. 226.68 s gammaloop-nextest-clinnet>
  264. 226.68 s gammaloop-nextest-clinnet> Typst stderr:
  265. 226.68 s gammaloop-nextest-clinnet>
  266. 226.68 s gammaloop-nextest-clinnet>
  267. 226.68 s gammaloop-nextest-clinnet> Location:
  268. 226.68 s gammaloop-nextest-clinnet> crates/clinnet/src/lib.rs:741:13
  269. 226.68 s gammaloop-nextest-clinnet> stack backtrace:
  270. 226.68 s gammaloop-nextest-clinnet> 0: __rustc::rust_begin_unwind
  271. 226.68 s gammaloop-nextest-clinnet> 1: core::panicking::panic_fmt
  272. 226.68 s gammaloop-nextest-clinnet> 2: core::result::unwrap_failed
  273. 226.68 s gammaloop-nextest-clinnet> 3: public_typst_behavior::render
  274. 226.68 s gammaloop-nextest-clinnet> 4: <std::sync::once::Once>::call_once_force::<<std::sync::once_lock::OnceLock<alloc::string::String>>::initialize<<std::sync::once_lock::OnceLock<alloc::string::String>>::get_or_init<public_typst_behavior::linnest_public_svg::{closure#0}>::{closure#0}, !>::{closure#0}>::{closure#0}
  275. 226.68 s gammaloop-nextest-clinnet> 5: <std::sys::sync::once::futex::Once>::call
  276. 226.68 s gammaloop-nextest-clinnet> 6: <std::sync::once_lock::OnceLock<alloc::string::String>>::initialize::<<std::sync::once_lock::OnceLock<alloc::string::String>>::get_or_init<public_typst_behavior::linnest_public_svg::{closure#0}>::{closure#0}, !>
  277. 226.68 s gammaloop-nextest-clinnet> 7: <public_typst_behavior::public_linnest_edge_styles_skip_fallbacks::{closure#0} as core::ops::function::FnOnce<()>>::call_once
  278. 226.68 s gammaloop-nextest-clinnet> note: Some details are omitted, run with `RUST_BACKTRACE=full` for a verbose backtrace.
  279. 226.68 s gammaloop-nextest-clinnet>
  280. 226.68 s gammaloop-nextest-clinnet> FAIL [ 138.837s] (34/38) clinnet::public_typst_behavior public_linnest_momentum_layers_place_shafts_and_labels
  281. 226.68 s gammaloop-nextest-clinnet> stdout ---
  282. 226.68 s gammaloop-nextest-clinnet>
  283. 226.68 s gammaloop-nextest-clinnet> running 1 test
  284. 226.68 s gammaloop-nextest-clinnet> test public_linnest_momentum_layers_place_shafts_and_labels has been running for over 60 seconds
  285. 226.68 s gammaloop-nextest-clinnet> test public_linnest_momentum_layers_place_shafts_and_labels ... FAILED
  286. 226.68 s gammaloop-nextest-clinnet>
  287. 226.68 s gammaloop-nextest-clinnet> failures:
  288. 226.68 s gammaloop-nextest-clinnet>
  289. 226.68 s gammaloop-nextest-clinnet> failures:
  290. 226.68 s gammaloop-nextest-clinnet> public_linnest_momentum_layers_place_shafts_and_labels
  291. 226.68 s gammaloop-nextest-clinnet>
  292. 226.68 s gammaloop-nextest-clinnet> test result: FAILED. 0 passed; 1 failed; 0 ignored; 0 measured; 17 filtered out; finished in 138.80s
  293. 226.68 s gammaloop-nextest-clinnet>
  294. 226.68 s gammaloop-nextest-clinnet> stderr ---
  295. 226.68 s gammaloop-nextest-clinnet>
  296. 226.68 s gammaloop-nextest-clinnet> thread 'public_linnest_momentum_layers_place_shafts_and_labels' (291) panicked at crates/clinnet/tests/public_typst_behavior.rs:81:55:
  297. 226.68 s gammaloop-nextest-clinnet> called `Result::unwrap()` on an `Err` value: typst failed while compiling template /build/.tmpLTPDfU/.clinnet/templates/linnest-public-behavior.svg
  298. 226.68 s gammaloop-nextest-clinnet>
  299. 226.68 s gammaloop-nextest-clinnet> Command executed:
  300. 226.68 s gammaloop-nextest-clinnet> "typst" "c" "/build/.tmpLTPDfU/.clinnet/templates/linnest-public-behavior.typ" "/build/.tmpLTPDfU/.clinnet/templates/linnest-public-behavior.svg" "--root" "/build/.tmpLTPDfU/.clinnet/templates"
  301. 226.68 s gammaloop-nextest-clinnet>
  302. 226.68 s gammaloop-nextest-clinnet> Typst stdout:
  303. 226.68 s gammaloop-nextest-clinnet>
  304. 226.68 s gammaloop-nextest-clinnet>
  305. 226.68 s gammaloop-nextest-clinnet> Typst stderr:
  306. 226.68 s gammaloop-nextest-clinnet>
  307. 226.68 s gammaloop-nextest-clinnet>
  308. 226.68 s gammaloop-nextest-clinnet> Location:
  309. 226.68 s gammaloop-nextest-clinnet> crates/clinnet/src/lib.rs:741:13
  310. 226.68 s gammaloop-nextest-clinnet> stack backtrace:
  311. 226.68 s gammaloop-nextest-clinnet> 0: __rustc::rust_begin_unwind
  312. 226.68 s gammaloop-nextest-clinnet> 1: core::panicking::panic_fmt
  313. 226.68 s gammaloop-nextest-clinnet> 2: core::result::unwrap_failed
  314. 226.68 s gammaloop-nextest-clinnet> 3: public_typst_behavior::render
  315. 226.68 s gammaloop-nextest-clinnet> 4: <std::sync::once::Once>::call_once_force::<<std::sync::once_lock::OnceLock<alloc::string::String>>::initialize<<std::sync::once_lock::OnceLock<alloc::string::String>>::get_or_init<public_typst_behavior::linnest_public_svg::{closure#0}>::{closure#0}, !>::{closure#0}>::{closure#0}
  316. 226.68 s gammaloop-nextest-clinnet> 5: <std::sys::sync::once::futex::Once>::call
  317. 226.68 s gammaloop-nextest-clinnet> 6: <std::sync::once_lock::OnceLock<alloc::string::String>>::initialize::<<std::sync::once_lock::OnceLock<alloc::string::String>>::get_or_init<public_typst_behavior::linnest_public_svg::{closure#0}>::{closure#0}, !>
  318. 226.68 s gammaloop-nextest-clinnet> 7: <public_typst_behavior::public_linnest_momentum_layers_place_shafts_and_labels::{closure#0} as core::ops::function::FnOnce<()>>::call_once
  319. 226.68 s gammaloop-nextest-clinnet> note: Some details are omitted, run with `RUST_BACKTRACE=full` for a verbose backtrace.
  320. 226.68 s gammaloop-nextest-clinnet>
  321. 226.71 s gammaloop-nextest-clinnet> error: test run failed
  322. 227.04 s gammaloop-nextest-clinnet>
  323. 227.04 s gammaloop-nextest-clinnet> ========== nextest test summary ==========
  324. 227.04 s gammaloop-nextest-clinnet> report: target/nextest/ci_gammaloop/junit.xml
  325. 227.04 s gammaloop-nextest-clinnet> tests: 38, failures: 3, errors: 0
  326. 227.04 s gammaloop-nextest-clinnet>
  327. 227.04 s gammaloop-nextest-clinnet> 1. clinnet::public_typst_behavior::public_linnest_labels_follow_their_carriers
  328. 227.04 s gammaloop-nextest-clinnet> failure: test failure with exit code 101
  329. 227.04 s gammaloop-nextest-clinnet> thread 'public_linnest_labels_follow_their_carriers' (273) panicked at crates/clinnet/tests/public_typst_behavior.rs:81:55:
  330. 227.04 s gammaloop-nextest-clinnet> called `Result::unwrap()` on an `Err` value: typst failed while compiling template /build/.tmpyPEQO4/.clinnet/templates/linnest-public-behavior.svg
  331. 227.04 s gammaloop-nextest-clinnet>
  332. 227.04 s gammaloop-nextest-clinnet> Command executed:
  333. 227.04 s gammaloop-nextest-clinnet> "typst" "c" "/build/.tmpyPEQO4/.clinnet/templates/linnest-public-behavior.typ" "/build/.tmpyPEQO4/.clinnet/templates/linnest-public-behavior.svg" "--root" "/build/.tmpyPEQO4/.clinnet/templates"
  334. 227.04 s gammaloop-nextest-clinnet>
  335. 227.04 s gammaloop-nextest-clinnet> Typst stdout:
  336. 227.04 s gammaloop-nextest-clinnet>
  337. 227.04 s gammaloop-nextest-clinnet>
  338. 227.04 s gammaloop-nextest-clinnet> Typst stderr:
  339. 227.04 s gammaloop-nextest-clinnet>
  340. 227.04 s gammaloop-nextest-clinnet>
  341. 227.04 s gammaloop-nextest-clinnet> Location:
  342. 227.04 s gammaloop-nextest-clinnet> crates/clinnet/src/lib.rs:741:13
  343. 227.04 s gammaloop-nextest-clinnet> stack backtrace:
  344. 227.04 s gammaloop-nextest-clinnet> 0: __rustc::rust_begin_unwind
  345. 227.04 s gammaloop-nextest-clinnet> 1: core::panicking::panic_fmt
  346. 227.04 s gammaloop-nextest-clinnet> 2: core::result::unwrap_failed
  347. 227.04 s gammaloop-nextest-clinnet> 3: public_typst_behavior::render
  348. 227.04 s gammaloop-nextest-clinnet> 4: <std::sync::once::Once>::call_once_force::<<std::sync::once_lock::OnceLock<alloc::string::String>>::initialize<<std::sync::once_lock::OnceLock<alloc::string::String>>::get_or_init<public_typst_behavior::linnest_public_svg::{closure#0}>::{closure#0}, !>::{closure#0}>::{closure#0}
  349. 227.04 s gammaloop-nextest-clinnet> 5: <std::sys::sync::once::futex::Once>::call
  350. 227.04 s gammaloop-nextest-clinnet> 6: <std::sync::once_lock::OnceLock<alloc::string::String>>::initialize::<<std::sync::once_lock::OnceLock<alloc::string::String>>::get_or_init<public_typst_behavior::linnest_public_svg::{closure#0}>::{closure#0}, !>
  351. 227.04 s gammaloop-nextest-clinnet> 7: <public_typst_behavior::public_linnest_labels_follow_their_carriers::{closure#0} as core::ops::function::FnOnce<()>>::call_once
  352. 227.04 s gammaloop-nextest-clinnet> note: Some details are omitted, run with `RUST_BACKTRACE=full` for a verbose backtrace.
  353. 227.04 s gammaloop-nextest-clinnet> system-out
  354. 227.04 s gammaloop-nextest-clinnet> running 1 test
  355. 227.04 s gammaloop-nextest-clinnet> test public_linnest_labels_follow_their_carriers has been running for over 60 seconds
  356. 227.04 s gammaloop-nextest-clinnet> test public_linnest_labels_follow_their_carriers ... FAILED
  357. 227.04 s gammaloop-nextest-clinnet>
  358. 227.04 s gammaloop-nextest-clinnet> failures:
  359. 227.04 s gammaloop-nextest-clinnet>
  360. 227.04 s gammaloop-nextest-clinnet> failures:
  361. 227.04 s gammaloop-nextest-clinnet> public_linnest_labels_follow_their_carriers
  362. 227.04 s gammaloop-nextest-clinnet>
  363. 227.04 s gammaloop-nextest-clinnet> test result: FAILED. 0 passed; 1 failed; 0 ignored; 0 measured; 17 filtered out; finished in 108.86s
  364. 227.04 s gammaloop-nextest-clinnet> system-err
  365. 227.04 s gammaloop-nextest-clinnet> thread 'public_linnest_labels_follow_their_carriers' (273) panicked at crates/clinnet/tests/public_typst_behavior.rs:81:55:
  366. 227.04 s gammaloop-nextest-clinnet> called `Result::unwrap()` on an `Err` value: typst failed while compiling template /build/.tmpyPEQO4/.clinnet/templates/linnest-public-behavior.svg
  367. 227.04 s gammaloop-nextest-clinnet>
  368. 227.04 s gammaloop-nextest-clinnet> Command executed:
  369. 227.04 s gammaloop-nextest-clinnet> "typst" "c" "/build/.tmpyPEQO4/.clinnet/templates/linnest-public-behavior.typ" "/build/.tmpyPEQO4/.clinnet/templates/linnest-public-behavior.svg" "--root" "/build/.tmpyPEQO4/.clinnet/templates"
  370. 227.04 s gammaloop-nextest-clinnet>
  371. 227.04 s gammaloop-nextest-clinnet> Typst stdout:
  372. 227.04 s gammaloop-nextest-clinnet>
  373. 227.04 s gammaloop-nextest-clinnet>
  374. 227.04 s gammaloop-nextest-clinnet> Typst stderr:
  375. 227.04 s gammaloop-nextest-clinnet>
  376. 227.04 s gammaloop-nextest-clinnet>
  377. 227.04 s gammaloop-nextest-clinnet> Location:
  378. 227.04 s gammaloop-nextest-clinnet> crates/clinnet/src/lib.rs:741:13
  379. 227.04 s gammaloop-nextest-clinnet> stack backtrace:
  380. 227.04 s gammaloop-nextest-clinnet> 0: __rustc::rust_begin_unwind
  381. 227.04 s gammaloop-nextest-clinnet> 1: core::panicking::panic_fmt
  382. 227.04 s gammaloop-nextest-clinnet> 2: core::result::unwrap_failed
  383. 227.04 s gammaloop-nextest-clinnet> 3: public_typst_behavior::render
  384. 227.04 s gammaloop-nextest-clinnet> 4: <std::sync::once::Once>::call_once_force::<<std::sync::once_lock::OnceLock<alloc::string::String>>::initialize<<std::sync::once_lock::OnceLock<alloc::string::String>>::get_or_init<public_typst_behavior::linnest_public_svg::{closure#0}>::{closure#0}, !>::{closure#0}>::{closure#0}
  385. 227.04 s gammaloop-nextest-clinnet> 5: <std::sys::sync::once::futex::Once>::call
  386. 227.04 s gammaloop-nextest-clinnet> 6: <std::sync::once_lock::OnceLock<alloc::string::String>>::initialize::<<std::sync::once_lock::OnceLock<alloc::string::String>>::get_or_init<public_typst_behavior::linnest_public_svg::{closure#0}>::{closure#0}, !>
  387. 227.04 s gammaloop-nextest-clinnet> 7: <public_typst_behavior::public_linnest_labels_follow_their_carriers::{closure#0} as core::ops::function::FnOnce<()>>::call_once
  388. 227.04 s gammaloop-nextest-clinnet> note: Some details are omitted, run with `RUST_BACKTRACE=full` for a verbose backtrace.
  389. 227.04 s gammaloop-nextest-clinnet>
  390. 227.04 s gammaloop-nextest-clinnet> 2. clinnet::public_typst_behavior::public_linnest_edge_styles_skip_fallbacks
  391. 227.04 s gammaloop-nextest-clinnet> failure: test failure with exit code 101
  392. 227.04 s gammaloop-nextest-clinnet> thread 'public_linnest_edge_styles_skip_fallbacks' (268) panicked at crates/clinnet/tests/public_typst_behavior.rs:81:55:
  393. 227.04 s gammaloop-nextest-clinnet> called `Result::unwrap()` on an `Err` value: typst failed while compiling template /build/.tmp7ANJKW/.clinnet/templates/linnest-public-behavior.svg
  394. 227.04 s gammaloop-nextest-clinnet>
  395. 227.04 s gammaloop-nextest-clinnet> Command executed:
  396. 227.04 s gammaloop-nextest-clinnet> "typst" "c" "/build/.tmp7ANJKW/.clinnet/templates/linnest-public-behavior.typ" "/build/.tmp7ANJKW/.clinnet/templates/linnest-public-behavior.svg" "--root" "/build/.tmp7ANJKW/.clinnet/templates"
  397. 227.04 s gammaloop-nextest-clinnet>
  398. 227.04 s gammaloop-nextest-clinnet> Typst stdout:
  399. 227.04 s gammaloop-nextest-clinnet>
  400. 227.04 s gammaloop-nextest-clinnet>
  401. 227.04 s gammaloop-nextest-clinnet> Typst stderr:
  402. 227.04 s gammaloop-nextest-clinnet>
  403. 227.04 s gammaloop-nextest-clinnet>
  404. 227.04 s gammaloop-nextest-clinnet> Location:
  405. 227.04 s gammaloop-nextest-clinnet> crates/clinnet/src/lib.rs:741:13
  406. 227.04 s gammaloop-nextest-clinnet> stack backtrace:
  407. 227.04 s gammaloop-nextest-clinnet> 0: __rustc::rust_begin_unwind
  408. 227.04 s gammaloop-nextest-clinnet> 1: core::panicking::panic_fmt
  409. 227.04 s gammaloop-nextest-clinnet> 2: core::result::unwrap_failed
  410. 227.04 s gammaloop-nextest-clinnet> 3: public_typst_behavior::render
  411. 227.04 s gammaloop-nextest-clinnet> 4: <std::sync::once::Once>::call_once_force::<<std::sync::once_lock::OnceLock<alloc::string::String>>::initialize<<std::sync::once_lock::OnceLock<alloc::string::String>>::get_or_init<public_typst_behavior::linnest_public_svg::{closure#0}>::{closure#0}, !>::{closure#0}>::{closure#0}
  412. 227.04 s gammaloop-nextest-clinnet> 5: <std::sys::sync::once::futex::Once>::call
  413. 227.04 s gammaloop-nextest-clinnet> 6: <std::sync::once_lock::OnceLock<alloc::string::String>>::initialize::<<std::sync::once_lock::OnceLock<alloc::string::String>>::get_or_init<public_typst_behavior::linnest_public_svg::{closure#0}>::{closure#0}, !>
  414. 227.04 s gammaloop-nextest-clinnet> 7: <public_typst_behavior::public_linnest_edge_styles_skip_fallbacks::{closure#0} as core::ops::function::FnOnce<()>>::call_once
  415. 227.04 s gammaloop-nextest-clinnet> note: Some details are omitted, run with `RUST_BACKTRACE=full` for a verbose backtrace.
  416. 227.04 s gammaloop-nextest-clinnet> system-out
  417. 227.04 s gammaloop-nextest-clinnet> running 1 test
  418. 227.04 s gammaloop-nextest-clinnet> test public_linnest_edge_styles_skip_fallbacks has been running for over 60 seconds
  419. 227.04 s gammaloop-nextest-clinnet> test public_linnest_edge_styles_skip_fallbacks ... FAILED
  420. 227.04 s gammaloop-nextest-clinnet>
  421. 227.04 s gammaloop-nextest-clinnet> failures:
  422. 227.04 s gammaloop-nextest-clinnet>
  423. 227.04 s gammaloop-nextest-clinnet> failures:
  424. 227.04 s gammaloop-nextest-clinnet> public_linnest_edge_styles_skip_fallbacks
  425. 227.04 s gammaloop-nextest-clinnet>
  426. 227.04 s gammaloop-nextest-clinnet> test result: FAILED. 0 passed; 1 failed; 0 ignored; 0 measured; 17 filtered out; finished in 116.73s
  427. 227.04 s gammaloop-nextest-clinnet> system-err
  428. 227.04 s gammaloop-nextest-clinnet> thread 'public_linnest_edge_styles_skip_fallbacks' (268) panicked at crates/clinnet/tests/public_typst_behavior.rs:81:55:
  429. 227.04 s gammaloop-nextest-clinnet> called `Result::unwrap()` on an `Err` value: typst failed while compiling template /build/.tmp7ANJKW/.clinnet/templates/linnest-public-behavior.svg
  430. 227.04 s gammaloop-nextest-clinnet>
  431. 227.04 s gammaloop-nextest-clinnet> Command executed:
  432. 227.04 s gammaloop-nextest-clinnet> "typst" "c" "/build/.tmp7ANJKW/.clinnet/templates/linnest-public-behavior.typ" "/build/.tmp7ANJKW/.clinnet/templates/linnest-public-behavior.svg" "--root" "/build/.tmp7ANJKW/.clinnet/templates"
  433. 227.04 s gammaloop-nextest-clinnet>
  434. 227.04 s gammaloop-nextest-clinnet> Typst stdout:
  435. 227.04 s gammaloop-nextest-clinnet>
  436. 227.04 s gammaloop-nextest-clinnet>
  437. 227.04 s gammaloop-nextest-clinnet> Typst stderr:
  438. 227.04 s gammaloop-nextest-clinnet>
  439. 227.04 s gammaloop-nextest-clinnet>
  440. 227.04 s gammaloop-nextest-clinnet> Location:
  441. 227.04 s gammaloop-nextest-clinnet> crates/clinnet/src/lib.rs:741:13
  442. 227.04 s gammaloop-nextest-clinnet> stack backtrace:
  443. 227.04 s gammaloop-nextest-clinnet> 0: __rustc::rust_begin_unwind
  444. 227.04 s gammaloop-nextest-clinnet> 1: core::panicking::panic_fmt
  445. 227.04 s gammaloop-nextest-clinnet> 2: core::result::unwrap_failed
  446. 227.04 s gammaloop-nextest-clinnet> 3: public_typst_behavior::render
  447. 227.04 s gammaloop-nextest-clinnet> 4: <std::sync::once::Once>::call_once_force::<<std::sync::once_lock::OnceLock<alloc::string::String>>::initialize<<std::sync::once_lock::OnceLock<alloc::string::String>>::get_or_init<public_typst_behavior::linnest_public_svg::{closure#0}>::{closure#0}, !>::{closure#0}>::{closure#0}
  448. 227.04 s gammaloop-nextest-clinnet> 5: <std::sys::sync::once::futex::Once>::call
  449. 227.04 s gammaloop-nextest-clinnet> 6: <std::sync::once_lock::OnceLock<alloc::string::String>>::initialize::<<std::sync::once_lock::OnceLock<alloc::string::String>>::get_or_init<public_typst_behavior::linnest_public_svg::{closure#0}>::{closure#0}, !>
  450. 227.04 s gammaloop-nextest-clinnet> 7: <public_typst_behavior::public_linnest_edge_styles_skip_fallbacks::{closure#0} as core::ops::function::FnOnce<()>>::call_once
  451. 227.04 s gammaloop-nextest-clinnet> note: Some details are omitted, run with `RUST_BACKTRACE=full` for a verbose backtrace.
  452. 227.04 s gammaloop-nextest-clinnet>
  453. 227.04 s gammaloop-nextest-clinnet> 3. clinnet::public_typst_behavior::public_linnest_momentum_layers_place_shafts_and_labels
  454. 227.04 s gammaloop-nextest-clinnet> failure: test failure with exit code 101
  455. 227.04 s gammaloop-nextest-clinnet> thread 'public_linnest_momentum_layers_place_shafts_and_labels' (291) panicked at crates/clinnet/tests/public_typst_behavior.rs:81:55:
  456. 227.04 s gammaloop-nextest-clinnet> called `Result::unwrap()` on an `Err` value: typst failed while compiling template /build/.tmpLTPDfU/.clinnet/templates/linnest-public-behavior.svg
  457. 227.04 s gammaloop-nextest-clinnet>
  458. 227.04 s gammaloop-nextest-clinnet> Command executed:
  459. 227.04 s gammaloop-nextest-clinnet> "typst" "c" "/build/.tmpLTPDfU/.clinnet/templates/linnest-public-behavior.typ" "/build/.tmpLTPDfU/.clinnet/templates/linnest-public-behavior.svg" "--root" "/build/.tmpLTPDfU/.clinnet/templates"
  460. 227.04 s gammaloop-nextest-clinnet>
  461. 227.04 s gammaloop-nextest-clinnet> Typst stdout:
  462. 227.04 s gammaloop-nextest-clinnet>
  463. 227.04 s gammaloop-nextest-clinnet>
  464. 227.04 s gammaloop-nextest-clinnet> Typst stderr:
  465. 227.04 s gammaloop-nextest-clinnet>
  466. 227.04 s gammaloop-nextest-clinnet>
  467. 227.04 s gammaloop-nextest-clinnet> Location:
  468. 227.04 s gammaloop-nextest-clinnet> crates/clinnet/src/lib.rs:741:13
  469. 227.04 s gammaloop-nextest-clinnet> stack backtrace:
  470. 227.04 s gammaloop-nextest-clinnet> 0: __rustc::rust_begin_unwind
  471. 227.04 s gammaloop-nextest-clinnet> 1: core::panicking::panic_fmt
  472. 227.04 s gammaloop-nextest-clinnet> 2: core::result::unwrap_failed
  473. 227.04 s gammaloop-nextest-clinnet> 3: public_typst_behavior::render
  474. 227.04 s gammaloop-nextest-clinnet> 4: <std::sync::once::Once>::call_once_force::<<std::sync::once_lock::OnceLock<alloc::string::String>>::initialize<<std::sync::once_lock::OnceLock<alloc::string::String>>::get_or_init<public_typst_behavior::linnest_public_svg::{closure#0}>::{closure#0}, !>::{closure#0}>::{closure#0}
  475. 227.04 s gammaloop-nextest-clinnet> 5: <std::sys::sync::once::futex::Once>::call
  476. 227.04 s gammaloop-nextest-clinnet> 6: <std::sync::once_lock::OnceLock<alloc::string::String>>::initialize::<<std::sync::once_lock::OnceLock<alloc::string::String>>::get_or_init<public_typst_behavior::linnest_public_svg::{closure#0}>::{closure#0}, !>
  477. 227.04 s gammaloop-nextest-clinnet> 7: <public_typst_behavior::public_linnest_momentum_layers_place_shafts_and_labels::{closure#0} as core::ops::function::FnOnce<()>>::call_once
  478. 227.04 s gammaloop-nextest-clinnet> note: Some details are omitted, run with `RUST_BACKTRACE=full` for a verbose backtrace.
  479. 227.04 s gammaloop-nextest-clinnet> system-out
  480. 227.04 s gammaloop-nextest-clinnet> running 1 test
  481. 227.04 s gammaloop-nextest-clinnet> test public_linnest_momentum_layers_place_shafts_and_labels has been running for over 60 seconds
  482. 227.04 s gammaloop-nextest-clinnet> test public_linnest_momentum_layers_place_shafts_and_labels ... FAILED
  483. 227.04 s gammaloop-nextest-clinnet>
  484. 227.04 s gammaloop-nextest-clinnet> failures:
  485. 227.04 s gammaloop-nextest-clinnet>
  486. 227.04 s gammaloop-nextest-clinnet> failures:
  487. 227.04 s gammaloop-nextest-clinnet> public_linnest_momentum_layers_place_shafts_and_labels
  488. 227.04 s gammaloop-nextest-clinnet>
  489. 227.04 s gammaloop-nextest-clinnet> test result: FAILED. 0 passed; 1 failed; 0 ignored; 0 measured; 17 filtered out; finished in 138.80s
  490. 227.04 s gammaloop-nextest-clinnet> system-err
  491. 227.04 s gammaloop-nextest-clinnet> thread 'public_linnest_momentum_layers_place_shafts_and_labels' (291) panicked at crates/clinnet/tests/public_typst_behavior.rs:81:55:
  492. 227.04 s gammaloop-nextest-clinnet> called `Result::unwrap()` on an `Err` value: typst failed while compiling template /build/.tmpLTPDfU/.clinnet/templates/linnest-public-behavior.svg
  493. 227.04 s gammaloop-nextest-clinnet>
  494. 227.04 s gammaloop-nextest-clinnet> Command executed:
  495. 227.04 s gammaloop-nextest-clinnet> "typst" "c" "/build/.tmpLTPDfU/.clinnet/templates/linnest-public-behavior.typ" "/build/.tmpLTPDfU/.clinnet/templates/linnest-public-behavior.svg" "--root" "/build/.tmpLTPDfU/.clinnet/templates"
  496. 227.04 s gammaloop-nextest-clinnet>
  497. 227.04 s gammaloop-nextest-clinnet> Typst stdout:
  498. 227.04 s gammaloop-nextest-clinnet>
  499. 227.04 s gammaloop-nextest-clinnet>
  500. 227.04 s gammaloop-nextest-clinnet> Typst stderr:
  501. 227.04 s gammaloop-nextest-clinnet>
  502. 227.04 s gammaloop-nextest-clinnet>
  503. 227.04 s gammaloop-nextest-clinnet> Location:
  504. 227.04 s gammaloop-nextest-clinnet> crates/clinnet/src/lib.rs:741:13
  505. 227.04 s gammaloop-nextest-clinnet> stack backtrace:
  506. 227.04 s gammaloop-nextest-clinnet> 0: __rustc::rust_begin_unwind
  507. 227.04 s gammaloop-nextest-clinnet> 1: core::panicking::panic_fmt
  508. 227.04 s gammaloop-nextest-clinnet> 2: core::result::unwrap_failed
  509. 227.04 s gammaloop-nextest-clinnet> 3: public_typst_behavior::render
  510. 227.04 s gammaloop-nextest-clinnet> 4: <std::sync::once::Once>::call_once_force::<<std::sync::once_lock::OnceLock<alloc::string::String>>::initialize<<std::sync::once_lock::OnceLock<alloc::string::String>>::get_or_init<public_typst_behavior::linnest_public_svg::{closure#0}>::{closure#0}, !>::{closure#0}>::{closure#0}
  511. 227.04 s gammaloop-nextest-clinnet> 5: <std::sys::sync::once::futex::Once>::call
  512. 227.04 s gammaloop-nextest-clinnet> 6: <std::sync::once_lock::OnceLock<alloc::string::String>>::initialize::<<std::sync::once_lock::OnceLock<alloc::string::String>>::get_or_init<public_typst_behavior::linnest_public_svg::{closure#0}>::{closure#0}, !>
  513. 227.04 s gammaloop-nextest-clinnet> 7: <public_typst_behavior::public_linnest_momentum_layers_place_shafts_and_labels::{closure#0} as core::ops::function::FnOnce<()>>::call_once
  514. 227.04 s gammaloop-nextest-clinnet> note: Some details are omitted, run with `RUST_BACKTRACE=full` for a verbose backtrace.
  515. 227.04 s gammaloop-nextest-clinnet> =========================================
  516. 228.51 s [3 built (1 failed), 74 error: Cannot build '/nix/store/4pqspwvh8pi9s2vg9g6mfsggpl9ynwzx-gammaloop-nextest-clinnet.drv'.
  517. 228.51 s Reason: builder failed with exit code 100.
  518. 228.51 s Output paths:
  519. 228.51 s /nix/store/v9zka7gxdrym1pq03r0i4w2q43fgdwcq-gammaloop-nextest-clinnet
  520. 228.51 s Last 449 log lines:
  521. 228.51 s > Nextest worker budget: 16
  522. 228.51 s > Extracting 4 binaries (including 1 non-test binary), 1 build script output directory, and 1 linked path to /build/source
  523. 228.51 s > Extracted 16 files to /build/source in 0.14s
  524. 228.51 s > ------------
  525. 228.51 s > Nextest run ID 85d13a61-3752-4607-a14e-488baca52f8e with nextest profile: ci_gammaloop
  526. 228.51 s > Starting 38 tests across 3 binaries
  527. 228.51 s > FAIL [ 108.876s] (32/38) clinnet::public_typst_behavior public_linnest_labels_follow_their_carriers
  528. 228.51 s > stdout ---
  529. 228.51 s >
  530. 228.51 s > running 1 test
  531. 228.51 s > test public_linnest_labels_follow_their_carriers has been running for over 60 seconds
  532. 228.51 s > test public_linnest_labels_follow_their_carriers ... FAILED
  533. 228.51 s >
  534. 228.51 s > failures:
  535. 228.51 s >
  536. 228.51 s > failures:
  537. 228.51 s > public_linnest_labels_follow_their_carriers
  538. 228.51 s >
  539. 228.51 s > test result: FAILED. 0 passed; 1 failed; 0 ignored; 0 measured; 17 filtered out; finished in 108.86s
  540. 228.51 s >
  541. 228.51 s > stderr ---
  542. 228.51 s >
  543. 228.51 s > thread 'public_linnest_labels_follow_their_carriers' (273) panicked at crates/clinnet/tests/public_typst_behavior.rs:81:55:
  544. 228.51 s > called `Result::unwrap()` on an `Err` value: typst failed while compiling template /build/.tmpyPEQO4/.clinnet/templates/linnest-public-behavior.svg
  545. 228.51 s >
  546. 228.51 s > Command executed:
  547. 228.51 s > "typst" "c" "/build/.tmpyPEQO4/.clinnet/templates/linnest-public-behavior.typ" "/build/.tmpyPEQO4/.clinnet/templates/linnest-public-behavior.svg" "--root" "/build/.tmpyPEQO4/.clinnet/templates"
  548. 228.51 s >
  549. 228.51 s > Typst stdout:
  550. 228.51 s >
  551. 228.51 s >
  552. 228.51 s > Typst stderr:
  553. 228.51 s >
  554. 228.51 s >
  555. 228.51 s > Location:
  556. 228.51 s > crates/clinnet/src/lib.rs:741:13
  557. 228.51 s > stack backtrace:
  558. 228.51 s > 0: __rustc::rust_begin_unwind
  559. 228.51 s > 1: core::panicking::panic_fmt
  560. 228.51 s > 2: core::result::unwrap_failed
  561. 228.51 s > 3: public_typst_behavior::render
  562. 228.51 s > 4: <std::sync::once::Once>::call_once_force::<<std::sync::once_lock::OnceLock<alloc::string::String>>::initialize<<std::sync::once_lock::OnceLock<alloc::string::String>>::get_or_init<public_typst_behavior::linnest_public_svg::{closure#0}>::{closure#0}, !>::{closure#0}>::{closure#0}
  563. 228.51 s > 5: <std::sys::sync::once::futex::Once>::call
  564. 228.51 s > 6: <std::sync::once_lock::OnceLock<alloc::string::String>>::initialize::<<std::sync::once_lock::OnceLock<alloc::string::String>>::get_or_init<public_typst_behavior::linnest_public_svg::{closure#0}>::{closure#0}, !>
  565. 228.51 s > 7: <public_typst_behavior::public_linnest_labels_follow_their_carriers::{closure#0} as core::ops::function::FnOnce<()>>::call_once
  566. 228.51 s > note: Some details are omitted, run with `RUST_BACKTRACE=full` for a verbose backtrace.
  567. 228.51 s >
  568. 228.51 s > FAIL [ 116.742s] (33/38) clinnet::public_typst_behavior public_linnest_edge_styles_skip_fallbacks
  569. 228.51 s > stdout ---
  570. 228.51 s >
  571. 228.51 s > running 1 test
  572. 228.51 s > test public_linnest_edge_styles_skip_fallbacks has been running for over 60 seconds
  573. 228.51 s > test public_linnest_edge_styles_skip_fallbacks ... FAILED
  574. 228.51 s >
  575. 228.51 s > failures:
  576. 228.51 s >
  577. 228.51 s > failures:
  578. 228.51 s > public_linnest_edge_styles_skip_fallbacks
  579. 228.51 s >
  580. 228.52 s > test result: FAILED. 0 passed; 1 failed; 0 ignored; 0 measured; 17 filtered out; finished in 116.73s
  581. 228.52 s >
  582. 228.52 s > stderr ---
  583. 228.52 s >
  584. 228.52 s > thread 'public_linnest_edge_styles_skip_fallbacks' (268) panicked at crates/clinnet/tests/public_typst_behavior.rs:81:55:
  585. 228.52 s > called `Result::unwrap()` on an `Err` value: typst failed while compiling template /build/.tmp7ANJKW/.clinnet/templates/linnest-public-behavior.svg
  586. 228.52 s >
  587. 228.52 s > Command executed:
  588. 228.52 s > "typst" "c" "/build/.tmp7ANJKW/.clinnet/templates/linnest-public-behavior.typ" "/build/.tmp7ANJKW/.clinnet/templates/linnest-public-behavior.svg" "--root" "/build/.tmp7ANJKW/.clinnet/templates"
  589. 228.52 s >
  590. 228.52 s > Typst stdout:
  591. 228.52 s >
  592. 228.52 s >
  593. 228.52 s > Typst stderr:
  594. 228.52 s >
  595. 228.52 s >
  596. 228.52 s > Location:
  597. 228.52 s > crates/clinnet/src/lib.rs:741:13
  598. 228.52 s > stack backtrace:
  599. 228.52 s > 0: __rustc::rust_begin_unwind
  600. 228.52 s > 1: core::panicking::panic_fmt
  601. 228.52 s > 2: core::result::unwrap_failed
  602. 228.52 s > 3: public_typst_behavior::render
  603. 228.52 s > 4: <std::sync::once::Once>::call_once_force::<<std::sync::once_lock::OnceLock<alloc::string::String>>::initialize<<std::sync::once_lock::OnceLock<alloc::string::String>>::get_or_init<public_typst_behavior::linnest_public_svg::{closure#0}>::{closure#0}, !>::{closure#0}>::{closure#0}
  604. 228.52 s > 5: <std::sys::sync::once::futex::Once>::call
  605. 228.52 s > 6: <std::sync::once_lock::OnceLock<alloc::string::String>>::initialize::<<std::sync::once_lock::OnceLock<alloc::string::String>>::get_or_init<public_typst_behavior::linnest_public_svg::{closure#0}>::{closure#0}, !>
  606. 228.52 s > 7: <public_typst_behavior::public_linnest_edge_styles_skip_fallbacks::{closure#0} as core::ops::function::FnOnce<()>>::call_once
  607. 228.52 s > note: Some details are omitted, run with `RUST_BACKTRACE=full` for a verbose backtrace.
  608. 228.52 s >
  609. 228.52 s > FAIL [ 138.837s] (34/38) clinnet::public_typst_behavior public_linnest_momentum_layers_place_shafts_and_labels
  610. 228.52 s > stdout ---
  611. 228.52 s >
  612. 228.52 s > running 1 test
  613. 228.52 s > test public_linnest_momentum_layers_place_shafts_and_labels has been running for over 60 seconds
  614. 228.52 s > test public_linnest_momentum_layers_place_shafts_and_labels ... FAILED
  615. 228.52 s >
  616. 228.52 s > failures:
  617. 228.52 s >
  618. 228.52 s > failures:
  619. 228.52 s > public_linnest_momentum_layers_place_shafts_and_labels
  620. 228.52 s >
  621. 228.52 s > test result: FAILED. 0 passed; 1 failed; 0 ignored; 0 measured; 17 filtered out; finished in 138.80s
  622. 228.52 s >
  623. 228.52 s > stderr ---
  624. 228.52 s >
  625. 228.52 s > thread 'public_linnest_momentum_layers_place_shafts_and_labels' (291) panicked at crates/clinnet/tests/public_typst_behavior.rs:81:55:
  626. 228.52 s > called `Result::unwrap()` on an `Err` value: typst failed while compiling template /build/.tmpLTPDfU/.clinnet/templates/linnest-public-behavior.svg
  627. 228.52 s >
  628. 228.52 s > Command executed:
  629. 228.52 s > "typst" "c" "/build/.tmpLTPDfU/.clinnet/templates/linnest-public-behavior.typ" "/build/.tmpLTPDfU/.clinnet/templates/linnest-public-behavior.svg" "--root" "/build/.tmpLTPDfU/.clinnet/templates"
  630. 228.52 s >
  631. 228.52 s > Typst stdout:
  632. 228.52 s >
  633. 228.52 s >
  634. 228.52 s > Typst stderr:
  635. 228.52 s >
  636. 228.52 s >
  637. 228.52 s > Location:
  638. 228.52 s > crates/clinnet/src/lib.rs:741:13
  639. 228.52 s > stack backtrace:
  640. 228.52 s > 0: __rustc::rust_begin_unwind
  641. 228.52 s > 1: core::panicking::panic_fmt
  642. 228.52 s > 2: core::result::unwrap_failed
  643. 228.52 s > 3: public_typst_behavior::render
  644. 228.52 s > 4: <std::sync::once::Once>::call_once_force::<<std::sync::once_lock::OnceLock<alloc::string::String>>::initialize<<std::sync::once_lock::OnceLock<alloc::string::String>>::get_or_init<public_typst_behavior::linnest_public_svg::{closure#0}>::{closure#0}, !>::{closure#0}>::{closure#0}
  645. 228.52 s > 5: <std::sys::sync::once::futex::Once>::call
  646. 228.52 s > 6: <std::sync::once_lock::OnceLock<alloc::string::String>>::initialize::<<std::sync::once_lock::OnceLock<alloc::string::String>>::get_or_init<public_typst_behavior::linnest_public_svg::{closure#0}>::{closure#0}, !>
  647. 228.52 s > 7: <public_typst_behavior::public_linnest_momentum_layers_place_shafts_and_labels::{closure#0} as core::ops::function::FnOnce<()>>::call_once
  648. 228.52 s > note: Some details are omitted, run with `RUST_BACKTRACE=full` for a verbose backtrace.
  649. 228.52 s >
  650. 228.52 s > ------------
  651. 228.52 s > Summary [ 152.092s] 38 tests run: 35 passed (4 slow), 3 failed, 0 skipped
  652. 228.52 s > FAIL [ 108.876s] (32/38) clinnet::public_typst_behavior public_linnest_labels_follow_their_carriers
  653. 228.52 s > stdout ---
  654. 228.52 s >
  655. 228.52 s > running 1 test
  656. 228.52 s > test public_linnest_labels_follow_their_carriers has been running for over 60 seconds
  657. 228.52 s > test public_linnest_labels_follow_their_carriers ... FAILED
  658. 228.52 s >
  659. 228.52 s > failures:
  660. 228.52 s >
  661. 228.52 s > failures:
  662. 228.52 s > public_linnest_labels_follow_their_carriers
  663. 228.52 s >
  664. 228.52 s > test result: FAILED. 0 passed; 1 failed; 0 ignored; 0 measured; 17 filtered out; finished in 108.86s
  665. 228.52 s >
  666. 228.52 s > stderr ---
  667. 228.52 s >
  668. 228.52 s > thread 'public_linnest_labels_follow_their_carriers' (273) panicked at crates/clinnet/tests/public_typst_behavior.rs:81:55:
  669. 228.52 s > called `Result::unwrap()` on an `Err` value: typst failed while compiling template /build/.tmpyPEQO4/.clinnet/templates/linnest-public-behavior.svg
  670. 228.52 s >
  671. 228.52 s > Command executed:
  672. 228.52 s > "typst" "c" "/build/.tmpyPEQO4/.clinnet/templates/linnest-public-behavior.typ" "/build/.tmpyPEQO4/.clinnet/templates/linnest-public-behavior.svg" "--root" "/build/.tmpyPEQO4/.clinnet/templates"
  673. 228.52 s >
  674. 228.52 s > Typst stdout:
  675. 228.52 s >
  676. 228.52 s >
  677. 228.52 s > Typst stderr:
  678. 228.52 s >
  679. 228.52 s >
  680. 228.52 s > Location:
  681. 228.52 s > crates/clinnet/src/lib.rs:741:13
  682. 228.52 s > stack backtrace:
  683. 228.52 s > 0: __rustc::rust_begin_unwind
  684. 228.52 s > 1: core::panicking::panic_fmt
  685. 228.52 s > 2: core::result::unwrap_failed
  686. 228.52 s > 3: public_typst_behavior::render
  687. 228.52 s > 4: <std::sync::once::Once>::call_once_force::<<std::sync::once_lock::OnceLock<alloc::string::String>>::initialize<<std::sync::once_lock::OnceLock<alloc::string::String>>::get_or_init<public_typst_behavior::linnest_public_svg::{closure#0}>::{closure#0}, !>::{closure#0}>::{closure#0}
  688. 228.52 s > 5: <std::sys::sync::once::futex::Once>::call
  689. 228.52 s > 6: <std::sync::once_lock::OnceLock<alloc::string::String>>::initialize::<<std::sync::once_lock::OnceLock<alloc::string::String>>::get_or_init<public_typst_behavior::linnest_public_svg::{closure#0}>::{closure#0}, !>
  690. 228.52 s > 7: <public_typst_behavior::public_linnest_labels_follow_their_carriers::{closure#0} as core::ops::function::FnOnce<()>>::call_once
  691. 228.52 s > note: Some details are omitted, run with `RUST_BACKTRACE=full` for a verbose backtrace.
  692. 228.52 s >
  693. 228.52 s > FAIL [ 116.742s] (33/38) clinnet::public_typst_behavior public_linnest_edge_styles_skip_fallbacks
  694. 228.52 s > stdout ---
  695. 228.52 s >
  696. 228.52 s > running 1 test
  697. 228.52 s > test public_linnest_edge_styles_skip_fallbacks has been running for over 60 seconds
  698. 228.52 s > test public_linnest_edge_styles_skip_fallbacks ... FAILED
  699. 228.52 s >
  700. 228.52 s > failures:
  701. 228.52 s >
  702. 228.52 s > failures:
  703. 228.52 s > public_linnest_edge_styles_skip_fallbacks
  704. 228.52 s >
  705. 228.52 s > test result: FAILED. 0 passed; 1 failed; 0 ignored; 0 measured; 17 filtered out; finished in 116.73s
  706. 228.52 s >
  707. 228.52 s > stderr ---
  708. 228.52 s >
  709. 228.52 s > thread 'public_linnest_edge_styles_skip_fallbacks' (268) panicked at crates/clinnet/tests/public_typst_behavior.rs:81:55:
  710. 228.52 s > called `Result::unwrap()` on an `Err` value: typst failed while compiling template /build/.tmp7ANJKW/.clinnet/templates/linnest-public-behavior.svg
  711. 228.52 s >
  712. 228.52 s > Command executed:
  713. 228.52 s > "typst" "c" "/build/.tmp7ANJKW/.clinnet/templates/linnest-public-behavior.typ" "/build/.tmp7ANJKW/.clinnet/templates/linnest-public-behavior.svg" "--root" "/build/.tmp7ANJKW/.clinnet/templates"
  714. 228.52 s >
  715. 228.52 s > Typst stdout:
  716. 228.52 s >
  717. 228.52 s >
  718. 228.52 s > Typst stderr:
  719. 228.52 s >
  720. 228.52 s >
  721. 228.52 s > Location:
  722. 228.52 s > crates/clinnet/src/lib.rs:741:13
  723. 228.52 s > stack backtrace:
  724. 228.52 s > 0: __rustc::rust_begin_unwind
  725. 228.52 s > 1: core::panicking::panic_fmt
  726. 228.52 s > 2: core::result::unwrap_failed
  727. 228.52 s > 3: public_typst_behavior::render
  728. 228.52 s > 4: <std::sync::once::Once>::call_once_force::<<std::sync::once_lock::OnceLock<alloc::string::String>>::initialize<<std::sync::once_lock::OnceLock<alloc::string::String>>::get_or_init<public_typst_behavior::linnest_public_svg::{closure#0}>::{closure#0}, !>::{closure#0}>::{closure#0}
  729. 228.52 s > 5: <std::sys::sync::once::futex::Once>::call
  730. 228.52 s > 6: <std::sync::once_lock::OnceLock<alloc::string::String>>::initialize::<<std::sync::once_lock::OnceLock<alloc::string::String>>::get_or_init<public_typst_behavior::linnest_public_svg::{closure#0}>::{closure#0}, !>
  731. 228.52 s > 7: <public_typst_behavior::public_linnest_edge_styles_skip_fallbacks::{closure#0} as core::ops::function::FnOnce<()>>::call_once
  732. 228.52 s > note: Some details are omitted, run with `RUST_BACKTRACE=full` for a verbose backtrace.
  733. 228.52 s >
  734. 228.52 s > FAIL [ 138.837s] (34/38) clinnet::public_typst_behavior public_linnest_momentum_layers_place_shafts_and_labels
  735. 228.52 s > stdout ---
  736. 228.52 s >
  737. 228.52 s > running 1 test
  738. 228.52 s > test public_linnest_momentum_layers_place_shafts_and_labels has been running for over 60 seconds
  739. 228.52 s > test public_linnest_momentum_layers_place_shafts_and_labels ... FAILED
  740. 228.52 s >
  741. 228.52 s > failures:
  742. 228.52 s >
  743. 228.52 s > failures:
  744. 228.52 s > public_linnest_momentum_layers_place_shafts_and_labels
  745. 228.52 s >
  746. 228.52 s > test result: FAILED. 0 passed; 1 failed; 0 ignored; 0 measured; 17 filtered out; finished in 138.80s
  747. 228.52 s >
  748. 228.52 s > stderr ---
  749. 228.52 s >
  750. 228.52 s > thread 'public_linnest_momentum_layers_place_shafts_and_labels' (291) panicked at crates/clinnet/tests/public_typst_behavior.rs:81:55:
  751. 228.52 s > called `Result::unwrap()` on an `Err` value: typst failed while compiling template /build/.tmpLTPDfU/.clinnet/templates/linnest-public-behavior.svg
  752. 228.52 s >
  753. 228.52 s > Command executed:
  754. 228.52 s > "typst" "c" "/build/.tmpLTPDfU/.clinnet/templates/linnest-public-behavior.typ" "/build/.tmpLTPDfU/.clinnet/templates/linnest-public-behavior.svg" "--root" "/build/.tmpLTPDfU/.clinnet/templates"
  755. 228.52 s >
  756. 228.52 s > Typst stdout:
  757. 228.52 s >
  758. 228.52 s >
  759. 228.52 s > Typst stderr:
  760. 228.52 s >
  761. 228.52 s >
  762. 228.52 s > Location:
  763. 228.52 s > crates/clinnet/src/lib.rs:741:13
  764. 228.52 s > stack backtrace:
  765. 228.52 s > 0: __rustc::rust_begin_unwind
  766. 228.52 s > 1: core::panicking::panic_fmt
  767. 228.52 s > 2: core::result::unwrap_failed
  768. 228.52 s > 3: public_typst_behavior::render
  769. 228.52 s > 4: <std::sync::once::Once>::call_once_force::<<std::sync::once_lock::OnceLock<alloc::string::String>>::initialize<<std::sync::once_lock::OnceLock<alloc::string::String>>::get_or_init<public_typst_behavior::linnest_public_svg::{closure#0}>::{closure#0}, !>::{closure#0}>::{closure#0}
  770. 228.52 s > 5: <std::sys::sync::once::futex::Once>::call
  771. 228.52 s > 6: <std::sync::once_lock::OnceLock<alloc::string::String>>::initialize::<<std::sync::once_lock::OnceLock<alloc::string::String>>::get_or_init<public_typst_behavior::linnest_public_svg::{closure#0}>::{closure#0}, !>
  772. 228.52 s > 7: <public_typst_behavior::public_linnest_momentum_layers_place_shafts_and_labels::{closure#0} as core::ops::function::FnOnce<()>>::call_once
  773. 228.52 s > note: Some details are omitted, run with `RUST_BACKTRACE=full` for a verbose backtrace.
  774. 228.52 s >
  775. 228.52 s > error: test run failed
  776. 228.52 s >
  777. 228.52 s > ========== nextest test summary ==========
  778. 228.52 s > report: target/nextest/ci_gammaloop/junit.xml
  779. 228.52 s > tests: 38, failures: 3, errors: 0
  780. 228.52 s >
  781. 228.52 s > 1. clinnet::public_typst_behavior::public_linnest_labels_follow_their_carriers
  782. 228.52 s > failure: test failure with exit code 101
  783. 228.52 s > thread 'public_linnest_labels_follow_their_carriers' (273) panicked at crates/clinnet/tests/public_typst_behavior.rs:81:55:
  784. 228.52 s > called `Result::unwrap()` on an `Err` value: typst failed while compiling template /build/.tmpyPEQO4/.clinnet/templates/linnest-public-behavior.svg
  785. 228.52 s >
  786. 228.52 s > Command executed:
  787. 228.52 s > "typst" "c" "/build/.tmpyPEQO4/.clinnet/templates/linnest-public-behavior.typ" "/build/.tmpyPEQO4/.clinnet/templates/linnest-public-behavior.svg" "--root" "/build/.tmpyPEQO4/.clinnet/templates"
  788. 228.52 s >
  789. 228.52 s > Typst stdout:
  790. 228.52 s >
  791. 228.52 s >
  792. 228.52 s > Typst stderr:
  793. 228.52 s >
  794. 228.52 s >
  795. 228.52 s > Location:
  796. 228.52 s > crates/clinnet/src/lib.rs:741:13
  797. 228.52 s > stack backtrace:
  798. 228.52 s > 0: __rustc::rust_begin_unwind
  799. 228.52 s > 1: core::panicking::panic_fmt
  800. 228.52 s > 2: core::result::unwrap_failed
  801. 228.52 s > 3: public_typst_behavior::render
  802. 228.52 s > 4: <std::sync::once::Once>::call_once_force::<<std::sync::once_lock::OnceLock<alloc::string::String>>::initialize<<std::sync::once_lock::OnceLock<alloc::string::String>>::get_or_init<public_typst_behavior::linnest_public_svg::{closure#0}>::{closure#0}, !>::{closure#0}>::{closure#0}
  803. 228.52 s > 5: <std::sys::sync::once::futex::Once>::call
  804. 228.52 s > 6: <std::sync::once_lock::OnceLock<alloc::string::String>>::initialize::<<std::sync::once_lock::OnceLock<alloc::string::String>>::get_or_init<public_typst_behavior::linnest_public_svg::{closure#0}>::{closure#0}, !>
  805. 228.52 s > 7: <public_typst_behavior::public_linnest_labels_follow_their_carriers::{closure#0} as core::ops::function::FnOnce<()>>::call_once
  806. 228.52 s > note: Some details are omitted, run with `RUST_BACKTRACE=full` for a verbose backtrace.
  807. 228.52 s > system-out
  808. 228.52 s > running 1 test
  809. 228.52 s > test public_linnest_labels_follow_their_carriers has been running for over 60 seconds
  810. 228.52 s > test public_linnest_labels_follow_their_carriers ... FAILED
  811. 228.52 s >
  812. 228.52 s > failures:
  813. 228.52 s >
  814. 228.52 s > failures:
  815. 228.52 s > public_linnest_labels_follow_their_carriers
  816. 228.52 s >
  817. 228.52 s > test result: FAILED. 0 passed; 1 failed; 0 ignored; 0 measured; 17 filtered out; finished in 108.86s
  818. 228.52 s > system-err
  819. 228.52 s > thread 'public_linnest_labels_follow_their_carriers' (273) panicked at crates/clinnet/tests/public_typst_behavior.rs:81:55:
  820. 228.52 s > called `Result::unwrap()` on an `Err` value: typst failed while compiling template /build/.tmpyPEQO4/.clinnet/templates/linnest-public-behavior.svg
  821. 228.52 s >
  822. 228.52 s > Command executed:
  823. 228.52 s > "typst" "c" "/build/.tmpyPEQO4/.clinnet/templates/linnest-public-behavior.typ" "/build/.tmpyPEQO4/.clinnet/templates/linnest-public-behavior.svg" "--root" "/build/.tmpyPEQO4/.clinnet/templates"
  824. 228.52 s >
  825. 228.52 s > Typst stdout:
  826. 228.52 s >
  827. 228.52 s >
  828. 228.52 s > Typst stderr:
  829. 228.52 s >
  830. 228.52 s >
  831. 228.52 s > Location:
  832. 228.52 s > crates/clinnet/src/lib.rs:741:13
  833. 228.52 s > stack backtrace:
  834. 228.52 s > 0: __rustc::rust_begin_unwind
  835. 228.52 s > 1: core::panicking::panic_fmt
  836. 228.52 s > 2: core::result::unwrap_failed
  837. 228.52 s > 3: public_typst_behavior::render
  838. 228.52 s > 4: <std::sync::once::Once>::call_once_force::<<std::sync::once_lock::OnceLock<alloc::string::String>>::initialize<<std::sync::once_lock::OnceLock<alloc::string::String>>::get_or_init<public_typst_behavior::linnest_public_svg::{closure#0}>::{closure#0}, !>::{closure#0}>::{closure#0}
  839. 228.52 s > 5: <std::sys::sync::once::futex::Once>::call
  840. 228.52 s > 6: <std::sync::once_lock::OnceLock<alloc::string::String>>::initialize::<<std::sync::once_lock::OnceLock<alloc::string::String>>::get_or_init<public_typst_behavior::linnest_public_svg::{closure#0}>::{closure#0}, !>
  841. 228.52 s > 7: <public_typst_behavior::public_linnest_labels_follow_their_carriers::{closure#0} as core::ops::function::FnOnce<()>>::call_once
  842. 228.52 s > note: Some details are omitted, run with `RUST_BACKTRACE=full` for a verbose backtrace.
  843. 228.52 s >
  844. 228.52 s > 2. clinnet::public_typst_behavior::public_linnest_edge_styles_skip_fallbacks
  845. 228.52 s > failure: test failure with exit code 101
  846. 228.52 s > thread 'public_linnest_edge_styles_skip_fallbacks' (268) panicked at crates/clinnet/tests/public_typst_behavior.rs:81:55:
  847. 228.52 s > called `Result::unwrap()` on an `Err` value: typst failed while compiling template /build/.tmp7ANJKW/.clinnet/templates/linnest-public-behavior.svg
  848. 228.52 s >
  849. 228.52 s > Command executed:
  850. 228.52 s > "typst" "c" "/build/.tmp7ANJKW/.clinnet/templates/linnest-public-behavior.typ" "/build/.tmp7ANJKW/.clinnet/templates/linnest-public-behavior.svg" "--root" "/build/.tmp7ANJKW/.clinnet/templates"
  851. 228.52 s >
  852. 228.52 s > Typst stdout:
  853. 228.52 s >
  854. 228.52 s >
  855. 228.52 s > Typst stderr:
  856. 228.52 s >
  857. 228.52 s >
  858. 228.52 s > Location:
  859. 228.52 s > crates/clinnet/src/lib.rs:741:13
  860. 228.52 s > stack backtrace:
  861. 228.52 s > 0: __rustc::rust_begin_unwind
  862. 228.52 s > 1: core::panicking::panic_fmt
  863. 228.52 s > 2: core::result::unwrap_failed
  864. 228.52 s > 3: public_typst_behavior::render
  865. 228.52 s > 4: <std::sync::once::Once>::call_once_force::<<std::sync::once_lock::OnceLock<alloc::string::String>>::initialize<<std::sync::once_lock::OnceLock<alloc::string::String>>::get_or_init<public_typst_behavior::linnest_public_svg::{closure#0}>::{closure#0}, !>::{closure#0}>::{closure#0}
  866. 228.52 s > 5: <std::sys::sync::once::futex::Once>::call
  867. 228.52 s > 6: <std::sync::once_lock::OnceLock<alloc::string::String>>::initialize::<<std::sync::once_lock::OnceLock<alloc::string::String>>::get_or_init<public_typst_behavior::linnest_public_svg::{closure#0}>::{closure#0}, !>
  868. 228.52 s > 7: <public_typst_behavior::public_linnest_edge_styles_skip_fallbacks::{closure#0} as core::ops::function::FnOnce<()>>::call_once
  869. 228.52 s > note: Some details are omitted, run with `RUST_BACKTRACE=full` for a verbose backtrace.
  870. 228.52 s > system-out
  871. 228.52 s > running 1 test
  872. 228.52 s > test public_linnest_edge_styles_skip_fallbacks has been running for over 60 seconds
  873. 228.52 s > test public_linnest_edge_styles_skip_fallbacks ... FAILED
  874. 228.52 s >
  875. 228.52 s > failures:
  876. 228.52 s >
  877. 228.52 s > failures:
  878. 228.52 s > public_linnest_edge_styles_skip_fallbacks
  879. 228.52 s >
  880. 228.52 s > test result: FAILED. 0 passed; 1 failed; 0 ignored; 0 measured; 17 filtered out; finished in 116.73s
  881. 228.52 s > system-err
  882. 228.52 s > thread 'public_linnest_edge_styles_skip_fallbacks' (268) panicked at crates/clinnet/tests/public_typst_behavior.rs:81:55:
  883. 228.52 s > called `Result::unwrap()` on an `Err` value: typst failed while compiling template /build/.tmp7ANJKW/.clinnet/templates/linnest-public-behavior.svg
  884. 228.52 s >
  885. 228.52 s > Command executed:
  886. 228.52 s > "typst" "c" "/build/.tmp7ANJKW/.clinnet/templates/linnest-public-behavior.typ" "/build/.tmp7ANJKW/.clinnet/templates/linnest-public-behavior.svg" "--root" "/build/.tmp7ANJKW/.clinnet/templates"
  887. 228.52 s >
  888. 228.52 s > Typst stdout:
  889. 228.52 s >
  890. 228.52 s >
  891. 228.52 s > Typst stderr:
  892. 228.52 s >
  893. 228.52 s >
  894. 228.52 s > Location:
  895. 228.52 s > crates/clinnet/src/lib.rs:741:13
  896. 228.52 s > stack backtrace:
  897. 228.52 s > 0: __rustc::rust_begin_unwind
  898. 228.52 s > 1: core::panicking::panic_fmt
  899. 228.52 s > 2: core::result::unwrap_failed
  900. 228.52 s > 3: public_typst_behavior::render
  901. 228.52 s > 4: <std::sync::once::Once>::call_once_force::<<std::sync::once_lock::OnceLock<alloc::string::String>>::initialize<<std::sync::once_lock::OnceLock<alloc::string::String>>::get_or_init<public_typst_behavior::linnest_public_svg::{closure#0}>::{closure#0}, !>::{closure#0}>::{closure#0}
  902. 228.52 s > 5: <std::sys::sync::once::futex::Once>::call
  903. 228.52 s > 6: <std::sync::once_lock::OnceLock<alloc::string::String>>::initialize::<<std::sync::once_lock::OnceLock<alloc::string::String>>::get_or_init<public_typst_behavior::linnest_public_svg::{closure#0}>::{closure#0}, !>
  904. 228.52 s > 7: <public_typst_behavior::public_linnest_edge_styles_skip_fallbacks::{closure#0} as core::ops::function::FnOnce<()>>::call_once
  905. 228.52 s > note: Some details are omitted, run with `RUST_BACKTRACE=full` for a verbose backtrace.
  906. 228.52 s >
  907. 228.52 s > 3. clinnet::public_typst_behavior::public_linnest_momentum_layers_place_shafts_and_labels
  908. 228.52 s > failure: test failure with exit code 101
  909. 228.52 s > thread 'public_linnest_momentum_layers_place_shafts_and_labels' (291) panicked at crates/clinnet/tests/public_typst_behavior.rs:81:55:
  910. 228.52 s > called `Result::unwrap()` on an `Err` value: typst failed while compiling template /build/.tmpLTPDfU/.clinnet/templates/linnest-public-behavior.svg
  911. 228.52 s >
  912. 228.52 s > Command executed:
  913. 228.52 s > "typst" "c" "/build/.tmpLTPDfU/.clinnet/templates/linnest-public-behavior.typ" "/build/.tmpLTPDfU/.clinnet/templates/linnest-public-behavior.svg" "--root" "/build/.tmpLTPDfU/.clinnet/templates"
  914. 228.52 s >
  915. 228.52 s > Typst stdout:
  916. 228.52 s >
  917. 228.52 s >
  918. 228.52 s > Typst stderr:
  919. 228.52 s >
  920. 228.52 s >
  921. 228.52 s > Location:
  922. 228.52 s > crates/clinnet/src/lib.rs:741:13
  923. 228.52 s > stack backtrace:
  924. 228.52 s > 0: __rustc::rust_begin_unwind
  925. 228.52 s > 1: core::panicking::panic_fmt
  926. 228.52 s > 2: core::result::unwrap_failed
  927. 228.52 s > 3: public_typst_behavior::render
  928. 228.52 s > 4: <std::sync::once::Once>::call_once_force::<<std::sync::once_lock::OnceLock<alloc::string::String>>::initialize<<std::sync::once_lock::OnceLock<alloc::string::String>>::get_or_init<public_typst_behavior::linnest_public_svg::{closure#0}>::{closure#0}, !>::{closure#0}>::{closure#0}
  929. 228.52 s > 5: <std::sys::sync::once::futex::Once>::call
  930. 228.52 s > 6: <std::sync::once_lock::OnceLock<alloc::string::String>>::initialize::<<std::sync::once_lock::OnceLock<alloc::string::String>>::get_or_init<public_typst_behavior::linnest_public_svg::{closure#0}>::{closure#0}, !>
  931. 228.52 s > 7: <public_typst_behavior::public_linnest_momentum_layers_place_shafts_and_labels::{closure#0} as core::ops::function::FnOnce<()>>::call_once
  932. 228.52 s > note: Some details are omitted, run with `RUST_BACKTRACE=full` for a verbose backtrace.
  933. 228.52 s > system-out
  934. 228.52 s > running 1 test
  935. 228.52 s > test public_linnest_momentum_layers_place_shafts_and_labels has been running for over 60 seconds
  936. 228.52 s > test public_linnest_momentum_layers_place_shafts_and_labels ... FAILED
  937. 228.52 s >
  938. 228.52 s > failures:
  939. 228.52 s >
  940. 228.52 s > failures:
  941. 228.52 s > public_linnest_momentum_layers_place_shafts_and_labels
  942. 228.52 s >
  943. 228.52 s > test result: FAILED. 0 passed; 1 failed; 0 ignored; 0 measured; 17 filtered out; finished in 138.80s
  944. 228.52 s > system-err
  945. 228.52 s > thread 'public_linnest_momentum_layers_place_shafts_and_labels' (291) panicked at crates/clinnet/tests/public_typst_behavior.rs:81:55:
  946. 228.52 s > called `Result::unwrap()` on an `Err` value: typst failed while compiling template /build/.tmpLTPDfU/.clinnet/templates/linnest-public-behavior.svg
  947. 228.52 s >
  948. 228.52 s > Command executed:
  949. 228.52 s > "typst" "c" "/build/.tmpLTPDfU/.clinnet/templates/linnest-public-behavior.typ" "/build/.tmpLTPDfU/.clinnet/templates/linnest-public-behavior.svg" "--root" "/build/.tmpLTPDfU/.clinnet/templates"
  950. 228.52 s >
  951. 228.52 s > Typst stdout:
  952. 228.52 s >
  953. 228.52 s >
  954. 228.52 s > Typst stderr:
  955. 228.52 s >
  956. 228.52 s >
  957. 228.52 s > Location:
  958. 228.52 s > crates/clinnet/src/lib.rs:741:13
  959. 228.52 s > stack backtrace:
  960. 228.52 s > 0: __rustc::rust_begin_unwind
  961. 228.52 s > 1: core::panicking::panic_fmt
  962. 228.52 s > 2: core::result::unwrap_failed
  963. 228.52 s > 3: public_typst_behavior::render
  964. 228.52 s > 4: <std::sync::once::Once>::call_once_force::<<std::sync::once_lock::OnceLock<alloc::string::String>>::initialize<<std::sync::once_lock::OnceLock<alloc::string::String>>::get_or_init<public_typst_behavior::linnest_public_svg::{closure#0}>::{closure#0}, !>::{closure#0}>::{closure#0}
  965. 228.52 s > 5: <std::sys::sync::once::futex::Once>::call
  966. 228.52 s > 6: <std::sync::once_lock::OnceLock<alloc::string::String>>::initialize::<<std::sync::once_lock::OnceLock<alloc::string::String>>::get_or_init<public_typst_behavior::linnest_public_svg::{closure#0}>::{closure#0}, !>
  967. 228.52 s > 7: <public_typst_behavior::public_linnest_momentum_layers_place_shafts_and_labels::{closure#0} as core::ops::function::FnOnce<()>>::call_once
  968. 228.52 s > note: Some details are omitted, run with `RUST_BACKTRACE=full` for a verbose backtrace.
  969. 228.52 s > =========================================
  970. 228.52 s For full logs, run:
  971. 228.52 s nix log /nix/store/4pqspwvh8pi9s2vg9g6mfsggpl9ynwzx-gammaloop-nextest-clinnet.drv
  972. 229.29 s Run failed.