0.01 s
$ /nix/store/bhv6xyvqw6gjs3j488gi1z6wdv18bdpa-coreutils-9.11/bin/timeout --kill-after=15s 7200s /nix/store/bxgja2ppiqi6w2bgn0r07d7mgnl1k6k2-nix-2.34.8/bin/nix --extra-experimental-features nix-command --extra-experimental-features flakes flake clone git+https://github.com/alphal00p/gammaloop --dest /tmp/nix-ci-worker/stable-pwd/repo/
0.45 s
Cloning into '/tmp/nix-ci-worker/stable-pwd/repo'...
1.57 s
remote: Enumerating objects: 162134, done.
1.68 s
remote: Counting objects: 0% (1/16812)
remote: Counting objects: 1% (169/16812)
remote: Counting objects: 2% (337/16812)
remote: Counting objects: 3% (505/16812)
remote: Counting objects: 4% (673/16812)
remote: Counting objects: 5% (841/16812)
remote: Counting objects: 6% (1009/16812)
remote: Counting objects: 7% (1177/16812)
remote: Counting objects: 8% (1345/16812)
remote: Counting objects: 9% (1514/16812)
remote: Counting objects: 10% (1682/16812)
remote: Counting objects: 11% (1850/16812)
remote: Counting objects: 12% (2018/16812)
remote: Counting objects: 13% (2186/16812)
remote: Counting objects: 14% (2354/16812)
remote: Counting objects: 15% (2522/16812)
remote: Counting objects: 16% (2690/16812)
remote: Counting objects: 17% (2859/16812)
remote: Counting objects: 18% (3027/16812)
remote: Counting objects: 19% (3195/16812)
remote: Counting objects: 20% (3363/16812)
remote: Counting objects: 21% (3531/16812)
remote: Counting objects: 22% (3699/16812)
remote: Counting objects: 23% (3867/16812)
remote: Counting objects: 24% (4035/16812)
remote: Counting objects: 25% (4203/16812)
remote: Counting objects: 26% (4372/16812)
remote: Counting objects: 27% (4540/16812)
remote: Counting objects: 28% (4708/16812)
remote: Counting objects: 29% (4876/16812)
remote: Counting objects: 30% (5044/16812)
remote: Counting objects: 31% (5212/16812)
remote: Counting objects: 32% (5380/16812)
remote: Counting objects: 33% (5548/16812)
remote: Counting objects: 34% (5717/16812)
remote: Counting objects: 35% (5885/16812)
remote: Counting objects: 36% (6053/16812)
remote: Counting objects: 37% (6221/16812)
remote: Counting objects: 38% (6389/16812)
remote: Counting objects: 39% (6557/16812)
remote: Counting objects: 40% (6725/16812)
remote: Counting objects: 41% (6893/16812)
remote: Counting objects: 42% (7062/16812)
remote: Counting objects: 43% (7230/16812)
remote: Counting objects: 44% (7398/16812)
remote: Counting objects: 45% (7566/16812)
remote: Counting objects: 46% (7734/16812)
remote: Counting objects: 47% (7902/16812)
remote: Counting objects: 48% (8070/16812)
remote: Counting objects: 49% (8238/16812)
remote: Counting objects: 50% (8406/16812)
remote: Counting objects: 51% (8575/16812)
remote: Counting objects: 52% (8743/16812)
remote: Counting objects: 53% (8911/16812)
remote: Counting objects: 54% (9079/16812)
remote: Counting objects: 55% (9247/16812)
remote: Counting objects: 56% (9415/16812)
remote: Counting objects: 57% (9583/16812)
remote: Counting objects: 58% (9751/16812)
remote: Counting objects: 59% (9920/16812)
remote: Counting objects: 60% (10088/16812)
remote: Counting objects: 61% (10256/16812)
remote: Counting objects: 62% (10424/16812)
remote: Counting objects: 63% (10592/16812)
remote: Counting objects: 64% (10760/16812)
remote: Counting objects: 65% (10928/16812)
remote: Counting objects: 66% (11096/16812)
remote: Counting objects: 67% (11265/16812)
remote: Counting objects: 68% (11433/16812)
remote: Counting objects: 69% (11601/16812)
remote: Counting objects: 70% (11769/16812)
remote: Counting objects: 71% (11937/16812)
remote: Counting objects: 72% (12105/16812)
remote: Counting objects: 73% (12273/16812)
remote: Counting objects: 74% (12441/16812)
remote: Counting objects: 75% (12609/16812)
remote: Counting objects: 76% (12778/16812)
remote: Counting objects: 77% (12946/16812)
remote: Counting objects: 78% (13114/16812)
remote: Counting objects: 79% (13282/16812)
remote: Counting objects: 80% (13450/16812)
remote: Counting objects: 81% (13618/16812)
remote: Counting objects: 82% (13786/16812)
remote: Counting objects: 83% (13954/16812)
remote: Counting objects: 84% (14123/16812)
remote: Counting objects: 85% (14291/16812)
remote: Counting objects: 86% (14459/16812)
remote: Counting objects: 87% (14627/16812)
remote: Counting objects: 88% (14795/16812)
remote: Counting objects: 89% (14963/16812)
remote: Counting objects: 90% (15131/16812)
remote: Counting objects: 91% (15299/16812)
remote: Counting objects: 92% (15468/16812)
remote: Counting objects: 93% (15636/16812)
remote: Counting objects: 94% (15804/16812)
remote: Counting objects: 95% (15972/16812)
remote: Counting objects: 96% (16140/16812)
remote: Counting objects: 97% (16308/16812)
remote: Counting objects: 98% (16476/16812)
remote: Counting objects: 99% (16644/16812)
remote: Counting objects: 100% (16812/16812)
remote: Counting objects: 100% (16812/16812), done.
7.54 s
remote: Compressing objects: 0% (1/3844)
remote: Compressing objects: 1% (39/3844)
remote: Compressing objects: 2% (77/3844)
remote: Compressing objects: 3% (116/3844)
remote: Compressing objects: 4% (154/3844)
remote: Compressing objects: 5% (193/3844)
remote: Compressing objects: 6% (231/3844)
remote: Compressing objects: 7% (270/3844)
remote: Compressing objects: 8% (308/3844)
remote: Compressing objects: 9% (346/3844)
remote: Compressing objects: 10% (385/3844)
remote: Compressing objects: 10% (416/3844)
remote: Compressing objects: 11% (423/3844)
remote: Compressing objects: 12% (462/3844)
remote: Compressing objects: 13% (500/3844)
remote: Compressing objects: 13% (535/3844)
remote: Compressing objects: 14% (539/3844)
remote: Compressing objects: 15% (577/3844)
remote: Compressing objects: 16% (616/3844)
remote: Compressing objects: 17% (654/3844)
remote: Compressing objects: 18% (692/3844)
remote: Compressing objects: 19% (731/3844)
remote: Compressing objects: 19% (755/3844)
remote: Compressing objects: 20% (769/3844)
remote: Compressing objects: 21% (808/3844)
remote: Compressing objects: 22% (846/3844)
remote: Compressing objects: 23% (885/3844)
remote: Compressing objects: 24% (923/3844)
remote: Compressing objects: 25% (961/3844)
remote: Compressing objects: 25% (962/3844)
remote: Compressing objects: 26% (1000/3844)
remote: Compressing objects: 27% (1038/3844)
remote: Compressing objects: 28% (1077/3844)
remote: Compressing objects: 29% (1115/3844)
remote: Compressing objects: 30% (1154/3844)
remote: Compressing objects: 31% (1192/3844)
remote: Compressing objects: 32% (1231/3844)
remote: Compressing objects: 33% (1269/3844)
remote: Compressing objects: 34% (1307/3844)
remote: Compressing objects: 35% (1346/3844)
remote: Compressing objects: 36% (1384/3844)
remote: Compressing objects: 37% (1423/3844)
remote: Compressing objects: 38% (1461/3844)
remote: Compressing objects: 39% (1500/3844)
remote: Compressing objects: 40% (1538/3844)
remote: Compressing objects: 41% (1577/3844)
remote: Compressing objects: 42% (1615/3844)
remote: Compressing objects: 43% (1653/3844)
remote: Compressing objects: 44% (1692/3844)
remote: Compressing objects: 45% (1730/3844)
remote: Compressing objects: 46% (1769/3844)
remote: Compressing objects: 47% (1807/3844)
remote: Compressing objects: 48% (1846/3844)
remote: Compressing objects: 49% (1884/3844)
remote: Compressing objects: 50% (1922/3844)
remote: Compressing objects: 51% (1961/3844)
remote: Compressing objects: 52% (1999/3844)
remote: Compressing objects: 53% (2038/3844)
remote: Compressing objects: 54% (2076/3844)
remote: Compressing objects: 55% (2115/3844)
remote: Compressing objects: 56% (2153/3844)
remote: Compressing objects: 57% (2192/3844)
remote: Compressing objects: 58% (2230/3844)
remote: Compressing objects: 59% (2268/3844)
remote: Compressing objects: 60% (2307/3844)
remote: Compressing objects: 61% (2345/3844)
remote: Compressing objects: 62% (2384/3844)
remote: Compressing objects: 63% (2422/3844)
remote: Compressing objects: 64% (2461/3844)
remote: Compressing objects: 65% (2499/3844)
remote: Compressing objects: 66% (2538/3844)
remote: Compressing objects: 67% (2576/3844)
remote: Compressing objects: 68% (2614/3844)
remote: Compressing objects: 69% (2653/3844)
remote: Compressing objects: 70% (2691/3844)
remote: Compressing objects: 71% (2730/3844)
remote: Compressing objects: 72% (2768/3844)
remote: Compressing objects: 73% (2807/3844)
remote: Compressing objects: 74% (2845/3844)
remote: Compressing objects: 75% (2883/3844)
remote: Compressing objects: 76% (2922/3844)
remote: Compressing objects: 77% (2960/3844)
remote: Compressing objects: 78% (2999/3844)
remote: Compressing objects: 79% (3037/3844)
remote: Compressing objects: 80% (3076/3844)
remote: Compressing objects: 81% (3114/3844)
remote: Compressing objects: 82% (3153/3844)
remote: Compressing objects: 83% (3191/3844)
remote: Compressing objects: 84% (3229/3844)
remote: Compressing objects: 85% (3268/3844)
remote: Compressing objects: 86% (3306/3844)
remote: Compressing objects: 87% (3345/3844)
remote: Compressing objects: 88% (3383/3844)
remote: Compressing objects: 89% (3422/3844)
remote: Compressing objects: 90% (3460/3844)
remote: Compressing objects: 91% (3499/3844)
remote: Compressing objects: 92% (3537/3844)
remote: Compressing objects: 93% (3575/3844)
remote: Compressing objects: 94% (3614/3844)
remote: Compressing objects: 95% (3652/3844)
remote: Compressing objects: 96% (3691/3844)
remote: Compressing objects: 97% (3729/3844)
remote: Compressing objects: 98% (3768/3844)
remote: Compressing objects: 99% (3806/3844)
remote: Compressing objects: 100% (3844/3844)
remote: Compressing objects: 100% (3844/3844), done.
23.85 s
Receiving objects: 0% (1/162134)
Receiving objects: 1% (1622/162134)
Receiving objects: 2% (3243/162134), 13.58 MiB | 26.63 MiB/s
Receiving objects: 3% (4865/162134), 13.58 MiB | 26.63 MiB/s
Receiving objects: 3% (5911/162134), 28.76 MiB | 28.39 MiB/s
Receiving objects: 4% (6486/162134), 28.76 MiB | 28.39 MiB/s
Receiving objects: 5% (8107/162134), 28.76 MiB | 28.39 MiB/s
Receiving objects: 6% (9729/162134), 43.65 MiB | 28.85 MiB/s
Receiving objects: 7% (11350/162134), 43.65 MiB | 28.85 MiB/s
Receiving objects: 7% (11668/162134), 43.65 MiB | 28.85 MiB/s
Receiving objects: 8% (12971/162134), 60.10 MiB | 29.85 MiB/s
Receiving objects: 9% (14593/162134), 60.10 MiB | 29.85 MiB/s
Receiving objects: 10% (16214/162134), 60.10 MiB | 29.85 MiB/s
Receiving objects: 11% (17835/162134), 74.43 MiB | 29.62 MiB/s
Receiving objects: 12% (19457/162134), 74.43 MiB | 29.62 MiB/s
Receiving objects: 12% (19704/162134), 74.43 MiB | 29.62 MiB/s
Receiving objects: 13% (21078/162134), 83.16 MiB | 27.60 MiB/s
Receiving objects: 14% (22699/162134), 83.16 MiB | 27.60 MiB/s
Receiving objects: 15% (24321/162134), 83.16 MiB | 27.60 MiB/s
Receiving objects: 16% (25942/162134), 83.16 MiB | 27.60 MiB/s
Receiving objects: 17% (27563/162134), 83.16 MiB | 27.60 MiB/s
Receiving objects: 18% (29185/162134), 83.16 MiB | 27.60 MiB/s
Receiving objects: 19% (30806/162134), 83.16 MiB | 27.60 MiB/s
Receiving objects: 20% (32427/162134), 83.16 MiB | 27.60 MiB/s
Receiving objects: 21% (34049/162134), 83.16 MiB | 27.60 MiB/s
Receiving objects: 22% (35670/162134), 83.16 MiB | 27.60 MiB/s
Receiving objects: 23% (37291/162134), 83.16 MiB | 27.60 MiB/s
Receiving objects: 24% (38913/162134), 83.16 MiB | 27.60 MiB/s
Receiving objects: 25% (40534/162134), 83.16 MiB | 27.60 MiB/s
Receiving objects: 26% (42155/162134), 83.16 MiB | 27.60 MiB/s
Receiving objects: 27% (43777/162134), 83.16 MiB | 27.60 MiB/s
Receiving objects: 28% (45398/162134), 83.16 MiB | 27.60 MiB/s
Receiving objects: 29% (47019/162134), 99.55 MiB | 28.34 MiB/s
Receiving objects: 30% (48641/162134), 99.55 MiB | 28.34 MiB/s
Receiving objects: 31% (50262/162134), 99.55 MiB | 28.34 MiB/s
Receiving objects: 31% (51882/162134), 99.55 MiB | 28.34 MiB/s
Receiving objects: 32% (51883/162134), 99.55 MiB | 28.34 MiB/s
Receiving objects: 33% (53505/162134), 113.21 MiB | 28.21 MiB/s
Receiving objects: 34% (55126/162134), 113.21 MiB | 28.21 MiB/s
Receiving objects: 35% (56747/162134), 113.21 MiB | 28.21 MiB/s
Receiving objects: 36% (58369/162134), 113.21 MiB | 28.21 MiB/s
Receiving objects: 37% (59990/162134), 126.17 MiB | 27.95 MiB/s
Receiving objects: 38% (61611/162134), 126.17 MiB | 27.95 MiB/s
Receiving objects: 39% (63233/162134), 126.17 MiB | 27.95 MiB/s
Receiving objects: 39% (64250/162134), 126.17 MiB | 27.95 MiB/s
Receiving objects: 40% (64854/162134), 139.95 MiB | 28.06 MiB/s
Receiving objects: 41% (66475/162134), 139.95 MiB | 28.06 MiB/s
Receiving objects: 42% (68097/162134), 139.95 MiB | 28.06 MiB/s
Receiving objects: 43% (69718/162134), 154.00 MiB | 27.83 MiB/s
Receiving objects: 43% (70846/162134), 154.00 MiB | 27.83 MiB/s
Receiving objects: 44% (71339/162134), 154.00 MiB | 27.83 MiB/s
Receiving objects: 45% (72961/162134), 168.21 MiB | 27.67 MiB/s
Receiving objects: 46% (74582/162134), 168.21 MiB | 27.67 MiB/s
Receiving objects: 47% (76203/162134), 182.53 MiB | 27.20 MiB/s
Receiving objects: 48% (77825/162134), 182.53 MiB | 27.20 MiB/s
Receiving objects: 49% (79446/162134), 182.53 MiB | 27.20 MiB/s
Receiving objects: 50% (81067/162134), 182.53 MiB | 27.20 MiB/s
Receiving objects: 51% (82689/162134), 182.53 MiB | 27.20 MiB/s
Receiving objects: 52% (84310/162134), 182.53 MiB | 27.20 MiB/s
Receiving objects: 53% (85932/162134), 182.53 MiB | 27.20 MiB/s
Receiving objects: 53% (86180/162134), 197.00 MiB | 27.20 MiB/s
Receiving objects: 54% (87553/162134), 197.00 MiB | 27.20 MiB/s
Receiving objects: 55% (89174/162134), 197.00 MiB | 27.20 MiB/s
Receiving objects: 55% (89772/162134), 211.98 MiB | 28.59 MiB/s
Receiving objects: 56% (90796/162134), 242.41 MiB | 28.67 MiB/s
Receiving objects: 56% (91110/162134), 242.41 MiB | 28.67 MiB/s
Receiving objects: 57% (92417/162134), 257.44 MiB | 29.13 MiB/s
Receiving objects: 58% (94038/162134), 273.98 MiB | 29.75 MiB/s
Receiving objects: 59% (95660/162134), 273.98 MiB | 29.75 MiB/s
Receiving objects: 60% (97281/162134), 273.98 MiB | 29.75 MiB/s
Receiving objects: 60% (97867/162134), 273.98 MiB | 29.75 MiB/s
Receiving objects: 61% (98902/162134), 290.23 MiB | 30.23 MiB/s
Receiving objects: 62% (100524/162134), 306.77 MiB | 30.76 MiB/s
Receiving objects: 63% (102145/162134), 306.77 MiB | 30.76 MiB/s
Receiving objects: 64% (103766/162134), 306.77 MiB | 30.76 MiB/s
Receiving objects: 65% (105388/162134), 306.77 MiB | 30.76 MiB/s
Receiving objects: 65% (105763/162134), 324.04 MiB | 31.41 MiB/s
Receiving objects: 66% (107009/162134), 324.04 MiB | 31.41 MiB/s
Receiving objects: 67% (108630/162134), 324.04 MiB | 31.41 MiB/s
Receiving objects: 68% (110252/162134), 324.04 MiB | 31.41 MiB/s
Receiving objects: 69% (111873/162134), 324.04 MiB | 31.41 MiB/s
Receiving objects: 70% (113494/162134), 324.04 MiB | 31.41 MiB/s
Receiving objects: 71% (115116/162134), 324.04 MiB | 31.41 MiB/s
Receiving objects: 72% (116737/162134), 324.04 MiB | 31.41 MiB/s
Receiving objects: 73% (118358/162134), 324.04 MiB | 31.41 MiB/s
Receiving objects: 74% (119980/162134), 340.73 MiB | 31.93 MiB/s
Receiving objects: 75% (121601/162134), 340.73 MiB | 31.93 MiB/s
Receiving objects: 76% (123222/162134), 340.73 MiB | 31.93 MiB/s
Receiving objects: 76% (123640/162134), 340.73 MiB | 31.93 MiB/s
Receiving objects: 77% (124844/162134), 358.41 MiB | 32.53 MiB/s
Receiving objects: 78% (126465/162134), 358.41 MiB | 32.53 MiB/s
Receiving objects: 79% (128086/162134), 358.41 MiB | 32.53 MiB/s
Receiving objects: 80% (129708/162134), 358.41 MiB | 32.53 MiB/s
Receiving objects: 81% (131329/162134), 376.84 MiB | 33.28 MiB/s
Receiving objects: 81% (131979/162134), 393.65 MiB | 33.58 MiB/s
Receiving objects: 82% (132950/162134), 410.38 MiB | 33.96 MiB/s
Receiving objects: 83% (134572/162134), 410.38 MiB | 33.96 MiB/s
Receiving objects: 83% (135971/162134), 427.26 MiB | 34.02 MiB/s
Receiving objects: 84% (136193/162134), 427.26 MiB | 34.02 MiB/s
Receiving objects: 85% (137814/162134), 427.26 MiB | 34.02 MiB/s
Receiving objects: 86% (139436/162134), 427.26 MiB | 34.02 MiB/s
Receiving objects: 86% (140279/162134), 460.99 MiB | 34.21 MiB/s
Receiving objects: 87% (141057/162134), 460.99 MiB | 34.21 MiB/s
Receiving objects: 88% (142678/162134), 460.99 MiB | 34.21 MiB/s
Receiving objects: 89% (144300/162134), 460.99 MiB | 34.21 MiB/s
Receiving objects: 90% (145921/162134), 477.66 MiB | 34.08 MiB/s
Receiving objects: 91% (147542/162134), 477.66 MiB | 34.08 MiB/s
Receiving objects: 92% (149164/162134), 477.66 MiB | 34.08 MiB/s
Receiving objects: 93% (150785/162134), 477.66 MiB | 34.08 MiB/s
Receiving objects: 94% (152406/162134), 477.66 MiB | 34.08 MiB/s
Receiving objects: 95% (154028/162134), 477.66 MiB | 34.08 MiB/s
Receiving objects: 96% (155649/162134), 477.66 MiB | 34.08 MiB/s
Receiving objects: 97% (157270/162134), 477.66 MiB | 34.08 MiB/s
Receiving objects: 98% (158892/162134), 477.66 MiB | 34.08 MiB/s
Receiving objects: 98% (159715/162134), 477.66 MiB | 34.08 MiB/s
Receiving objects: 99% (160513/162134), 492.87 MiB | 33.75 MiB/s
remote: Total 162134 (delta 14203), reused 13455 (delta 12950), pack-reused 145322 (from 3)
23.85 s
Receiving objects: 100% (162134/162134), 492.87 MiB | 33.75 MiB/s
Receiving objects: 100% (162134/162134), 500.72 MiB | 30.71 MiB/s, done.
30.82 s
Resolving deltas: 0% (0/105841)
Resolving deltas: 1% (1059/105841)
Resolving deltas: 2% (2117/105841)
Resolving deltas: 3% (3176/105841)
Resolving deltas: 4% (4235/105841)
Resolving deltas: 5% (5293/105841)
Resolving deltas: 6% (6351/105841)
Resolving deltas: 7% (7409/105841)
Resolving deltas: 8% (8468/105841)
Resolving deltas: 9% (9526/105841)
Resolving deltas: 10% (10585/105841)
Resolving deltas: 11% (11643/105841)
Resolving deltas: 12% (12703/105841)
Resolving deltas: 13% (13760/105841)
Resolving deltas: 14% (14819/105841)
Resolving deltas: 14% (15552/105841)
Resolving deltas: 15% (15877/105841)
Resolving deltas: 16% (16936/105841)
Resolving deltas: 17% (17993/105841)
Resolving deltas: 18% (19052/105841)
Resolving deltas: 19% (20110/105841)
Resolving deltas: 20% (21170/105841)
Resolving deltas: 21% (22227/105841)
Resolving deltas: 22% (23286/105841)
Resolving deltas: 22% (23318/105841)
Resolving deltas: 23% (24344/105841)
Resolving deltas: 24% (25402/105841)
Resolving deltas: 25% (26461/105841)
Resolving deltas: 26% (27519/105841)
Resolving deltas: 27% (28578/105841)
Resolving deltas: 28% (29636/105841)
Resolving deltas: 29% (30694/105841)
Resolving deltas: 30% (31753/105841)
Resolving deltas: 31% (32811/105841)
Resolving deltas: 32% (33870/105841)
Resolving deltas: 33% (34928/105841)
Resolving deltas: 33% (34963/105841)
Resolving deltas: 34% (35986/105841)
Resolving deltas: 35% (37045/105841)
Resolving deltas: 36% (38103/105841)
Resolving deltas: 37% (39162/105841)
Resolving deltas: 38% (40220/105841)
Resolving deltas: 39% (41278/105841)
Resolving deltas: 40% (42337/105841)
Resolving deltas: 41% (43395/105841)
Resolving deltas: 42% (44454/105841)
Resolving deltas: 43% (45512/105841)
Resolving deltas: 44% (46574/105841)
Resolving deltas: 45% (47629/105841)
Resolving deltas: 46% (48688/105841)
Resolving deltas: 47% (49746/105841)
Resolving deltas: 48% (50805/105841)
Resolving deltas: 49% (51863/105841)
Resolving deltas: 50% (52921/105841)
Resolving deltas: 51% (53979/105841)
Resolving deltas: 52% (55038/105841)
Resolving deltas: 53% (56097/105841)
Resolving deltas: 54% (57155/105841)
Resolving deltas: 55% (58215/105841)
Resolving deltas: 55% (58751/105841)
Resolving deltas: 56% (59271/105841)
Resolving deltas: 57% (60330/105841)
Resolving deltas: 58% (61389/105841)
Resolving deltas: 59% (62447/105841)
Resolving deltas: 60% (63505/105841)
Resolving deltas: 61% (64564/105841)
Resolving deltas: 62% (65622/105841)
Resolving deltas: 63% (66681/105841)
Resolving deltas: 64% (67739/105841)
Resolving deltas: 65% (68797/105841)
Resolving deltas: 65% (68972/105841)
Resolving deltas: 66% (69856/105841)
Resolving deltas: 67% (70914/105841)
Resolving deltas: 68% (71974/105841)
Resolving deltas: 69% (73031/105841)
Resolving deltas: 70% (74089/105841)
Resolving deltas: 71% (75148/105841)
Resolving deltas: 72% (76206/105841)
Resolving deltas: 73% (77266/105841)
Resolving deltas: 74% (78323/105841)
Resolving deltas: 75% (79381/105841)
Resolving deltas: 76% (80440/105841)
Resolving deltas: 77% (81498/105841)
Resolving deltas: 78% (82556/105841)
Resolving deltas: 79% (83615/105841)
Resolving deltas: 80% (84673/105841)
Resolving deltas: 81% (85732/105841)
Resolving deltas: 82% (86790/105841)
Resolving deltas: 83% (87849/105841)
Resolving deltas: 84% (88907/105841)
Resolving deltas: 85% (89967/105841)
Resolving deltas: 85% (90285/105841)
Resolving deltas: 86% (91024/105841)
Resolving deltas: 87% (92082/105841)
Resolving deltas: 88% (93141/105841)
Resolving deltas: 89% (94199/105841)
Resolving deltas: 90% (95257/105841)
Resolving deltas: 91% (96317/105841)
Resolving deltas: 92% (97374/105841)
Resolving deltas: 93% (98433/105841)
Resolving deltas: 94% (99491/105841)
Resolving deltas: 95% (100549/105841)
Resolving deltas: 96% (101608/105841)
Resolving deltas: 97% (102667/105841)
Resolving deltas: 98% (103725/105841)
Resolving deltas: 99% (104783/105841)
Resolving deltas: 100% (105841/105841)
Resolving deltas: 100% (105841/105841), done.
32.29 s
Fetching commit 28fcf79e14ebb84152c7cac3ddc7570f2cfbb35d for codex/ninjars-generator-serial ...
32.29 s
$ /nix/store/b1wn5clix1mz4vpfih7x9cnj9qfh7c6h-git-2.54.0/bin/git fetch origin 28fcf79e14ebb84152c7cac3ddc7570f2cfbb35d
33.01 s
From https://github.com/alphal00p/gammaloop
33.01 s
* branch 28fcf79e14ebb84152c7cac3ddc7570f2cfbb35d -> FETCH_HEAD
33.14 s
$ /nix/store/bhv6xyvqw6gjs3j488gi1z6wdv18bdpa-coreutils-9.11/bin/timeout --kill-after=15s 7200s /nix/store/b1wn5clix1mz4vpfih7x9cnj9qfh7c6h-git-2.54.0/bin/git -c advice.detachedHead=false checkout 28fcf79e14ebb84152c7cac3ddc7570f2cfbb35d
33.96 s
HEAD is now at 28fcf79e1 Merge branch 'complex-null-spinors' into codex/ninjars-generator-serial
33.99 s
$ /nix/store/bhv6xyvqw6gjs3j488gi1z6wdv18bdpa-coreutils-9.11/bin/timeout --kill-after=15s 7200s /nix/store/bxgja2ppiqi6w2bgn0r07d7mgnl1k6k2-nix-2.34.8/bin/nix --extra-experimental-features nix-command --extra-experimental-features flakes --log-format internal-json run .#packages.x86_64-linux.nix-ci-check-gammaloop-nextest-clinnet --print-build-logs
34.50 s
warning: ignoring untrusted flake configuration setting 'extra-substituters'.
34.50 s
Pass '--accept-flake-config' to trust it
34.50 s
warning: ignoring untrusted flake configuration setting 'extra-trusted-public-keys'.
34.50 s
Pass '--accept-flake-config' to trust it
44.15 s
45.47 s
Building /nix/store/wjmi88614qakla0g6gk0571gsbmbh933-nix-ci-check-gammaloop-nextest-clinnet.drv
45.48 s
[nix-ci-check-gammaloop-nextest-clinnet] structuredAttrs is enabled
45.82 s
[nix-ci-check-gammaloop-nextest-clinnet:post-build] Uploading to the NixCI cache: /nix/store/s5p2nyff7f1snijpvjf5jb9jls2rmky5-nix-ci-check-gammaloop-nextest-clinnet
47.00 s
[nix-ci-check-gammaloop-nextest-clinnet:post-build] warning: 'warn-short-path-literals' is deprecated, use 'lint-short-path-literals = ignore' instead
47.10 s
[nix-ci-check-gammaloop-nextest-clinnet:post-build] copying 1 paths...
47.10 s
[nix-ci-check-gammaloop-nextest-clinnet:post-build] copying path '/nix/store/s5p2nyff7f1snijpvjf5jb9jls2rmky5-nix-ci-check-gammaloop-nextest-clinnet' to 'https://cache.nix-ci.com'...
48.67 s
[nix-ci-check-gammaloop-nextest-clinnet:post-build] warning: 'warn-short-path-literals' is deprecated, use 'lint-short-path-literals = ignore' instead
49.18 s
[nix-ci-check-gammaloop-nextest-clinnet:post-build] copying 0 paths...
49.33 s
Uploaded nix-ci-check-gammaloop-nextest-clinnet in 3.7s
49.33 s
Progress: 1 of 2 built
49.33 s
Built nix-ci-check-gammaloop-nextest-clinnet in 3.8s
49.33 s
Progress: 2 of 2 built
49.74 s
evaluating derivation 'gdo you want to allow configuration setting 'extra-substituters' to be set to 'https://cache.nix-ci.com ' (y/N)? do you want to permanently mark this value as untrusted (y/N)? warning: ignoring untrusted flake configuration setting 'extra-substituters'.
49.74 s
Pass '--accept-flake-config' to trust it
49.74 s
do you want to allow configuration setting 'extra-trusted-public-keys' to be set to 'nix-ci:g3xV5BDTLtIBZr/A00IU1x0EtKKlb7YLgBN2SgYgM6A= ' (y/N)? do you want to permanently mark this value as untrusted (y/N)? warning: ignoring untrusted flake configuration setting 'extra-trusted-public-keys'.
49.74 s
Pass '--accept-flake-config' to trust it
64.83 s
copying '/nix/store/g3qy
evaluating derivation 'g
copying '/nix/store/g3qy
evaluating derivation 'g
copying '/nix/store/g3qy
evaluating derivation 'g
copying '/nix/store/g3qy
evaluating derivation 'g
copying '/nix/store/g3qy
evaluating derivation 'g
copying '/nix/store/g3qy
evaluating derivation 'g
copying '/nix/store/g3qy
evaluating derivation 'g
copying '/nix/store/g3qy
evaluating derivation 'g
querying gammaloop-nexte
[0.0 KiB DL] querying in
[3.9 KiB DL] querying ty
[16.0 KiB DL] querying l
[45.6 KiB DL] querying g
[52.5 KiB DL] querying b
[0 /6 built, 0 /12 copied
[0 /23 built, 7 /0 /66 copi
[0 /23 built, 16 /0 /74 cop
[0 /22 built, 16 /1 /74 cop
[0 /22 built, 16 /2 /74 cop
[0 /22 built, 16 /3 /74 cop
[0 /20 built, 15 /5 /74 cop
[0 /18 built, 15 /8 /74 cop
[0 /17 built, 12 /13 /74 co
[0 /17 built, 10 /16 /74 co
[0 /16 built, 9 /17 /74 cop
[0 /15 built, 9 /18 /74 cop
[0 /13 built, 7 /20 /74 cop
[0 /13 built, 5 /23 /74 cop
[0 /12 built, 5 /24 /74 cop
[0 /12 built, 5 /25 /74 cop
[0 /12 built, 4 /26 /74 cop
[0 /11 built, 3 /27 /74 cop
[1 /0 /10 built, 2 /28 /74 cgammaloop-nextest-binaries-clinnet (post)> Uploading to the NixCI cache: /nix/store/r6d9ks0lpr631mrcy43137c895a0w5ns-gammaloop-nextest-binaries-clinnet
65.63 s
gammaloop-nextest-binaries-clinnet (post)> warning: 'warn-short-path-literals' is deprecated, use 'lint-short-path-literals = ignore' instead
65.68 s
gammaloop-nextest-binaries-clinnet (post)> copying 1 paths...
65.68 s
gammaloop-nextest-binaries-clinnet (post)> copying path '/nix/store/r6d9ks0lpr631mrcy43137c895a0w5ns-gammaloop-nextest-binaries-clinnet' to 'https://cache.nix-ci.com'...
67.14 s
gammaloop-nextest-binaries-clinnet (post)> warning: 'warn-short-path-literals' is deprecated, use 'lint-short-path-literals = ignore' instead
67.57 s
gammaloop-nextest-binaries-clinnet (post)> copying 3 paths...
67.58 s
gammaloop-nextest-binaries-clinnet (post)> copying path '/nix/store/z2dnrzj27zvlx8i7sp2w6l0pzdsdgqgx-tar-1.35.tar.xz.drv' to 'https://cache.nix-ci.com'...
67.58 s
gammaloop-nextest-binaries-clinnet (post)> copying path '/nix/store/54z51gy09vs0jf7kjlsqdm22pzmnrcnn-gammaloop-workspace-deps-deps-0.1.0.drv' to 'https://cache.nix-ci.com'...
69.31 s
gammaloop-nextest-binaries-clinnet (post)> copying path '/nix/store/0amrbc8k5d3cjvq7ah3iflsqfph1wqgq-gnutar-1.35.drv' to 'https://cache.nix-ci.com'...
72.14 s
[1 /10 built, 16 /30 /74 co
[1 /10 built, 16 /33 /74 co
[1 /10 built, 16 /34 /74 co
[1 /9 built, 15 /40 /74 cop
[1 /9 built, 12 /45 /74 cop
[1 /9 built, 14 /49 /74 cop
[1 /9 built, 10 /53 /74 cop
[1 /9 built, 9 /55 /74 copi
[1 /8 built, 4 /61 /74 copi
[1 /8 built, 5 /61 /74 copi
[1 /8 built, 4 /62 /74 copi
[1 /8 built, 4 /63 /74 copi
[1 /8 built, 6 /64 /74 copi
[1 /7 built, 5 /65 /74 copi
[1 /7 built, 4 /66 /74 copi
[1 /7 built, 4 /67 /74 copi
[1 /7 built, 4 /68 /74 copi
[1 /6 built, 3 /69 /74 copi
[1 /1 /6 built, 3 /69 /74 co
[1 /1 /6 built, 2 /70 /74 cobuilder.pl> Running phase: patchPhase
72.16 s
builder.pl> Running phase: updateAutotoolsGnuConfigScriptsPhase
72.19 s
builder.pl> Running phase: configurePhase
72.21 s
builder.pl> no configure script, doing nothing
72.21 s
builder.pl> Running phase: buildPhase
72.22 s
builder.pl> Running phase: checkPhase
72.23 s
builder.pl> Running phase: installPhase
72.24 s
builder.pl> no Makefile or custom installPhase, doing nothing
72.25 s
builder.pl> Running phase: fixupPhase
72.26 s
builder.pl> shrinking RPATHs of ELF executables and libraries in /nix/store/zzmspl8wdn2a3ancrz8dg3kci887nw6d-builder.pl
72.27 s
builder.pl> checking for references to /build/ in /nix/store/zzmspl8wdn2a3ancrz8dg3kci887nw6d-builder.pl...
72.31 s
builder.pl> patching script interpreter paths in /nix/store/zzmspl8wdn2a3ancrz8dg3kci887nw6d-builder.pl
72.55 s
builder.pl (post)> Uploading to the NixCI cache: /nix/store/zzmspl8wdn2a3ancrz8dg3kci887nw6d-builder.pl
73.63 s
builder.pl (post)> warning: 'warn-short-path-literals' is deprecated, use 'lint-short-path-literals = ignore' instead
73.92 s
builder.pl (post)> copying 0 paths...
75.51 s
builder.pl (post)> warning: 'warn-short-path-literals' is deprecated, use 'lint-short-path-literals = ignore' instead
75.96 s
builder.pl (post)> copying 0 paths...
76.49 s
[2 /5 built, 1 /72 /74 copi
[2 /5 built, 1 /73 /74 copi
[2 /4 built, 74 copied (6 typst> structuredAttrs is enabled
76.60 s
[1 /2 /4 built, 74 copied typst> created 10 symlinks in user environment
77.01 s
typst (post)> Uploading to the NixCI cache: /nix/store/5f1a3n27fy3y8pf6snxr2sbzwhk9brr2-typst-0.15.1-env
78.38 s
typst (post)> warning: 'warn-short-path-literals' is deprecated, use 'lint-short-path-literals = ignore' instead
78.93 s
typst (post)> copying 0 paths...
80.53 s
typst (post)> warning: 'warn-short-path-literals' is deprecated, use 'lint-short-path-literals = ignore' instead
81.19 s
typst (post)> copying 0 paths...
83.58 s
[3 /5 built, 74 copied (6
[1 /3 /4 built, 74 copied gammaloop-nextest-clinnet> Nextest worker budget: 16
83.60 s
gammaloop-nextest-clinnet> Extracting 4 binaries (including 1 non-test binary), 1 build script output directory, and 1 linked path to /build/source
83.77 s
gammaloop-nextest-clinnet> Extracted 16 files to /build/source in 0.17s
83.82 s
gammaloop-nextest-clinnet> ------------
83.82 s
gammaloop-nextest-clinnet> Nextest run ID 47d1530f-9357-4427-a157-73d5663450e6 with nextest profile: ci_gammaloop
83.82 s
gammaloop-nextest-clinnet> Starting 38 tests across 3 binaries
235.71 s
gammaloop-nextest-clinnet> FAIL [ 151.829s] (32/38) clinnet::public_typst_behavior public_linnest_fixture_assertions_hold
235.71 s
gammaloop-nextest-clinnet> stdout ---
235.71 s
gammaloop-nextest-clinnet>
235.71 s
gammaloop-nextest-clinnet> running 1 test
235.71 s
gammaloop-nextest-clinnet> test public_linnest_fixture_assertions_hold has been running for over 60 seconds
235.71 s
gammaloop-nextest-clinnet> test public_linnest_fixture_assertions_hold ... FAILED
235.71 s
gammaloop-nextest-clinnet>
235.71 s
gammaloop-nextest-clinnet> failures:
235.71 s
gammaloop-nextest-clinnet>
235.71 s
gammaloop-nextest-clinnet> failures:
235.71 s
gammaloop-nextest-clinnet> public_linnest_fixture_assertions_hold
235.71 s
gammaloop-nextest-clinnet>
235.71 s
gammaloop-nextest-clinnet> test result: FAILED. 0 passed; 1 failed; 0 ignored; 0 measured; 17 filtered out; finished in 151.81s
235.71 s
gammaloop-nextest-clinnet>
235.71 s
gammaloop-nextest-clinnet> stderr ---
235.71 s
gammaloop-nextest-clinnet>
235.71 s
gammaloop-nextest-clinnet> thread 'public_linnest_fixture_assertions_hold' (280) panicked at crates/clinnet/tests/public_typst_behavior.rs:81:55:
235.71 s
gammaloop-nextest-clinnet> called `Result::unwrap()` on an `Err` value: typst failed while compiling template /build/.tmpYJzetH/.clinnet/templates/linnest-public-behavior.svg
235.71 s
gammaloop-nextest-clinnet>
235.71 s
gammaloop-nextest-clinnet> Command executed:
235.71 s
gammaloop-nextest-clinnet> "typst" "c" "/build/.tmpYJzetH/.clinnet/templates/linnest-public-behavior.typ" "/build/.tmpYJzetH/.clinnet/templates/linnest-public-behavior.svg" "--root" "/build/.tmpYJzetH/.clinnet/templates"
235.71 s
gammaloop-nextest-clinnet>
235.71 s
gammaloop-nextest-clinnet> Typst stdout:
235.71 s
gammaloop-nextest-clinnet>
235.71 s
gammaloop-nextest-clinnet>
235.71 s
gammaloop-nextest-clinnet> Typst stderr:
235.71 s
gammaloop-nextest-clinnet>
235.71 s
gammaloop-nextest-clinnet>
235.71 s
gammaloop-nextest-clinnet> Location:
235.71 s
gammaloop-nextest-clinnet> crates/clinnet/src/lib.rs:741:13
235.71 s
gammaloop-nextest-clinnet> stack backtrace:
235.71 s
gammaloop-nextest-clinnet> 0: __rustc::rust_begin_unwind
235.71 s
gammaloop-nextest-clinnet> 1: core::panicking::panic_fmt
235.71 s
gammaloop-nextest-clinnet> 2: core::result::unwrap_failed
235.71 s
gammaloop-nextest-clinnet> 3: public_typst_behavior::render
235.71 s
gammaloop-nextest-clinnet> 4: <std::sync::once::Once>::call_once_force::<<std::sync::once_lock::OnceLock<alloc::string::String>>::initialize<<std::sync::once_lock::OnceLock<alloc::string::String>>::get_or_init<public_typst_behavior::linnest_public_svg::{closure#0}>::{closure#0}, !>::{closure#0}>::{closure#0}
235.71 s
gammaloop-nextest-clinnet> 5: <std::sys::sync::once::futex::Once>::call
235.71 s
gammaloop-nextest-clinnet> 6: <std::sync::once_lock::OnceLock<alloc::string::String>>::initialize::<<std::sync::once_lock::OnceLock<alloc::string::String>>::get_or_init<public_typst_behavior::linnest_public_svg::{closure#0}>::{closure#0}, !>
235.71 s
gammaloop-nextest-clinnet> 7: <public_typst_behavior::public_linnest_fixture_assertions_hold::{closure#0} as core::ops::function::FnOnce<()>>::call_once
235.71 s
gammaloop-nextest-clinnet> note: Some details are omitted, run with `RUST_BACKTRACE=full` for a verbose backtrace.
235.71 s
gammaloop-nextest-clinnet>
240.91 s
gammaloop-nextest-clinnet> FAIL [ 157.034s] (33/38) clinnet::public_typst_behavior public_linnest_endpoint_anchor_distances_stay_local
240.91 s
gammaloop-nextest-clinnet> stdout ---
240.91 s
gammaloop-nextest-clinnet>
240.91 s
gammaloop-nextest-clinnet> running 1 test
240.91 s
gammaloop-nextest-clinnet> test public_linnest_endpoint_anchor_distances_stay_local has been running for over 60 seconds
240.91 s
gammaloop-nextest-clinnet> test public_linnest_endpoint_anchor_distances_stay_local ... FAILED
240.91 s
gammaloop-nextest-clinnet>
240.91 s
gammaloop-nextest-clinnet> failures:
240.91 s
gammaloop-nextest-clinnet>
240.91 s
gammaloop-nextest-clinnet> failures:
240.91 s
gammaloop-nextest-clinnet> public_linnest_endpoint_anchor_distances_stay_local
240.91 s
gammaloop-nextest-clinnet>
240.91 s
gammaloop-nextest-clinnet> test result: FAILED. 0 passed; 1 failed; 0 ignored; 0 measured; 17 filtered out; finished in 157.02s
240.91 s
gammaloop-nextest-clinnet>
240.91 s
gammaloop-nextest-clinnet> stderr ---
240.91 s
gammaloop-nextest-clinnet>
240.91 s
gammaloop-nextest-clinnet> thread 'public_linnest_endpoint_anchor_distances_stay_local' (271) panicked at crates/clinnet/tests/public_typst_behavior.rs:81:55:
240.91 s
gammaloop-nextest-clinnet> called `Result::unwrap()` on an `Err` value: typst failed while compiling template /build/.tmp36x17R/.clinnet/templates/linnest-public-behavior.svg
240.91 s
gammaloop-nextest-clinnet>
240.91 s
gammaloop-nextest-clinnet> Command executed:
240.91 s
gammaloop-nextest-clinnet> "typst" "c" "/build/.tmp36x17R/.clinnet/templates/linnest-public-behavior.typ" "/build/.tmp36x17R/.clinnet/templates/linnest-public-behavior.svg" "--root" "/build/.tmp36x17R/.clinnet/templates"
240.91 s
gammaloop-nextest-clinnet>
240.91 s
gammaloop-nextest-clinnet> Typst stdout:
240.91 s
gammaloop-nextest-clinnet>
240.91 s
gammaloop-nextest-clinnet>
240.91 s
gammaloop-nextest-clinnet> Typst stderr:
240.91 s
gammaloop-nextest-clinnet>
240.91 s
gammaloop-nextest-clinnet>
240.91 s
gammaloop-nextest-clinnet> Location:
240.91 s
gammaloop-nextest-clinnet> crates/clinnet/src/lib.rs:741:13
240.91 s
gammaloop-nextest-clinnet> stack backtrace:
240.91 s
gammaloop-nextest-clinnet> 0: __rustc::rust_begin_unwind
240.91 s
gammaloop-nextest-clinnet> 1: core::panicking::panic_fmt
240.91 s
gammaloop-nextest-clinnet> 2: core::result::unwrap_failed
240.91 s
gammaloop-nextest-clinnet> 3: public_typst_behavior::render
240.92 s
gammaloop-nextest-clinnet> 4: <std::sync::once::Once>::call_once_force::<<std::sync::once_lock::OnceLock<alloc::string::String>>::initialize<<std::sync::once_lock::OnceLock<alloc::string::String>>::get_or_init<public_typst_behavior::linnest_public_svg::{closure#0}>::{closure#0}, !>::{closure#0}>::{closure#0}
240.92 s
gammaloop-nextest-clinnet> 5: <std::sys::sync::once::futex::Once>::call
240.92 s
gammaloop-nextest-clinnet> 6: <std::sync::once_lock::OnceLock<alloc::string::String>>::initialize::<<std::sync::once_lock::OnceLock<alloc::string::String>>::get_or_init<public_typst_behavior::linnest_public_svg::{closure#0}>::{closure#0}, !>
240.92 s
gammaloop-nextest-clinnet> 7: <public_typst_behavior::public_linnest_endpoint_anchor_distances_stay_local::{closure#0} as core::ops::function::FnOnce<()>>::call_once
240.92 s
gammaloop-nextest-clinnet> note: Some details are omitted, run with `RUST_BACKTRACE=full` for a verbose backtrace.
240.92 s
gammaloop-nextest-clinnet>
259.09 s
gammaloop-nextest-clinnet> FAIL [ 175.230s] (34/38) clinnet::public_typst_behavior public_linnest_arrow_shafts_and_crossing_gaps
259.09 s
gammaloop-nextest-clinnet> stdout ---
259.09 s
gammaloop-nextest-clinnet>
259.09 s
gammaloop-nextest-clinnet> running 1 test
259.09 s
gammaloop-nextest-clinnet> test public_linnest_arrow_shafts_and_crossing_gaps has been running for over 60 seconds
259.09 s
gammaloop-nextest-clinnet> test public_linnest_arrow_shafts_and_crossing_gaps ... FAILED
259.09 s
gammaloop-nextest-clinnet>
259.09 s
gammaloop-nextest-clinnet> failures:
259.09 s
gammaloop-nextest-clinnet>
259.09 s
gammaloop-nextest-clinnet> failures:
259.09 s
gammaloop-nextest-clinnet> public_linnest_arrow_shafts_and_crossing_gaps
259.09 s
gammaloop-nextest-clinnet>
259.09 s
gammaloop-nextest-clinnet> test result: FAILED. 0 passed; 1 failed; 0 ignored; 0 measured; 17 filtered out; finished in 175.21s
259.09 s
gammaloop-nextest-clinnet>
259.09 s
gammaloop-nextest-clinnet> stderr ---
259.09 s
gammaloop-nextest-clinnet>
259.09 s
gammaloop-nextest-clinnet> thread 'public_linnest_arrow_shafts_and_crossing_gaps' (268) panicked at crates/clinnet/tests/public_typst_behavior.rs:81:55:
259.09 s
gammaloop-nextest-clinnet> called `Result::unwrap()` on an `Err` value: typst failed while compiling template /build/.tmpoTIIdD/.clinnet/templates/linnest-public-behavior.svg
259.09 s
gammaloop-nextest-clinnet>
259.09 s
gammaloop-nextest-clinnet> Command executed:
259.09 s
gammaloop-nextest-clinnet> "typst" "c" "/build/.tmpoTIIdD/.clinnet/templates/linnest-public-behavior.typ" "/build/.tmpoTIIdD/.clinnet/templates/linnest-public-behavior.svg" "--root" "/build/.tmpoTIIdD/.clinnet/templates"
259.09 s
gammaloop-nextest-clinnet>
259.09 s
gammaloop-nextest-clinnet> Typst stdout:
259.09 s
gammaloop-nextest-clinnet>
259.09 s
gammaloop-nextest-clinnet>
259.09 s
gammaloop-nextest-clinnet> Typst stderr:
259.09 s
gammaloop-nextest-clinnet>
259.09 s
gammaloop-nextest-clinnet>
259.09 s
gammaloop-nextest-clinnet> Location:
259.09 s
gammaloop-nextest-clinnet> crates/clinnet/src/lib.rs:741:13
259.09 s
gammaloop-nextest-clinnet> stack backtrace:
259.09 s
gammaloop-nextest-clinnet> 0: __rustc::rust_begin_unwind
259.09 s
gammaloop-nextest-clinnet> 1: core::panicking::panic_fmt
259.09 s
gammaloop-nextest-clinnet> 2: core::result::unwrap_failed
259.09 s
gammaloop-nextest-clinnet> 3: public_typst_behavior::render
259.09 s
gammaloop-nextest-clinnet> 4: <std::sync::once::Once>::call_once_force::<<std::sync::once_lock::OnceLock<alloc::string::String>>::initialize<<std::sync::once_lock::OnceLock<alloc::string::String>>::get_or_init<public_typst_behavior::linnest_public_svg::{closure#0}>::{closure#0}, !>::{closure#0}>::{closure#0}
259.09 s
gammaloop-nextest-clinnet> 5: <std::sys::sync::once::futex::Once>::call
259.09 s
gammaloop-nextest-clinnet> 6: <std::sync::once_lock::OnceLock<alloc::string::String>>::initialize::<<std::sync::once_lock::OnceLock<alloc::string::String>>::get_or_init<public_typst_behavior::linnest_public_svg::{closure#0}>::{closure#0}, !>
259.09 s
gammaloop-nextest-clinnet> 7: <public_typst_behavior::public_linnest_arrow_shafts_and_crossing_gaps::{closure#0} as core::ops::function::FnOnce<()>>::call_once
259.09 s
gammaloop-nextest-clinnet> note: Some details are omitted, run with `RUST_BACKTRACE=full` for a verbose backtrace.
259.09 s
gammaloop-nextest-clinnet>
276.11 s
gammaloop-nextest-clinnet> ------------
276.11 s
gammaloop-nextest-clinnet> Summary [ 192.288s] 38 tests run: 35 passed (4 slow ), 3 failed , 0 skipped
276.11 s
gammaloop-nextest-clinnet> FAIL [ 151.829s] (32/38) clinnet::public_typst_behavior public_linnest_fixture_assertions_hold
276.11 s
gammaloop-nextest-clinnet> stdout ---
276.11 s
gammaloop-nextest-clinnet>
276.11 s
gammaloop-nextest-clinnet> running 1 test
276.11 s
gammaloop-nextest-clinnet> test public_linnest_fixture_assertions_hold has been running for over 60 seconds
276.11 s
gammaloop-nextest-clinnet> test public_linnest_fixture_assertions_hold ... FAILED
276.11 s
gammaloop-nextest-clinnet>
276.11 s
gammaloop-nextest-clinnet> failures:
276.11 s
gammaloop-nextest-clinnet>
276.11 s
gammaloop-nextest-clinnet> failures:
276.11 s
gammaloop-nextest-clinnet> public_linnest_fixture_assertions_hold
276.11 s
gammaloop-nextest-clinnet>
276.11 s
gammaloop-nextest-clinnet> test result: FAILED. 0 passed; 1 failed; 0 ignored; 0 measured; 17 filtered out; finished in 151.81s
276.11 s
gammaloop-nextest-clinnet>
276.11 s
gammaloop-nextest-clinnet> stderr ---
276.11 s
gammaloop-nextest-clinnet>
276.11 s
gammaloop-nextest-clinnet> thread 'public_linnest_fixture_assertions_hold' (280) panicked at crates/clinnet/tests/public_typst_behavior.rs:81:55:
276.11 s
gammaloop-nextest-clinnet> called `Result::unwrap()` on an `Err` value: typst failed while compiling template /build/.tmpYJzetH/.clinnet/templates/linnest-public-behavior.svg
276.11 s
gammaloop-nextest-clinnet>
276.11 s
gammaloop-nextest-clinnet> Command executed:
276.11 s
gammaloop-nextest-clinnet> "typst" "c" "/build/.tmpYJzetH/.clinnet/templates/linnest-public-behavior.typ" "/build/.tmpYJzetH/.clinnet/templates/linnest-public-behavior.svg" "--root" "/build/.tmpYJzetH/.clinnet/templates"
276.11 s
gammaloop-nextest-clinnet>
276.11 s
gammaloop-nextest-clinnet> Typst stdout:
276.11 s
gammaloop-nextest-clinnet>
276.11 s
gammaloop-nextest-clinnet>
276.11 s
gammaloop-nextest-clinnet> Typst stderr:
276.11 s
gammaloop-nextest-clinnet>
276.11 s
gammaloop-nextest-clinnet>
276.11 s
gammaloop-nextest-clinnet> Location:
276.11 s
gammaloop-nextest-clinnet> crates/clinnet/src/lib.rs:741:13
276.11 s
gammaloop-nextest-clinnet> stack backtrace:
276.11 s
gammaloop-nextest-clinnet> 0: __rustc::rust_begin_unwind
276.11 s
gammaloop-nextest-clinnet> 1: core::panicking::panic_fmt
276.11 s
gammaloop-nextest-clinnet> 2: core::result::unwrap_failed
276.11 s
gammaloop-nextest-clinnet> 3: public_typst_behavior::render
276.11 s
gammaloop-nextest-clinnet> 4: <std::sync::once::Once>::call_once_force::<<std::sync::once_lock::OnceLock<alloc::string::String>>::initialize<<std::sync::once_lock::OnceLock<alloc::string::String>>::get_or_init<public_typst_behavior::linnest_public_svg::{closure#0}>::{closure#0}, !>::{closure#0}>::{closure#0}
276.11 s
gammaloop-nextest-clinnet> 5: <std::sys::sync::once::futex::Once>::call
276.11 s
gammaloop-nextest-clinnet> 6: <std::sync::once_lock::OnceLock<alloc::string::String>>::initialize::<<std::sync::once_lock::OnceLock<alloc::string::String>>::get_or_init<public_typst_behavior::linnest_public_svg::{closure#0}>::{closure#0}, !>
276.11 s
gammaloop-nextest-clinnet> 7: <public_typst_behavior::public_linnest_fixture_assertions_hold::{closure#0} as core::ops::function::FnOnce<()>>::call_once
276.11 s
gammaloop-nextest-clinnet> note: Some details are omitted, run with `RUST_BACKTRACE=full` for a verbose backtrace.
276.11 s
gammaloop-nextest-clinnet>
276.11 s
gammaloop-nextest-clinnet> FAIL [ 157.034s] (33/38) clinnet::public_typst_behavior public_linnest_endpoint_anchor_distances_stay_local
276.11 s
gammaloop-nextest-clinnet> stdout ---
276.11 s
gammaloop-nextest-clinnet>
276.11 s
gammaloop-nextest-clinnet> running 1 test
276.11 s
gammaloop-nextest-clinnet> test public_linnest_endpoint_anchor_distances_stay_local has been running for over 60 seconds
276.11 s
gammaloop-nextest-clinnet> test public_linnest_endpoint_anchor_distances_stay_local ... FAILED
276.11 s
gammaloop-nextest-clinnet>
276.11 s
gammaloop-nextest-clinnet> failures:
276.11 s
gammaloop-nextest-clinnet>
276.11 s
gammaloop-nextest-clinnet> failures:
276.11 s
gammaloop-nextest-clinnet> public_linnest_endpoint_anchor_distances_stay_local
276.11 s
gammaloop-nextest-clinnet>
276.11 s
gammaloop-nextest-clinnet> test result: FAILED. 0 passed; 1 failed; 0 ignored; 0 measured; 17 filtered out; finished in 157.02s
276.11 s
gammaloop-nextest-clinnet>
276.11 s
gammaloop-nextest-clinnet> stderr ---
276.11 s
gammaloop-nextest-clinnet>
276.11 s
gammaloop-nextest-clinnet> thread 'public_linnest_endpoint_anchor_distances_stay_local' (271) panicked at crates/clinnet/tests/public_typst_behavior.rs:81:55:
276.11 s
gammaloop-nextest-clinnet> called `Result::unwrap()` on an `Err` value: typst failed while compiling template /build/.tmp36x17R/.clinnet/templates/linnest-public-behavior.svg
276.11 s
gammaloop-nextest-clinnet>
276.11 s
gammaloop-nextest-clinnet> Command executed:
276.11 s
gammaloop-nextest-clinnet> "typst" "c" "/build/.tmp36x17R/.clinnet/templates/linnest-public-behavior.typ" "/build/.tmp36x17R/.clinnet/templates/linnest-public-behavior.svg" "--root" "/build/.tmp36x17R/.clinnet/templates"
276.11 s
gammaloop-nextest-clinnet>
276.11 s
gammaloop-nextest-clinnet> Typst stdout:
276.11 s
gammaloop-nextest-clinnet>
276.11 s
gammaloop-nextest-clinnet>
276.11 s
gammaloop-nextest-clinnet> Typst stderr:
276.11 s
gammaloop-nextest-clinnet>
276.11 s
gammaloop-nextest-clinnet>
276.11 s
gammaloop-nextest-clinnet> Location:
276.11 s
gammaloop-nextest-clinnet> crates/clinnet/src/lib.rs:741:13
276.11 s
gammaloop-nextest-clinnet> stack backtrace:
276.11 s
gammaloop-nextest-clinnet> 0: __rustc::rust_begin_unwind
276.11 s
gammaloop-nextest-clinnet> 1: core::panicking::panic_fmt
276.11 s
gammaloop-nextest-clinnet> 2: core::result::unwrap_failed
276.11 s
gammaloop-nextest-clinnet> 3: public_typst_behavior::render
276.11 s
gammaloop-nextest-clinnet> 4: <std::sync::once::Once>::call_once_force::<<std::sync::once_lock::OnceLock<alloc::string::String>>::initialize<<std::sync::once_lock::OnceLock<alloc::string::String>>::get_or_init<public_typst_behavior::linnest_public_svg::{closure#0}>::{closure#0}, !>::{closure#0}>::{closure#0}
276.11 s
gammaloop-nextest-clinnet> 5: <std::sys::sync::once::futex::Once>::call
276.11 s
gammaloop-nextest-clinnet> 6: <std::sync::once_lock::OnceLock<alloc::string::String>>::initialize::<<std::sync::once_lock::OnceLock<alloc::string::String>>::get_or_init<public_typst_behavior::linnest_public_svg::{closure#0}>::{closure#0}, !>
276.11 s
gammaloop-nextest-clinnet> 7: <public_typst_behavior::public_linnest_endpoint_anchor_distances_stay_local::{closure#0} as core::ops::function::FnOnce<()>>::call_once
276.11 s
gammaloop-nextest-clinnet> note: Some details are omitted, run with `RUST_BACKTRACE=full` for a verbose backtrace.
276.11 s
gammaloop-nextest-clinnet>
276.11 s
gammaloop-nextest-clinnet> FAIL [ 175.230s] (34/38) clinnet::public_typst_behavior public_linnest_arrow_shafts_and_crossing_gaps
276.11 s
gammaloop-nextest-clinnet> stdout ---
276.11 s
gammaloop-nextest-clinnet>
276.11 s
gammaloop-nextest-clinnet> running 1 test
276.11 s
gammaloop-nextest-clinnet> test public_linnest_arrow_shafts_and_crossing_gaps has been running for over 60 seconds
276.11 s
gammaloop-nextest-clinnet> test public_linnest_arrow_shafts_and_crossing_gaps ... FAILED
276.11 s
gammaloop-nextest-clinnet>
276.11 s
gammaloop-nextest-clinnet> failures:
276.11 s
gammaloop-nextest-clinnet>
276.11 s
gammaloop-nextest-clinnet> failures:
276.11 s
gammaloop-nextest-clinnet> public_linnest_arrow_shafts_and_crossing_gaps
276.11 s
gammaloop-nextest-clinnet>
276.11 s
gammaloop-nextest-clinnet> test result: FAILED. 0 passed; 1 failed; 0 ignored; 0 measured; 17 filtered out; finished in 175.21s
276.11 s
gammaloop-nextest-clinnet>
276.11 s
gammaloop-nextest-clinnet> stderr ---
276.11 s
gammaloop-nextest-clinnet>
276.11 s
gammaloop-nextest-clinnet> thread 'public_linnest_arrow_shafts_and_crossing_gaps' (268) panicked at crates/clinnet/tests/public_typst_behavior.rs:81:55:
276.11 s
gammaloop-nextest-clinnet> called `Result::unwrap()` on an `Err` value: typst failed while compiling template /build/.tmpoTIIdD/.clinnet/templates/linnest-public-behavior.svg
276.11 s
gammaloop-nextest-clinnet>
276.11 s
gammaloop-nextest-clinnet> Command executed:
276.11 s
gammaloop-nextest-clinnet> "typst" "c" "/build/.tmpoTIIdD/.clinnet/templates/linnest-public-behavior.typ" "/build/.tmpoTIIdD/.clinnet/templates/linnest-public-behavior.svg" "--root" "/build/.tmpoTIIdD/.clinnet/templates"
276.11 s
gammaloop-nextest-clinnet>
276.11 s
gammaloop-nextest-clinnet> Typst stdout:
276.11 s
gammaloop-nextest-clinnet>
276.11 s
gammaloop-nextest-clinnet>
276.11 s
gammaloop-nextest-clinnet> Typst stderr:
276.11 s
gammaloop-nextest-clinnet>
276.11 s
gammaloop-nextest-clinnet>
276.11 s
gammaloop-nextest-clinnet> Location:
276.11 s
gammaloop-nextest-clinnet> crates/clinnet/src/lib.rs:741:13
276.11 s
gammaloop-nextest-clinnet> stack backtrace:
276.11 s
gammaloop-nextest-clinnet> 0: __rustc::rust_begin_unwind
276.11 s
gammaloop-nextest-clinnet> 1: core::panicking::panic_fmt
276.11 s
gammaloop-nextest-clinnet> 2: core::result::unwrap_failed
276.11 s
gammaloop-nextest-clinnet> 3: public_typst_behavior::render
276.11 s
gammaloop-nextest-clinnet> 4: <std::sync::once::Once>::call_once_force::<<std::sync::once_lock::OnceLock<alloc::string::String>>::initialize<<std::sync::once_lock::OnceLock<alloc::string::String>>::get_or_init<public_typst_behavior::linnest_public_svg::{closure#0}>::{closure#0}, !>::{closure#0}>::{closure#0}
276.11 s
gammaloop-nextest-clinnet> 5: <std::sys::sync::once::futex::Once>::call
276.11 s
gammaloop-nextest-clinnet> 6: <std::sync::once_lock::OnceLock<alloc::string::String>>::initialize::<<std::sync::once_lock::OnceLock<alloc::string::String>>::get_or_init<public_typst_behavior::linnest_public_svg::{closure#0}>::{closure#0}, !>
276.11 s
gammaloop-nextest-clinnet> 7: <public_typst_behavior::public_linnest_arrow_shafts_and_crossing_gaps::{closure#0} as core::ops::function::FnOnce<()>>::call_once
276.11 s
gammaloop-nextest-clinnet> note: Some details are omitted, run with `RUST_BACKTRACE=full` for a verbose backtrace.
276.11 s
gammaloop-nextest-clinnet>
276.15 s
gammaloop-nextest-clinnet> error : test run failed
276.68 s
gammaloop-nextest-clinnet>
276.68 s
gammaloop-nextest-clinnet> ========== nextest test summary ==========
276.68 s
gammaloop-nextest-clinnet> report: target/nextest/ci_gammaloop/junit.xml
276.68 s
gammaloop-nextest-clinnet> tests: 38, failures: 3, errors: 0
276.68 s
gammaloop-nextest-clinnet>
276.68 s
gammaloop-nextest-clinnet> 1. clinnet::public_typst_behavior::public_linnest_fixture_assertions_hold
276.68 s
gammaloop-nextest-clinnet> failure: test failure with exit code 101
276.68 s
gammaloop-nextest-clinnet> thread 'public_linnest_fixture_assertions_hold' (280) panicked at crates/clinnet/tests/public_typst_behavior.rs:81:55:
276.68 s
gammaloop-nextest-clinnet> called `Result::unwrap()` on an `Err` value: typst failed while compiling template /build/.tmpYJzetH/.clinnet/templates/linnest-public-behavior.svg
276.68 s
gammaloop-nextest-clinnet>
276.68 s
gammaloop-nextest-clinnet> Command executed:
276.68 s
gammaloop-nextest-clinnet> "typst" "c" "/build/.tmpYJzetH/.clinnet/templates/linnest-public-behavior.typ" "/build/.tmpYJzetH/.clinnet/templates/linnest-public-behavior.svg" "--root" "/build/.tmpYJzetH/.clinnet/templates"
276.68 s
gammaloop-nextest-clinnet>
276.68 s
gammaloop-nextest-clinnet> Typst stdout:
276.68 s
gammaloop-nextest-clinnet>
276.68 s
gammaloop-nextest-clinnet>
276.68 s
gammaloop-nextest-clinnet> Typst stderr:
276.68 s
gammaloop-nextest-clinnet>
276.68 s
gammaloop-nextest-clinnet>
276.68 s
gammaloop-nextest-clinnet> Location:
276.68 s
gammaloop-nextest-clinnet> crates/clinnet/src/lib.rs:741:13
276.68 s
gammaloop-nextest-clinnet> stack backtrace:
276.68 s
gammaloop-nextest-clinnet> 0: __rustc::rust_begin_unwind
276.68 s
gammaloop-nextest-clinnet> 1: core::panicking::panic_fmt
276.68 s
gammaloop-nextest-clinnet> 2: core::result::unwrap_failed
276.68 s
gammaloop-nextest-clinnet> 3: public_typst_behavior::render
276.68 s
gammaloop-nextest-clinnet> 4: <std::sync::once::Once>::call_once_force::<<std::sync::once_lock::OnceLock<alloc::string::String>>::initialize<<std::sync::once_lock::OnceLock<alloc::string::String>>::get_or_init<public_typst_behavior::linnest_public_svg::{closure#0}>::{closure#0}, !>::{closure#0}>::{closure#0}
276.68 s
gammaloop-nextest-clinnet> 5: <std::sys::sync::once::futex::Once>::call
276.68 s
gammaloop-nextest-clinnet> 6: <std::sync::once_lock::OnceLock<alloc::string::String>>::initialize::<<std::sync::once_lock::OnceLock<alloc::string::String>>::get_or_init<public_typst_behavior::linnest_public_svg::{closure#0}>::{closure#0}, !>
276.68 s
gammaloop-nextest-clinnet> 7: <public_typst_behavior::public_linnest_fixture_assertions_hold::{closure#0} as core::ops::function::FnOnce<()>>::call_once
276.68 s
gammaloop-nextest-clinnet> note: Some details are omitted, run with `RUST_BACKTRACE=full` for a verbose backtrace.
276.68 s
gammaloop-nextest-clinnet> system-out
276.68 s
gammaloop-nextest-clinnet> running 1 test
276.68 s
gammaloop-nextest-clinnet> test public_linnest_fixture_assertions_hold has been running for over 60 seconds
276.68 s
gammaloop-nextest-clinnet> test public_linnest_fixture_assertions_hold ... FAILED
276.68 s
gammaloop-nextest-clinnet>
276.68 s
gammaloop-nextest-clinnet> failures:
276.68 s
gammaloop-nextest-clinnet>
276.68 s
gammaloop-nextest-clinnet> failures:
276.68 s
gammaloop-nextest-clinnet> public_linnest_fixture_assertions_hold
276.68 s
gammaloop-nextest-clinnet>
276.68 s
gammaloop-nextest-clinnet> test result: FAILED. 0 passed; 1 failed; 0 ignored; 0 measured; 17 filtered out; finished in 151.81s
276.68 s
gammaloop-nextest-clinnet> system-err
276.68 s
gammaloop-nextest-clinnet> thread 'public_linnest_fixture_assertions_hold' (280) panicked at crates/clinnet/tests/public_typst_behavior.rs:81:55:
276.68 s
gammaloop-nextest-clinnet> called `Result::unwrap()` on an `Err` value: typst failed while compiling template /build/.tmpYJzetH/.clinnet/templates/linnest-public-behavior.svg
276.68 s
gammaloop-nextest-clinnet>
276.68 s
gammaloop-nextest-clinnet> Command executed:
276.68 s
gammaloop-nextest-clinnet> "typst" "c" "/build/.tmpYJzetH/.clinnet/templates/linnest-public-behavior.typ" "/build/.tmpYJzetH/.clinnet/templates/linnest-public-behavior.svg" "--root" "/build/.tmpYJzetH/.clinnet/templates"
276.68 s
gammaloop-nextest-clinnet>
276.68 s
gammaloop-nextest-clinnet> Typst stdout:
276.68 s
gammaloop-nextest-clinnet>
276.68 s
gammaloop-nextest-clinnet>
276.68 s
gammaloop-nextest-clinnet> Typst stderr:
276.68 s
gammaloop-nextest-clinnet>
276.68 s
gammaloop-nextest-clinnet>
276.68 s
gammaloop-nextest-clinnet> Location:
276.68 s
gammaloop-nextest-clinnet> crates/clinnet/src/lib.rs:741:13
276.68 s
gammaloop-nextest-clinnet> stack backtrace:
276.68 s
gammaloop-nextest-clinnet> 0: __rustc::rust_begin_unwind
276.68 s
gammaloop-nextest-clinnet> 1: core::panicking::panic_fmt
276.68 s
gammaloop-nextest-clinnet> 2: core::result::unwrap_failed
276.68 s
gammaloop-nextest-clinnet> 3: public_typst_behavior::render
276.68 s
gammaloop-nextest-clinnet> 4: <std::sync::once::Once>::call_once_force::<<std::sync::once_lock::OnceLock<alloc::string::String>>::initialize<<std::sync::once_lock::OnceLock<alloc::string::String>>::get_or_init<public_typst_behavior::linnest_public_svg::{closure#0}>::{closure#0}, !>::{closure#0}>::{closure#0}
276.68 s
gammaloop-nextest-clinnet> 5: <std::sys::sync::once::futex::Once>::call
276.68 s
gammaloop-nextest-clinnet> 6: <std::sync::once_lock::OnceLock<alloc::string::String>>::initialize::<<std::sync::once_lock::OnceLock<alloc::string::String>>::get_or_init<public_typst_behavior::linnest_public_svg::{closure#0}>::{closure#0}, !>
276.68 s
gammaloop-nextest-clinnet> 7: <public_typst_behavior::public_linnest_fixture_assertions_hold::{closure#0} as core::ops::function::FnOnce<()>>::call_once
276.68 s
gammaloop-nextest-clinnet> note: Some details are omitted, run with `RUST_BACKTRACE=full` for a verbose backtrace.
276.68 s
gammaloop-nextest-clinnet>
276.68 s
gammaloop-nextest-clinnet> 2. clinnet::public_typst_behavior::public_linnest_endpoint_anchor_distances_stay_local
276.68 s
gammaloop-nextest-clinnet> failure: test failure with exit code 101
276.68 s
gammaloop-nextest-clinnet> thread 'public_linnest_endpoint_anchor_distances_stay_local' (271) panicked at crates/clinnet/tests/public_typst_behavior.rs:81:55:
276.68 s
gammaloop-nextest-clinnet> called `Result::unwrap()` on an `Err` value: typst failed while compiling template /build/.tmp36x17R/.clinnet/templates/linnest-public-behavior.svg
276.68 s
gammaloop-nextest-clinnet>
276.68 s
gammaloop-nextest-clinnet> Command executed:
276.68 s
gammaloop-nextest-clinnet> "typst" "c" "/build/.tmp36x17R/.clinnet/templates/linnest-public-behavior.typ" "/build/.tmp36x17R/.clinnet/templates/linnest-public-behavior.svg" "--root" "/build/.tmp36x17R/.clinnet/templates"
276.68 s
gammaloop-nextest-clinnet>
276.68 s
gammaloop-nextest-clinnet> Typst stdout:
276.68 s
gammaloop-nextest-clinnet>
276.68 s
gammaloop-nextest-clinnet>
276.68 s
gammaloop-nextest-clinnet> Typst stderr:
276.68 s
gammaloop-nextest-clinnet>
276.68 s
gammaloop-nextest-clinnet>
276.68 s
gammaloop-nextest-clinnet> Location:
276.68 s
gammaloop-nextest-clinnet> crates/clinnet/src/lib.rs:741:13
276.68 s
gammaloop-nextest-clinnet> stack backtrace:
276.68 s
gammaloop-nextest-clinnet> 0: __rustc::rust_begin_unwind
276.68 s
gammaloop-nextest-clinnet> 1: core::panicking::panic_fmt
276.68 s
gammaloop-nextest-clinnet> 2: core::result::unwrap_failed
276.68 s
gammaloop-nextest-clinnet> 3: public_typst_behavior::render
276.68 s
gammaloop-nextest-clinnet> 4: <std::sync::once::Once>::call_once_force::<<std::sync::once_lock::OnceLock<alloc::string::String>>::initialize<<std::sync::once_lock::OnceLock<alloc::string::String>>::get_or_init<public_typst_behavior::linnest_public_svg::{closure#0}>::{closure#0}, !>::{closure#0}>::{closure#0}
276.68 s
gammaloop-nextest-clinnet> 5: <std::sys::sync::once::futex::Once>::call
276.68 s
gammaloop-nextest-clinnet> 6: <std::sync::once_lock::OnceLock<alloc::string::String>>::initialize::<<std::sync::once_lock::OnceLock<alloc::string::String>>::get_or_init<public_typst_behavior::linnest_public_svg::{closure#0}>::{closure#0}, !>
276.68 s
gammaloop-nextest-clinnet> 7: <public_typst_behavior::public_linnest_endpoint_anchor_distances_stay_local::{closure#0} as core::ops::function::FnOnce<()>>::call_once
276.68 s
gammaloop-nextest-clinnet> note: Some details are omitted, run with `RUST_BACKTRACE=full` for a verbose backtrace.
276.68 s
gammaloop-nextest-clinnet> system-out
276.68 s
gammaloop-nextest-clinnet> running 1 test
276.68 s
gammaloop-nextest-clinnet> test public_linnest_endpoint_anchor_distances_stay_local has been running for over 60 seconds
276.68 s
gammaloop-nextest-clinnet> test public_linnest_endpoint_anchor_distances_stay_local ... FAILED
276.68 s
gammaloop-nextest-clinnet>
276.68 s
gammaloop-nextest-clinnet> failures:
276.68 s
gammaloop-nextest-clinnet>
276.68 s
gammaloop-nextest-clinnet> failures:
276.68 s
gammaloop-nextest-clinnet> public_linnest_endpoint_anchor_distances_stay_local
276.68 s
gammaloop-nextest-clinnet>
276.68 s
gammaloop-nextest-clinnet> test result: FAILED. 0 passed; 1 failed; 0 ignored; 0 measured; 17 filtered out; finished in 157.02s
276.68 s
gammaloop-nextest-clinnet> system-err
276.68 s
gammaloop-nextest-clinnet> thread 'public_linnest_endpoint_anchor_distances_stay_local' (271) panicked at crates/clinnet/tests/public_typst_behavior.rs:81:55:
276.68 s
gammaloop-nextest-clinnet> called `Result::unwrap()` on an `Err` value: typst failed while compiling template /build/.tmp36x17R/.clinnet/templates/linnest-public-behavior.svg
276.68 s
gammaloop-nextest-clinnet>
276.68 s
gammaloop-nextest-clinnet> Command executed:
276.68 s
gammaloop-nextest-clinnet> "typst" "c" "/build/.tmp36x17R/.clinnet/templates/linnest-public-behavior.typ" "/build/.tmp36x17R/.clinnet/templates/linnest-public-behavior.svg" "--root" "/build/.tmp36x17R/.clinnet/templates"
276.68 s
gammaloop-nextest-clinnet>
276.68 s
gammaloop-nextest-clinnet> Typst stdout:
276.68 s
gammaloop-nextest-clinnet>
276.68 s
gammaloop-nextest-clinnet>
276.68 s
gammaloop-nextest-clinnet> Typst stderr:
276.68 s
gammaloop-nextest-clinnet>
276.68 s
gammaloop-nextest-clinnet>
276.68 s
gammaloop-nextest-clinnet> Location:
276.68 s
gammaloop-nextest-clinnet> crates/clinnet/src/lib.rs:741:13
276.68 s
gammaloop-nextest-clinnet> stack backtrace:
276.68 s
gammaloop-nextest-clinnet> 0: __rustc::rust_begin_unwind
276.68 s
gammaloop-nextest-clinnet> 1: core::panicking::panic_fmt
276.68 s
gammaloop-nextest-clinnet> 2: core::result::unwrap_failed
276.68 s
gammaloop-nextest-clinnet> 3: public_typst_behavior::render
276.68 s
gammaloop-nextest-clinnet> 4: <std::sync::once::Once>::call_once_force::<<std::sync::once_lock::OnceLock<alloc::string::String>>::initialize<<std::sync::once_lock::OnceLock<alloc::string::String>>::get_or_init<public_typst_behavior::linnest_public_svg::{closure#0}>::{closure#0}, !>::{closure#0}>::{closure#0}
276.68 s
gammaloop-nextest-clinnet> 5: <std::sys::sync::once::futex::Once>::call
276.68 s
gammaloop-nextest-clinnet> 6: <std::sync::once_lock::OnceLock<alloc::string::String>>::initialize::<<std::sync::once_lock::OnceLock<alloc::string::String>>::get_or_init<public_typst_behavior::linnest_public_svg::{closure#0}>::{closure#0}, !>
276.68 s
gammaloop-nextest-clinnet> 7: <public_typst_behavior::public_linnest_endpoint_anchor_distances_stay_local::{closure#0} as core::ops::function::FnOnce<()>>::call_once
276.68 s
gammaloop-nextest-clinnet> note: Some details are omitted, run with `RUST_BACKTRACE=full` for a verbose backtrace.
276.68 s
gammaloop-nextest-clinnet>
276.68 s
gammaloop-nextest-clinnet> 3. clinnet::public_typst_behavior::public_linnest_arrow_shafts_and_crossing_gaps
276.68 s
gammaloop-nextest-clinnet> failure: test failure with exit code 101
276.68 s
gammaloop-nextest-clinnet> thread 'public_linnest_arrow_shafts_and_crossing_gaps' (268) panicked at crates/clinnet/tests/public_typst_behavior.rs:81:55:
276.68 s
gammaloop-nextest-clinnet> called `Result::unwrap()` on an `Err` value: typst failed while compiling template /build/.tmpoTIIdD/.clinnet/templates/linnest-public-behavior.svg
276.68 s
gammaloop-nextest-clinnet>
276.68 s
gammaloop-nextest-clinnet> Command executed:
276.68 s
gammaloop-nextest-clinnet> "typst" "c" "/build/.tmpoTIIdD/.clinnet/templates/linnest-public-behavior.typ" "/build/.tmpoTIIdD/.clinnet/templates/linnest-public-behavior.svg" "--root" "/build/.tmpoTIIdD/.clinnet/templates"
276.68 s
gammaloop-nextest-clinnet>
276.68 s
gammaloop-nextest-clinnet> Typst stdout:
276.68 s
gammaloop-nextest-clinnet>
276.68 s
gammaloop-nextest-clinnet>
276.68 s
gammaloop-nextest-clinnet> Typst stderr:
276.68 s
gammaloop-nextest-clinnet>
276.68 s
gammaloop-nextest-clinnet>
276.68 s
gammaloop-nextest-clinnet> Location:
276.68 s
gammaloop-nextest-clinnet> crates/clinnet/src/lib.rs:741:13
276.68 s
gammaloop-nextest-clinnet> stack backtrace:
276.68 s
gammaloop-nextest-clinnet> 0: __rustc::rust_begin_unwind
276.68 s
gammaloop-nextest-clinnet> 1: core::panicking::panic_fmt
276.68 s
gammaloop-nextest-clinnet> 2: core::result::unwrap_failed
276.68 s
gammaloop-nextest-clinnet> 3: public_typst_behavior::render
276.68 s
gammaloop-nextest-clinnet> 4: <std::sync::once::Once>::call_once_force::<<std::sync::once_lock::OnceLock<alloc::string::String>>::initialize<<std::sync::once_lock::OnceLock<alloc::string::String>>::get_or_init<public_typst_behavior::linnest_public_svg::{closure#0}>::{closure#0}, !>::{closure#0}>::{closure#0}
276.68 s
gammaloop-nextest-clinnet> 5: <std::sys::sync::once::futex::Once>::call
276.68 s
gammaloop-nextest-clinnet> 6: <std::sync::once_lock::OnceLock<alloc::string::String>>::initialize::<<std::sync::once_lock::OnceLock<alloc::string::String>>::get_or_init<public_typst_behavior::linnest_public_svg::{closure#0}>::{closure#0}, !>
276.68 s
gammaloop-nextest-clinnet> 7: <public_typst_behavior::public_linnest_arrow_shafts_and_crossing_gaps::{closure#0} as core::ops::function::FnOnce<()>>::call_once
276.68 s
gammaloop-nextest-clinnet> note: Some details are omitted, run with `RUST_BACKTRACE=full` for a verbose backtrace.
276.68 s
gammaloop-nextest-clinnet> system-out
276.68 s
gammaloop-nextest-clinnet> running 1 test
276.68 s
gammaloop-nextest-clinnet> test public_linnest_arrow_shafts_and_crossing_gaps has been running for over 60 seconds
276.68 s
gammaloop-nextest-clinnet> test public_linnest_arrow_shafts_and_crossing_gaps ... FAILED
276.68 s
gammaloop-nextest-clinnet>
276.68 s
gammaloop-nextest-clinnet> failures:
276.68 s
gammaloop-nextest-clinnet>
276.68 s
gammaloop-nextest-clinnet> failures:
276.68 s
gammaloop-nextest-clinnet> public_linnest_arrow_shafts_and_crossing_gaps
276.68 s
gammaloop-nextest-clinnet>
276.68 s
gammaloop-nextest-clinnet> test result: FAILED. 0 passed; 1 failed; 0 ignored; 0 measured; 17 filtered out; finished in 175.21s
276.68 s
gammaloop-nextest-clinnet> system-err
276.68 s
gammaloop-nextest-clinnet> thread 'public_linnest_arrow_shafts_and_crossing_gaps' (268) panicked at crates/clinnet/tests/public_typst_behavior.rs:81:55:
276.68 s
gammaloop-nextest-clinnet> called `Result::unwrap()` on an `Err` value: typst failed while compiling template /build/.tmpoTIIdD/.clinnet/templates/linnest-public-behavior.svg
276.68 s
gammaloop-nextest-clinnet>
276.68 s
gammaloop-nextest-clinnet> Command executed:
276.68 s
gammaloop-nextest-clinnet> "typst" "c" "/build/.tmpoTIIdD/.clinnet/templates/linnest-public-behavior.typ" "/build/.tmpoTIIdD/.clinnet/templates/linnest-public-behavior.svg" "--root" "/build/.tmpoTIIdD/.clinnet/templates"
276.68 s
gammaloop-nextest-clinnet>
276.68 s
gammaloop-nextest-clinnet> Typst stdout:
276.68 s
gammaloop-nextest-clinnet>
276.68 s
gammaloop-nextest-clinnet>
276.68 s
gammaloop-nextest-clinnet> Typst stderr:
276.68 s
gammaloop-nextest-clinnet>
276.68 s
gammaloop-nextest-clinnet>
276.68 s
gammaloop-nextest-clinnet> Location:
276.68 s
gammaloop-nextest-clinnet> crates/clinnet/src/lib.rs:741:13
276.68 s
gammaloop-nextest-clinnet> stack backtrace:
276.68 s
gammaloop-nextest-clinnet> 0: __rustc::rust_begin_unwind
276.68 s
gammaloop-nextest-clinnet> 1: core::panicking::panic_fmt
276.68 s
gammaloop-nextest-clinnet> 2: core::result::unwrap_failed
276.68 s
gammaloop-nextest-clinnet> 3: public_typst_behavior::render
276.68 s
gammaloop-nextest-clinnet> 4: <std::sync::once::Once>::call_once_force::<<std::sync::once_lock::OnceLock<alloc::string::String>>::initialize<<std::sync::once_lock::OnceLock<alloc::string::String>>::get_or_init<public_typst_behavior::linnest_public_svg::{closure#0}>::{closure#0}, !>::{closure#0}>::{closure#0}
276.69 s
gammaloop-nextest-clinnet> 5: <std::sys::sync::once::futex::Once>::call
276.69 s
gammaloop-nextest-clinnet> 6: <std::sync::once_lock::OnceLock<alloc::string::String>>::initialize::<<std::sync::once_lock::OnceLock<alloc::string::String>>::get_or_init<public_typst_behavior::linnest_public_svg::{closure#0}>::{closure#0}, !>
276.69 s
gammaloop-nextest-clinnet> 7: <public_typst_behavior::public_linnest_arrow_shafts_and_crossing_gaps::{closure#0} as core::ops::function::FnOnce<()>>::call_once
276.69 s
gammaloop-nextest-clinnet> note: Some details are omitted, run with `RUST_BACKTRACE=full` for a verbose backtrace.
276.69 s
gammaloop-nextest-clinnet> =========================================
277.54 s
[3 /4 built (1 failed ), 7
[3 built (1 failed ), 74 error: Cannot build '/nix/store/4pqspwvh8pi9s2vg9g6mfsggpl9ynwzx-gammaloop-nextest-clinnet.drv '.
277.54 s
Reason: builder failed with exit code 100 .
277.54 s
Output paths:
277.54 s
/nix/store/v9zka7gxdrym1pq03r0i4w2q43fgdwcq-gammaloop-nextest-clinnet
277.54 s
Last 449 log lines:
277.54 s
> Nextest worker budget: 16
277.54 s
> Extracting 4 binaries (including 1 non-test binary), 1 build script output directory, and 1 linked path to /build/source
277.54 s
> Extracted 16 files to /build/source in 0.17s
277.54 s
> ------------
277.54 s
> Nextest run ID 47d1530f-9357-4427-a157-73d5663450e6 with nextest profile: ci_gammaloop
277.54 s
> Starting 38 tests across 3 binaries
277.54 s
> FAIL [ 151.829s] (32/38) clinnet::public_typst_behavior public_linnest_fixture_assertions_hold
277.54 s
> stdout ---
277.54 s
>
277.54 s
> running 1 test
277.54 s
> test public_linnest_fixture_assertions_hold has been running for over 60 seconds
277.54 s
> test public_linnest_fixture_assertions_hold ... FAILED
277.54 s
>
277.54 s
> failures:
277.54 s
>
277.54 s
> failures:
277.54 s
> public_linnest_fixture_assertions_hold
277.54 s
>
277.54 s
> test result: FAILED. 0 passed; 1 failed; 0 ignored; 0 measured; 17 filtered out; finished in 151.81s
277.54 s
>
277.54 s
> stderr ---
277.54 s
>
277.54 s
> thread 'public_linnest_fixture_assertions_hold' (280) panicked at crates/clinnet/tests/public_typst_behavior.rs:81:55:
277.54 s
> called `Result::unwrap()` on an `Err` value: typst failed while compiling template /build/.tmpYJzetH/.clinnet/templates/linnest-public-behavior.svg
277.54 s
>
277.54 s
> Command executed:
277.54 s
> "typst" "c" "/build/.tmpYJzetH/.clinnet/templates/linnest-public-behavior.typ" "/build/.tmpYJzetH/.clinnet/templates/linnest-public-behavior.svg" "--root" "/build/.tmpYJzetH/.clinnet/templates"
277.54 s
>
277.54 s
> Typst stdout:
277.54 s
>
277.54 s
>
277.54 s
> Typst stderr:
277.54 s
>
277.54 s
>
277.54 s
> Location:
277.54 s
> crates/clinnet/src/lib.rs:741:13
277.54 s
> stack backtrace:
277.54 s
> 0: __rustc::rust_begin_unwind
277.54 s
> 1: core::panicking::panic_fmt
277.54 s
> 2: core::result::unwrap_failed
277.54 s
> 3: public_typst_behavior::render
277.54 s
> 4: <std::sync::once::Once>::call_once_force::<<std::sync::once_lock::OnceLock<alloc::string::String>>::initialize<<std::sync::once_lock::OnceLock<alloc::string::String>>::get_or_init<public_typst_behavior::linnest_public_svg::{closure#0}>::{closure#0}, !>::{closure#0}>::{closure#0}
277.54 s
> 5: <std::sys::sync::once::futex::Once>::call
277.54 s
> 6: <std::sync::once_lock::OnceLock<alloc::string::String>>::initialize::<<std::sync::once_lock::OnceLock<alloc::string::String>>::get_or_init<public_typst_behavior::linnest_public_svg::{closure#0}>::{closure#0}, !>
277.54 s
> 7: <public_typst_behavior::public_linnest_fixture_assertions_hold::{closure#0} as core::ops::function::FnOnce<()>>::call_once
277.54 s
> note: Some details are omitted, run with `RUST_BACKTRACE=full` for a verbose backtrace.
277.54 s
>
277.54 s
> FAIL [ 157.034s] (33/38) clinnet::public_typst_behavior public_linnest_endpoint_anchor_distances_stay_local
277.54 s
> stdout ---
277.54 s
>
277.54 s
> running 1 test
277.54 s
> test public_linnest_endpoint_anchor_distances_stay_local has been running for over 60 seconds
277.54 s
> test public_linnest_endpoint_anchor_distances_stay_local ... FAILED
277.54 s
>
277.54 s
> failures:
277.54 s
>
277.54 s
> failures:
277.54 s
> public_linnest_endpoint_anchor_distances_stay_local
277.54 s
>
277.54 s
> test result: FAILED. 0 passed; 1 failed; 0 ignored; 0 measured; 17 filtered out; finished in 157.02s
277.54 s
>
277.54 s
> stderr ---
277.54 s
>
277.54 s
> thread 'public_linnest_endpoint_anchor_distances_stay_local' (271) panicked at crates/clinnet/tests/public_typst_behavior.rs:81:55:
277.54 s
> called `Result::unwrap()` on an `Err` value: typst failed while compiling template /build/.tmp36x17R/.clinnet/templates/linnest-public-behavior.svg
277.54 s
>
277.54 s
> Command executed:
277.54 s
> "typst" "c" "/build/.tmp36x17R/.clinnet/templates/linnest-public-behavior.typ" "/build/.tmp36x17R/.clinnet/templates/linnest-public-behavior.svg" "--root" "/build/.tmp36x17R/.clinnet/templates"
277.54 s
>
277.54 s
> Typst stdout:
277.54 s
>
277.54 s
>
277.54 s
> Typst stderr:
277.54 s
>
277.54 s
>
277.54 s
> Location:
277.54 s
> crates/clinnet/src/lib.rs:741:13
277.54 s
> stack backtrace:
277.54 s
> 0: __rustc::rust_begin_unwind
277.54 s
> 1: core::panicking::panic_fmt
277.54 s
> 2: core::result::unwrap_failed
277.54 s
> 3: public_typst_behavior::render
277.54 s
> 4: <std::sync::once::Once>::call_once_force::<<std::sync::once_lock::OnceLock<alloc::string::String>>::initialize<<std::sync::once_lock::OnceLock<alloc::string::String>>::get_or_init<public_typst_behavior::linnest_public_svg::{closure#0}>::{closure#0}, !>::{closure#0}>::{closure#0}
277.54 s
> 5: <std::sys::sync::once::futex::Once>::call
277.54 s
> 6: <std::sync::once_lock::OnceLock<alloc::string::String>>::initialize::<<std::sync::once_lock::OnceLock<alloc::string::String>>::get_or_init<public_typst_behavior::linnest_public_svg::{closure#0}>::{closure#0}, !>
277.54 s
> 7: <public_typst_behavior::public_linnest_endpoint_anchor_distances_stay_local::{closure#0} as core::ops::function::FnOnce<()>>::call_once
277.54 s
> note: Some details are omitted, run with `RUST_BACKTRACE=full` for a verbose backtrace.
277.54 s
>
277.54 s
> FAIL [ 175.230s] (34/38) clinnet::public_typst_behavior public_linnest_arrow_shafts_and_crossing_gaps
277.54 s
> stdout ---
277.54 s
>
277.54 s
> running 1 test
277.54 s
> test public_linnest_arrow_shafts_and_crossing_gaps has been running for over 60 seconds
277.54 s
> test public_linnest_arrow_shafts_and_crossing_gaps ... FAILED
277.54 s
>
277.54 s
> failures:
277.54 s
>
277.54 s
> failures:
277.54 s
> public_linnest_arrow_shafts_and_crossing_gaps
277.54 s
>
277.54 s
> test result: FAILED. 0 passed; 1 failed; 0 ignored; 0 measured; 17 filtered out; finished in 175.21s
277.54 s
>
277.54 s
> stderr ---
277.54 s
>
277.54 s
> thread 'public_linnest_arrow_shafts_and_crossing_gaps' (268) panicked at crates/clinnet/tests/public_typst_behavior.rs:81:55:
277.54 s
> called `Result::unwrap()` on an `Err` value: typst failed while compiling template /build/.tmpoTIIdD/.clinnet/templates/linnest-public-behavior.svg
277.54 s
>
277.54 s
> Command executed:
277.54 s
> "typst" "c" "/build/.tmpoTIIdD/.clinnet/templates/linnest-public-behavior.typ" "/build/.tmpoTIIdD/.clinnet/templates/linnest-public-behavior.svg" "--root" "/build/.tmpoTIIdD/.clinnet/templates"
277.54 s
>
277.54 s
> Typst stdout:
277.54 s
>
277.54 s
>
277.54 s
> Typst stderr:
277.54 s
>
277.54 s
>
277.54 s
> Location:
277.54 s
> crates/clinnet/src/lib.rs:741:13
277.54 s
> stack backtrace:
277.54 s
> 0: __rustc::rust_begin_unwind
277.54 s
> 1: core::panicking::panic_fmt
277.54 s
> 2: core::result::unwrap_failed
277.54 s
> 3: public_typst_behavior::render
277.54 s
> 4: <std::sync::once::Once>::call_once_force::<<std::sync::once_lock::OnceLock<alloc::string::String>>::initialize<<std::sync::once_lock::OnceLock<alloc::string::String>>::get_or_init<public_typst_behavior::linnest_public_svg::{closure#0}>::{closure#0}, !>::{closure#0}>::{closure#0}
277.54 s
> 5: <std::sys::sync::once::futex::Once>::call
277.54 s
> 6: <std::sync::once_lock::OnceLock<alloc::string::String>>::initialize::<<std::sync::once_lock::OnceLock<alloc::string::String>>::get_or_init<public_typst_behavior::linnest_public_svg::{closure#0}>::{closure#0}, !>
277.54 s
> 7: <public_typst_behavior::public_linnest_arrow_shafts_and_crossing_gaps::{closure#0} as core::ops::function::FnOnce<()>>::call_once
277.54 s
> note: Some details are omitted, run with `RUST_BACKTRACE=full` for a verbose backtrace.
277.54 s
>
277.54 s
> ------------
277.54 s
> Summary [ 192.288s] 38 tests run: 35 passed (4 slow ), 3 failed , 0 skipped
277.54 s
> FAIL [ 151.829s] (32/38) clinnet::public_typst_behavior public_linnest_fixture_assertions_hold
277.54 s
> stdout ---
277.54 s
>
277.54 s
> running 1 test
277.54 s
> test public_linnest_fixture_assertions_hold has been running for over 60 seconds
277.54 s
> test public_linnest_fixture_assertions_hold ... FAILED
277.54 s
>
277.54 s
> failures:
277.54 s
>
277.54 s
> failures:
277.54 s
> public_linnest_fixture_assertions_hold
277.54 s
>
277.54 s
> test result: FAILED. 0 passed; 1 failed; 0 ignored; 0 measured; 17 filtered out; finished in 151.81s
277.54 s
>
277.54 s
> stderr ---
277.54 s
>
277.54 s
> thread 'public_linnest_fixture_assertions_hold' (280) panicked at crates/clinnet/tests/public_typst_behavior.rs:81:55:
277.54 s
> called `Result::unwrap()` on an `Err` value: typst failed while compiling template /build/.tmpYJzetH/.clinnet/templates/linnest-public-behavior.svg
277.54 s
>
277.54 s
> Command executed:
277.54 s
> "typst" "c" "/build/.tmpYJzetH/.clinnet/templates/linnest-public-behavior.typ" "/build/.tmpYJzetH/.clinnet/templates/linnest-public-behavior.svg" "--root" "/build/.tmpYJzetH/.clinnet/templates"
277.54 s
>
277.54 s
> Typst stdout:
277.54 s
>
277.54 s
>
277.54 s
> Typst stderr:
277.54 s
>
277.54 s
>
277.54 s
> Location:
277.54 s
> crates/clinnet/src/lib.rs:741:13
277.54 s
> stack backtrace:
277.54 s
> 0: __rustc::rust_begin_unwind
277.54 s
> 1: core::panicking::panic_fmt
277.54 s
> 2: core::result::unwrap_failed
277.54 s
> 3: public_typst_behavior::render
277.54 s
> 4: <std::sync::once::Once>::call_once_force::<<std::sync::once_lock::OnceLock<alloc::string::String>>::initialize<<std::sync::once_lock::OnceLock<alloc::string::String>>::get_or_init<public_typst_behavior::linnest_public_svg::{closure#0}>::{closure#0}, !>::{closure#0}>::{closure#0}
277.54 s
> 5: <std::sys::sync::once::futex::Once>::call
277.54 s
> 6: <std::sync::once_lock::OnceLock<alloc::string::String>>::initialize::<<std::sync::once_lock::OnceLock<alloc::string::String>>::get_or_init<public_typst_behavior::linnest_public_svg::{closure#0}>::{closure#0}, !>
277.54 s
> 7: <public_typst_behavior::public_linnest_fixture_assertions_hold::{closure#0} as core::ops::function::FnOnce<()>>::call_once
277.54 s
> note: Some details are omitted, run with `RUST_BACKTRACE=full` for a verbose backtrace.
277.54 s
>
277.54 s
> FAIL [ 157.034s] (33/38) clinnet::public_typst_behavior public_linnest_endpoint_anchor_distances_stay_local
277.54 s
> stdout ---
277.54 s
>
277.54 s
> running 1 test
277.54 s
> test public_linnest_endpoint_anchor_distances_stay_local has been running for over 60 seconds
277.54 s
> test public_linnest_endpoint_anchor_distances_stay_local ... FAILED
277.54 s
>
277.54 s
> failures:
277.54 s
>
277.54 s
> failures:
277.54 s
> public_linnest_endpoint_anchor_distances_stay_local
277.54 s
>
277.54 s
> test result: FAILED. 0 passed; 1 failed; 0 ignored; 0 measured; 17 filtered out; finished in 157.02s
277.54 s
>
277.54 s
> stderr ---
277.54 s
>
277.54 s
> thread 'public_linnest_endpoint_anchor_distances_stay_local' (271) panicked at crates/clinnet/tests/public_typst_behavior.rs:81:55:
277.54 s
> called `Result::unwrap()` on an `Err` value: typst failed while compiling template /build/.tmp36x17R/.clinnet/templates/linnest-public-behavior.svg
277.54 s
>
277.54 s
> Command executed:
277.54 s
> "typst" "c" "/build/.tmp36x17R/.clinnet/templates/linnest-public-behavior.typ" "/build/.tmp36x17R/.clinnet/templates/linnest-public-behavior.svg" "--root" "/build/.tmp36x17R/.clinnet/templates"
277.54 s
>
277.54 s
> Typst stdout:
277.54 s
>
277.54 s
>
277.54 s
> Typst stderr:
277.54 s
>
277.54 s
>
277.54 s
> Location:
277.54 s
> crates/clinnet/src/lib.rs:741:13
277.54 s
> stack backtrace:
277.54 s
> 0: __rustc::rust_begin_unwind
277.54 s
> 1: core::panicking::panic_fmt
277.54 s
> 2: core::result::unwrap_failed
277.54 s
> 3: public_typst_behavior::render
277.54 s
> 4: <std::sync::once::Once>::call_once_force::<<std::sync::once_lock::OnceLock<alloc::string::String>>::initialize<<std::sync::once_lock::OnceLock<alloc::string::String>>::get_or_init<public_typst_behavior::linnest_public_svg::{closure#0}>::{closure#0}, !>::{closure#0}>::{closure#0}
277.54 s
> 5: <std::sys::sync::once::futex::Once>::call
277.54 s
> 6: <std::sync::once_lock::OnceLock<alloc::string::String>>::initialize::<<std::sync::once_lock::OnceLock<alloc::string::String>>::get_or_init<public_typst_behavior::linnest_public_svg::{closure#0}>::{closure#0}, !>
277.54 s
> 7: <public_typst_behavior::public_linnest_endpoint_anchor_distances_stay_local::{closure#0} as core::ops::function::FnOnce<()>>::call_once
277.54 s
> note: Some details are omitted, run with `RUST_BACKTRACE=full` for a verbose backtrace.
277.54 s
>
277.54 s
> FAIL [ 175.230s] (34/38) clinnet::public_typst_behavior public_linnest_arrow_shafts_and_crossing_gaps
277.54 s
> stdout ---
277.54 s
>
277.54 s
> running 1 test
277.54 s
> test public_linnest_arrow_shafts_and_crossing_gaps has been running for over 60 seconds
277.54 s
> test public_linnest_arrow_shafts_and_crossing_gaps ... FAILED
277.54 s
>
277.54 s
> failures:
277.54 s
>
277.54 s
> failures:
277.54 s
> public_linnest_arrow_shafts_and_crossing_gaps
277.54 s
>
277.54 s
> test result: FAILED. 0 passed; 1 failed; 0 ignored; 0 measured; 17 filtered out; finished in 175.21s
277.54 s
>
277.54 s
> stderr ---
277.54 s
>
277.54 s
> thread 'public_linnest_arrow_shafts_and_crossing_gaps' (268) panicked at crates/clinnet/tests/public_typst_behavior.rs:81:55:
277.54 s
> called `Result::unwrap()` on an `Err` value: typst failed while compiling template /build/.tmpoTIIdD/.clinnet/templates/linnest-public-behavior.svg
277.54 s
>
277.54 s
> Command executed:
277.54 s
> "typst" "c" "/build/.tmpoTIIdD/.clinnet/templates/linnest-public-behavior.typ" "/build/.tmpoTIIdD/.clinnet/templates/linnest-public-behavior.svg" "--root" "/build/.tmpoTIIdD/.clinnet/templates"
277.54 s
>
277.54 s
> Typst stdout:
277.54 s
>
277.54 s
>
277.54 s
> Typst stderr:
277.54 s
>
277.54 s
>
277.54 s
> Location:
277.54 s
> crates/clinnet/src/lib.rs:741:13
277.54 s
> stack backtrace:
277.54 s
> 0: __rustc::rust_begin_unwind
277.54 s
> 1: core::panicking::panic_fmt
277.54 s
> 2: core::result::unwrap_failed
277.54 s
> 3: public_typst_behavior::render
277.54 s
> 4: <std::sync::once::Once>::call_once_force::<<std::sync::once_lock::OnceLock<alloc::string::String>>::initialize<<std::sync::once_lock::OnceLock<alloc::string::String>>::get_or_init<public_typst_behavior::linnest_public_svg::{closure#0}>::{closure#0}, !>::{closure#0}>::{closure#0}
277.54 s
> 5: <std::sys::sync::once::futex::Once>::call
277.54 s
> 6: <std::sync::once_lock::OnceLock<alloc::string::String>>::initialize::<<std::sync::once_lock::OnceLock<alloc::string::String>>::get_or_init<public_typst_behavior::linnest_public_svg::{closure#0}>::{closure#0}, !>
277.54 s
> 7: <public_typst_behavior::public_linnest_arrow_shafts_and_crossing_gaps::{closure#0} as core::ops::function::FnOnce<()>>::call_once
277.54 s
> note: Some details are omitted, run with `RUST_BACKTRACE=full` for a verbose backtrace.
277.54 s
>
277.54 s
> error : test run failed
277.54 s
>
277.54 s
> ========== nextest test summary ==========
277.54 s
> report: target/nextest/ci_gammaloop/junit.xml
277.54 s
> tests: 38, failures: 3, errors: 0
277.54 s
>
277.54 s
> 1. clinnet::public_typst_behavior::public_linnest_fixture_assertions_hold
277.54 s
> failure: test failure with exit code 101
277.54 s
> thread 'public_linnest_fixture_assertions_hold' (280) panicked at crates/clinnet/tests/public_typst_behavior.rs:81:55:
277.54 s
> called `Result::unwrap()` on an `Err` value: typst failed while compiling template /build/.tmpYJzetH/.clinnet/templates/linnest-public-behavior.svg
277.54 s
>
277.54 s
> Command executed:
277.54 s
> "typst" "c" "/build/.tmpYJzetH/.clinnet/templates/linnest-public-behavior.typ" "/build/.tmpYJzetH/.clinnet/templates/linnest-public-behavior.svg" "--root" "/build/.tmpYJzetH/.clinnet/templates"
277.54 s
>
277.54 s
> Typst stdout:
277.54 s
>
277.54 s
>
277.54 s
> Typst stderr:
277.54 s
>
277.54 s
>
277.54 s
> Location:
277.54 s
> crates/clinnet/src/lib.rs:741:13
277.54 s
> stack backtrace:
277.54 s
> 0: __rustc::rust_begin_unwind
277.54 s
> 1: core::panicking::panic_fmt
277.54 s
> 2: core::result::unwrap_failed
277.54 s
> 3: public_typst_behavior::render
277.54 s
> 4: <std::sync::once::Once>::call_once_force::<<std::sync::once_lock::OnceLock<alloc::string::String>>::initialize<<std::sync::once_lock::OnceLock<alloc::string::String>>::get_or_init<public_typst_behavior::linnest_public_svg::{closure#0}>::{closure#0}, !>::{closure#0}>::{closure#0}
277.54 s
> 5: <std::sys::sync::once::futex::Once>::call
277.54 s
> 6: <std::sync::once_lock::OnceLock<alloc::string::String>>::initialize::<<std::sync::once_lock::OnceLock<alloc::string::String>>::get_or_init<public_typst_behavior::linnest_public_svg::{closure#0}>::{closure#0}, !>
277.54 s
> 7: <public_typst_behavior::public_linnest_fixture_assertions_hold::{closure#0} as core::ops::function::FnOnce<()>>::call_once
277.54 s
> note: Some details are omitted, run with `RUST_BACKTRACE=full` for a verbose backtrace.
277.54 s
> system-out
277.54 s
> running 1 test
277.54 s
> test public_linnest_fixture_assertions_hold has been running for over 60 seconds
277.54 s
> test public_linnest_fixture_assertions_hold ... FAILED
277.54 s
>
277.54 s
> failures:
277.54 s
>
277.54 s
> failures:
277.54 s
> public_linnest_fixture_assertions_hold
277.54 s
>
277.54 s
> test result: FAILED. 0 passed; 1 failed; 0 ignored; 0 measured; 17 filtered out; finished in 151.81s
277.54 s
> system-err
277.54 s
> thread 'public_linnest_fixture_assertions_hold' (280) panicked at crates/clinnet/tests/public_typst_behavior.rs:81:55:
277.54 s
> called `Result::unwrap()` on an `Err` value: typst failed while compiling template /build/.tmpYJzetH/.clinnet/templates/linnest-public-behavior.svg
277.54 s
>
277.54 s
> Command executed:
277.54 s
> "typst" "c" "/build/.tmpYJzetH/.clinnet/templates/linnest-public-behavior.typ" "/build/.tmpYJzetH/.clinnet/templates/linnest-public-behavior.svg" "--root" "/build/.tmpYJzetH/.clinnet/templates"
277.54 s
>
277.54 s
> Typst stdout:
277.54 s
>
277.54 s
>
277.54 s
> Typst stderr:
277.54 s
>
277.54 s
>
277.54 s
> Location:
277.54 s
> crates/clinnet/src/lib.rs:741:13
277.54 s
> stack backtrace:
277.54 s
> 0: __rustc::rust_begin_unwind
277.54 s
> 1: core::panicking::panic_fmt
277.54 s
> 2: core::result::unwrap_failed
277.54 s
> 3: public_typst_behavior::render
277.54 s
> 4: <std::sync::once::Once>::call_once_force::<<std::sync::once_lock::OnceLock<alloc::string::String>>::initialize<<std::sync::once_lock::OnceLock<alloc::string::String>>::get_or_init<public_typst_behavior::linnest_public_svg::{closure#0}>::{closure#0}, !>::{closure#0}>::{closure#0}
277.54 s
> 5: <std::sys::sync::once::futex::Once>::call
277.54 s
> 6: <std::sync::once_lock::OnceLock<alloc::string::String>>::initialize::<<std::sync::once_lock::OnceLock<alloc::string::String>>::get_or_init<public_typst_behavior::linnest_public_svg::{closure#0}>::{closure#0}, !>
277.54 s
> 7: <public_typst_behavior::public_linnest_fixture_assertions_hold::{closure#0} as core::ops::function::FnOnce<()>>::call_once
277.54 s
> note: Some details are omitted, run with `RUST_BACKTRACE=full` for a verbose backtrace.
277.54 s
>
277.54 s
> 2. clinnet::public_typst_behavior::public_linnest_endpoint_anchor_distances_stay_local
277.54 s
> failure: test failure with exit code 101
277.54 s
> thread 'public_linnest_endpoint_anchor_distances_stay_local' (271) panicked at crates/clinnet/tests/public_typst_behavior.rs:81:55:
277.54 s
> called `Result::unwrap()` on an `Err` value: typst failed while compiling template /build/.tmp36x17R/.clinnet/templates/linnest-public-behavior.svg
277.54 s
>
277.54 s
> Command executed:
277.54 s
> "typst" "c" "/build/.tmp36x17R/.clinnet/templates/linnest-public-behavior.typ" "/build/.tmp36x17R/.clinnet/templates/linnest-public-behavior.svg" "--root" "/build/.tmp36x17R/.clinnet/templates"
277.54 s
>
277.54 s
> Typst stdout:
277.54 s
>
277.54 s
>
277.54 s
> Typst stderr:
277.54 s
>
277.54 s
>
277.54 s
> Location:
277.54 s
> crates/clinnet/src/lib.rs:741:13
277.54 s
> stack backtrace:
277.54 s
> 0: __rustc::rust_begin_unwind
277.54 s
> 1: core::panicking::panic_fmt
277.54 s
> 2: core::result::unwrap_failed
277.54 s
> 3: public_typst_behavior::render
277.54 s
> 4: <std::sync::once::Once>::call_once_force::<<std::sync::once_lock::OnceLock<alloc::string::String>>::initialize<<std::sync::once_lock::OnceLock<alloc::string::String>>::get_or_init<public_typst_behavior::linnest_public_svg::{closure#0}>::{closure#0}, !>::{closure#0}>::{closure#0}
277.54 s
> 5: <std::sys::sync::once::futex::Once>::call
277.54 s
> 6: <std::sync::once_lock::OnceLock<alloc::string::String>>::initialize::<<std::sync::once_lock::OnceLock<alloc::string::String>>::get_or_init<public_typst_behavior::linnest_public_svg::{closure#0}>::{closure#0}, !>
277.54 s
> 7: <public_typst_behavior::public_linnest_endpoint_anchor_distances_stay_local::{closure#0} as core::ops::function::FnOnce<()>>::call_once
277.54 s
> note: Some details are omitted, run with `RUST_BACKTRACE=full` for a verbose backtrace.
277.54 s
> system-out
277.54 s
> running 1 test
277.54 s
> test public_linnest_endpoint_anchor_distances_stay_local has been running for over 60 seconds
277.54 s
> test public_linnest_endpoint_anchor_distances_stay_local ... FAILED
277.54 s
>
277.54 s
> failures:
277.54 s
>
277.54 s
> failures:
277.54 s
> public_linnest_endpoint_anchor_distances_stay_local
277.54 s
>
277.54 s
> test result: FAILED. 0 passed; 1 failed; 0 ignored; 0 measured; 17 filtered out; finished in 157.02s
277.54 s
> system-err
277.54 s
> thread 'public_linnest_endpoint_anchor_distances_stay_local' (271) panicked at crates/clinnet/tests/public_typst_behavior.rs:81:55:
277.54 s
> called `Result::unwrap()` on an `Err` value: typst failed while compiling template /build/.tmp36x17R/.clinnet/templates/linnest-public-behavior.svg
277.54 s
>
277.54 s
> Command executed:
277.54 s
> "typst" "c" "/build/.tmp36x17R/.clinnet/templates/linnest-public-behavior.typ" "/build/.tmp36x17R/.clinnet/templates/linnest-public-behavior.svg" "--root" "/build/.tmp36x17R/.clinnet/templates"
277.54 s
>
277.54 s
> Typst stdout:
277.54 s
>
277.54 s
>
277.54 s
> Typst stderr:
277.54 s
>
277.54 s
>
277.54 s
> Location:
277.54 s
> crates/clinnet/src/lib.rs:741:13
277.54 s
> stack backtrace:
277.54 s
> 0: __rustc::rust_begin_unwind
277.54 s
> 1: core::panicking::panic_fmt
277.54 s
> 2: core::result::unwrap_failed
277.54 s
> 3: public_typst_behavior::render
277.54 s
> 4: <std::sync::once::Once>::call_once_force::<<std::sync::once_lock::OnceLock<alloc::string::String>>::initialize<<std::sync::once_lock::OnceLock<alloc::string::String>>::get_or_init<public_typst_behavior::linnest_public_svg::{closure#0}>::{closure#0}, !>::{closure#0}>::{closure#0}
277.54 s
> 5: <std::sys::sync::once::futex::Once>::call
277.54 s
> 6: <std::sync::once_lock::OnceLock<alloc::string::String>>::initialize::<<std::sync::once_lock::OnceLock<alloc::string::String>>::get_or_init<public_typst_behavior::linnest_public_svg::{closure#0}>::{closure#0}, !>
277.54 s
> 7: <public_typst_behavior::public_linnest_endpoint_anchor_distances_stay_local::{closure#0} as core::ops::function::FnOnce<()>>::call_once
277.54 s
> note: Some details are omitted, run with `RUST_BACKTRACE=full` for a verbose backtrace.
277.54 s
>
277.54 s
> 3. clinnet::public_typst_behavior::public_linnest_arrow_shafts_and_crossing_gaps
277.54 s
> failure: test failure with exit code 101
277.54 s
> thread 'public_linnest_arrow_shafts_and_crossing_gaps' (268) panicked at crates/clinnet/tests/public_typst_behavior.rs:81:55:
277.54 s
> called `Result::unwrap()` on an `Err` value: typst failed while compiling template /build/.tmpoTIIdD/.clinnet/templates/linnest-public-behavior.svg
277.54 s
>
277.54 s
> Command executed:
277.54 s
> "typst" "c" "/build/.tmpoTIIdD/.clinnet/templates/linnest-public-behavior.typ" "/build/.tmpoTIIdD/.clinnet/templates/linnest-public-behavior.svg" "--root" "/build/.tmpoTIIdD/.clinnet/templates"
277.54 s
>
277.54 s
> Typst stdout:
277.54 s
>
277.54 s
>
277.54 s
> Typst stderr:
277.54 s
>
277.54 s
>
277.54 s
> Location:
277.54 s
> crates/clinnet/src/lib.rs:741:13
277.54 s
> stack backtrace:
277.54 s
> 0: __rustc::rust_begin_unwind
277.54 s
> 1: core::panicking::panic_fmt
277.54 s
> 2: core::result::unwrap_failed
277.54 s
> 3: public_typst_behavior::render
277.54 s
> 4: <std::sync::once::Once>::call_once_force::<<std::sync::once_lock::OnceLock<alloc::string::String>>::initialize<<std::sync::once_lock::OnceLock<alloc::string::String>>::get_or_init<public_typst_behavior::linnest_public_svg::{closure#0}>::{closure#0}, !>::{closure#0}>::{closure#0}
277.54 s
> 5: <std::sys::sync::once::futex::Once>::call
277.54 s
> 6: <std::sync::once_lock::OnceLock<alloc::string::String>>::initialize::<<std::sync::once_lock::OnceLock<alloc::string::String>>::get_or_init<public_typst_behavior::linnest_public_svg::{closure#0}>::{closure#0}, !>
277.54 s
> 7: <public_typst_behavior::public_linnest_arrow_shafts_and_crossing_gaps::{closure#0} as core::ops::function::FnOnce<()>>::call_once
277.54 s
> note: Some details are omitted, run with `RUST_BACKTRACE=full` for a verbose backtrace.
277.54 s
> system-out
277.54 s
> running 1 test
277.54 s
> test public_linnest_arrow_shafts_and_crossing_gaps has been running for over 60 seconds
277.54 s
> test public_linnest_arrow_shafts_and_crossing_gaps ... FAILED
277.54 s
>
277.54 s
> failures:
277.54 s
>
277.54 s
> failures:
277.54 s
> public_linnest_arrow_shafts_and_crossing_gaps
277.54 s
>
277.54 s
> test result: FAILED. 0 passed; 1 failed; 0 ignored; 0 measured; 17 filtered out; finished in 175.21s
277.54 s
> system-err
277.54 s
> thread 'public_linnest_arrow_shafts_and_crossing_gaps' (268) panicked at crates/clinnet/tests/public_typst_behavior.rs:81:55:
277.54 s
> called `Result::unwrap()` on an `Err` value: typst failed while compiling template /build/.tmpoTIIdD/.clinnet/templates/linnest-public-behavior.svg
277.54 s
>
277.54 s
> Command executed:
277.54 s
> "typst" "c" "/build/.tmpoTIIdD/.clinnet/templates/linnest-public-behavior.typ" "/build/.tmpoTIIdD/.clinnet/templates/linnest-public-behavior.svg" "--root" "/build/.tmpoTIIdD/.clinnet/templates"
277.54 s
>
277.54 s
> Typst stdout:
277.54 s
>
277.54 s
>
277.54 s
> Typst stderr:
277.54 s
>
277.54 s
>
277.54 s
> Location:
277.54 s
> crates/clinnet/src/lib.rs:741:13
277.54 s
> stack backtrace:
277.54 s
> 0: __rustc::rust_begin_unwind
277.54 s
> 1: core::panicking::panic_fmt
277.54 s
> 2: core::result::unwrap_failed
277.54 s
> 3: public_typst_behavior::render
277.54 s
> 4: <std::sync::once::Once>::call_once_force::<<std::sync::once_lock::OnceLock<alloc::string::String>>::initialize<<std::sync::once_lock::OnceLock<alloc::string::String>>::get_or_init<public_typst_behavior::linnest_public_svg::{closure#0}>::{closure#0}, !>::{closure#0}>::{closure#0}
277.54 s
> 5: <std::sys::sync::once::futex::Once>::call
277.54 s
> 6: <std::sync::once_lock::OnceLock<alloc::string::String>>::initialize::<<std::sync::once_lock::OnceLock<alloc::string::String>>::get_or_init<public_typst_behavior::linnest_public_svg::{closure#0}>::{closure#0}, !>
277.54 s
> 7: <public_typst_behavior::public_linnest_arrow_shafts_and_crossing_gaps::{closure#0} as core::ops::function::FnOnce<()>>::call_once
277.54 s
> note: Some details are omitted, run with `RUST_BACKTRACE=full` for a verbose backtrace.
277.54 s
> =========================================
277.54 s
For full logs, run:
277.54 s
nix log /nix/store/4pqspwvh8pi9s2vg9g6mfsggpl9ynwzx-gammaloop-nextest-clinnet.drv
278.18 s
Run failed.