1. 0.01 s $ /nix/store/9ypz3flqsrl5xl495mm8h645gadjsxi1-coreutils-9.11/bin/timeout --kill-after=15s 7200s /nix/store/23zk8sgzamrbmj1fday15szf7f2279s8-nix-2.34.7/bin/nix --extra-experimental-features nix-command --extra-experimental-features flakes --log-format internal-json build --no-link --print-out-paths git+https://github.com/alphal00p/gammaloop?ref=codex%2Fnix-metadata-20260906&rev=b6b126198170b848f9fdb11014d4af7e02fbf9b5&shallow=1#packages.x86_64-linux.crate-test-binaries-three-dimensional-reps --print-build-logs
  2. 2.45 s
  3. 3.61 s Downloading cached gammaloop-ci-test-binary-dependencies-50150770f831b638-Cargo.toml from https://cache.nix-ci.com
  4. 3.66 s Downloaded cached gammaloop-ci-test-binary-dependencies-50150770f831b638-Cargo.toml (584 B) in 50ms
  5. 3.68 s Building /nix/store/620cg4lxjsln105525v3nij0sy75ni31-gammaloop-ci-test-binary-dependencies-50150770f831b638-three-dimensional-reps-dev-dependency.toml.drv
  6. 3.74 s Building /nix/store/jxvw34bgxdnn9bkva90k3g1kdb1h3z69-gammaloop-ci-test-dependencies-50150770f831b638-Cargo.toml.drv
  7. 4.61 s Building /nix/store/jmhhhrwdm93h4plqd0nn7x0a47yf0nbh-gammaloop-crate-test-dependencies-50150770f831b638-inputs.drv
  8. 4.61 s Progress: 0 of 8 built (3 building), 1 of 1 downloaded from cache
  9. 4.71 s [gammaloop-ci-test-binary-dependencies-50150770f831b638-three-dimensional-reps-dev-dependency.toml:post-build] Uploading to the NixCI cache: /nix/store/nkd9p6h639pp1ya2nb2yngjw7qb80nfg-gammaloop-ci-test-binary-dependencies-50150770f831b638-three-dimensional-reps-dev-dependency.toml
  10. 5.23 s [gammaloop-ci-test-binary-dependencies-50150770f831b638-three-dimensional-reps-dev-dependency.toml:post-build] warning: 'warn-short-path-literals' is deprecated, use 'lint-short-path-literals = ignore' instead
  11. 5.42 s [gammaloop-ci-test-binary-dependencies-50150770f831b638-three-dimensional-reps-dev-dependency.toml:post-build] copying 0 paths...
  12. 6.16 s [gammaloop-ci-test-binary-dependencies-50150770f831b638-three-dimensional-reps-dev-dependency.toml:post-build] warning: 'warn-short-path-literals' is deprecated, use 'lint-short-path-literals = ignore' instead
  13. 6.38 s [gammaloop-ci-test-binary-dependencies-50150770f831b638-three-dimensional-reps-dev-dependency.toml:post-build] copying 0 paths...
  14. 6.60 s Uploaded gammaloop-ci-test-binary-dependencies-50150770f831b638-three-dimensional-reps-dev-dependency.toml in 1.9s
  15. 6.60 s Progress: 1 of 9 built (2 building), 1 of 1 downloaded from cache
  16. 6.60 s Built gammaloop-ci-test-binary-dependencies-50150770f831b638-three-dimensional-reps-dev-dependency.toml in 2.9s
  17. 6.71 s [gammaloop-ci-test-dependencies-50150770f831b638-Cargo.toml:post-build] Uploading to the NixCI cache: /nix/store/l910djsa81d33bspw74vkisyvzi8c7k4-gammaloop-ci-test-dependencies-50150770f831b638-Cargo.toml
  18. 7.09 s [gammaloop-ci-test-dependencies-50150770f831b638-Cargo.toml:post-build] warning: 'warn-short-path-literals' is deprecated, use 'lint-short-path-literals = ignore' instead
  19. 7.25 s [gammaloop-ci-test-dependencies-50150770f831b638-Cargo.toml:post-build] copying 0 paths...
  20. 7.80 s [gammaloop-ci-test-dependencies-50150770f831b638-Cargo.toml:post-build] warning: 'warn-short-path-literals' is deprecated, use 'lint-short-path-literals = ignore' instead
  21. 8.02 s [gammaloop-ci-test-dependencies-50150770f831b638-Cargo.toml:post-build] copying 0 paths...
  22. 8.23 s Uploaded gammaloop-ci-test-dependencies-50150770f831b638-Cargo.toml in 1.6s
  23. 8.23 s Progress: 2 of 10 built (1 building), 1 of 1 downloaded from cache
  24. 8.23 s Built gammaloop-ci-test-dependencies-50150770f831b638-Cargo.toml in 4.4s
  25. 12.75 s [gammaloop-crate-test-dependencies-50150770f831b638-inputs:post-build] Uploading to the NixCI cache: /nix/store/f2rkqh3q0lxip9bacx3qjgahcv40f7v1-gammaloop-crate-test-dependencies-50150770f831b638-inputs
  26. 13.20 s [gammaloop-crate-test-dependencies-50150770f831b638-inputs:post-build] warning: 'warn-short-path-literals' is deprecated, use 'lint-short-path-literals = ignore' instead
  27. 13.28 s [gammaloop-crate-test-dependencies-50150770f831b638-inputs:post-build] copying 1 paths...
  28. 13.28 s [gammaloop-crate-test-dependencies-50150770f831b638-inputs:post-build] copying path '/nix/store/f2rkqh3q0lxip9bacx3qjgahcv40f7v1-gammaloop-crate-test-dependencies-50150770f831b638-inputs' to 'https://cache.nix-ci.com'...
  29. 97.67 s [gammaloop-crate-test-dependencies-50150770f831b638-inputs:post-build] warning: 'warn-short-path-literals' is deprecated, use 'lint-short-path-literals = ignore' instead
  30. 97.95 s [gammaloop-crate-test-dependencies-50150770f831b638-inputs:post-build] copying 0 paths...
  31. 98.16 s Uploaded gammaloop-crate-test-dependencies-50150770f831b638-inputs in 1m25s
  32. 98.17 s Progress: 3 of 8 built, 1 of 1 downloaded from cache
  33. 98.17 s Built gammaloop-crate-test-dependencies-50150770f831b638-inputs in 1m33s
  34. 98.26 s Building /nix/store/cix37g28bf54jqs4499qhq07m0qdnw8l-gammaloop-crate-test-dependencies-50150770f831b638-deps-0.1.0.drv
  35. 98.44 s [gammaloop-crate-test-dependencies-50150770f831b638-deps] Phase: unpackPhase
  36. 98.44 s [gammaloop-crate-test-dependencies-50150770f831b638-deps] unpacking source archive /nix/store/w23i6db12qhinqrv98z967yzr6awmzqj-source
  37. 98.77 s [gammaloop-crate-test-dependencies-50150770f831b638-deps] source root is source
  38. 98.81 s [gammaloop-crate-test-dependencies-50150770f831b638-deps] Phase: patchPhase
  39. 98.96 s [gammaloop-crate-test-dependencies-50150770f831b638-deps] Executing configureCargoCommonVars
  40. 98.97 s [gammaloop-crate-test-dependencies-50150770f831b638-deps] copying cargo artifacts from /nix/store/f2rkqh3q0lxip9bacx3qjgahcv40f7v1-gammaloop-crate-test-dependencies-50150770f831b638-inputs/target to target
  41. 98.97 s [gammaloop-crate-test-dependencies-50150770f831b638-deps] will deep copy artifacts (instead of symlinking) as requested
  42. 100.19 s [gammaloop-crate-test-dependencies-50150770f831b638-deps] Phase: updateAutotoolsGnuConfigScriptsPhase
  43. 100.23 s [gammaloop-crate-test-dependencies-50150770f831b638-deps] Phase: configurePhase
  44. 100.24 s [gammaloop-crate-test-dependencies-50150770f831b638-deps] will append /build/source/.cargo-home/config.toml with contents of /nix/store/1sigmg52bb61pfngmk9k8wq5fz9r7bf1-vendor-cargo-deps/config.toml
  45. 100.24 s [gammaloop-crate-test-dependencies-50150770f831b638-deps] default configurePhase, nothing to do
  46. 100.24 s [gammaloop-crate-test-dependencies-50150770f831b638-deps] Phase: buildPhase
  47. 100.25 s [gammaloop-crate-test-dependencies-50150770f831b638-deps] +++ command cargo --version
  48. 100.25 s [gammaloop-crate-test-dependencies-50150770f831b638-deps] cargo 1.97.0 (c980f4866 2026-06-30)
  49. 100.25 s [gammaloop-crate-test-dependencies-50150770f831b638-deps] +++ command cargo build --profile ci-optim --offline -p gammaloop-ci-test-dependencies-50150770f831b638 -p gammaloop-workspace-hack --features linnet/bincode,linnet/drawing,linnet/serde,linnet/symbolica,symbolica/tracing_max_level_info,three-dimensional-reps/serde --lib
  50. 100.65 s [gammaloop-crate-test-dependencies-50150770f831b638-deps] Compiling three-dimensional-reps v0.1.0 (/build/source/crates/three-dimensional-reps)
  51. 100.65 s [gammaloop-crate-test-dependencies-50150770f831b638-deps] Compiling linnet v0.17.0 (/build/source/crates/linnet)
  52. 107.62 s [gammaloop-crate-test-dependencies-50150770f831b638-deps] Compiling gammaloop-ci-test-dependencies-50150770f831b638 v0.1.0 (/build/source/crates/gammaloop-ci-test-dependencies-50150770f831b638)
  53. 114.00 s [gammaloop-crate-test-dependencies-50150770f831b638-deps] Finished `ci-optim` profile [optimized] target(s) in 13.74s
  54. 114.13 s [gammaloop-crate-test-dependencies-50150770f831b638-deps] warning: the following packages contain code that will be rejected by a future version of Rust: proc-macro-error2 v2.0.1
  55. 114.13 s [gammaloop-crate-test-dependencies-50150770f831b638-deps] note: to see what the problems were, use the option `--future-incompat-report`, or run `cargo report future-incompatibilities --id 1`
  56. 114.18 s [gammaloop-crate-test-dependencies-50150770f831b638-deps] +++ command cargo build --profile ci-optim --offline -p gammaloop-ci-test-binary-dependencies-50150770f831b638 -p three-dimensional-reps --features linnet/bincode,linnet/drawing,linnet/serde,linnet/symbolica,symbolica/tracing_max_level_info,three-dimensional-reps/serde --lib
  57. 114.41 s [gammaloop-crate-test-dependencies-50150770f831b638-deps] Compiling linnet v0.17.0 (/build/source/crates/linnet)
  58. 118.37 s [gammaloop-crate-test-dependencies-50150770f831b638-deps] Compiling gammaloop-ci-test-binary-dependencies-50150770f831b638 v0.1.0 (/build/source/crates/gammaloop-ci-test-binary-dependencies-50150770f831b638)
  59. 118.37 s [gammaloop-crate-test-dependencies-50150770f831b638-deps] Compiling three-dimensional-reps v0.1.0 (/build/source/crates/three-dimensional-reps)
  60. 125.66 s [gammaloop-crate-test-dependencies-50150770f831b638-deps] Finished `ci-optim` profile [optimized] target(s) in 11.48s
  61. 125.80 s [gammaloop-crate-test-dependencies-50150770f831b638-deps] warning: the following packages contain code that will be rejected by a future version of Rust: proc-macro-error2 v2.0.1
  62. 125.80 s [gammaloop-crate-test-dependencies-50150770f831b638-deps] note: to see what the problems were, use the option `--future-incompat-report`, or run `cargo report future-incompatibilities --id 1`
  63. 125.84 s [gammaloop-crate-test-dependencies-50150770f831b638-deps] Phase: installPhase
  64. 125.85 s [gammaloop-crate-test-dependencies-50150770f831b638-deps] linking previous artifacts /nix/store/f2rkqh3q0lxip9bacx3qjgahcv40f7v1-gammaloop-crate-test-dependencies-50150770f831b638-inputs to /nix/store/kvgz31glz0hjbmhwp8r0iwkl7v62inwy-gammaloop-crate-test-dependencies-50150770f831b638-deps-0.1.0/target.tar.zst
  65. 125.94 s [gammaloop-crate-test-dependencies-50150770f831b638-deps] /*stdin*\ : 30.95% ( 66.3 MiB => 20.5 MiB, /nix/store/kvgz31glz0hjbmhwp8r0iwkl7v62inwy-gammaloop-crate-test-dependencies-50150770f831b638-deps-0.1.0/target.tar.zst)
  66. 125.96 s [gammaloop-crate-test-dependencies-50150770f831b638-deps] Phase: fixupPhase
  67. 125.97 s [gammaloop-crate-test-dependencies-50150770f831b638-deps] shrinking RPATHs of ELF executables and libraries in /nix/store/kvgz31glz0hjbmhwp8r0iwkl7v62inwy-gammaloop-crate-test-dependencies-50150770f831b638-deps-0.1.0
  68. 125.97 s [gammaloop-crate-test-dependencies-50150770f831b638-deps] checking for references to /build/ in /nix/store/kvgz31glz0hjbmhwp8r0iwkl7v62inwy-gammaloop-crate-test-dependencies-50150770f831b638-deps-0.1.0...
  69. 125.98 s [gammaloop-crate-test-dependencies-50150770f831b638-deps] patching script interpreter paths in /nix/store/kvgz31glz0hjbmhwp8r0iwkl7v62inwy-gammaloop-crate-test-dependencies-50150770f831b638-deps-0.1.0
  70. 126.25 s [gammaloop-crate-test-dependencies-50150770f831b638-deps:post-build] Uploading to the NixCI cache: /nix/store/kvgz31glz0hjbmhwp8r0iwkl7v62inwy-gammaloop-crate-test-dependencies-50150770f831b638-deps-0.1.0
  71. 126.30 s [gammaloop-crate-test-dependencies-50150770f831b638-deps:post-build] warning: 'warn-short-path-literals' is deprecated, use 'lint-short-path-literals = ignore' instead
  72. 126.33 s [gammaloop-crate-test-dependencies-50150770f831b638-deps:post-build] copying 0 paths...
  73. 126.39 s [gammaloop-crate-test-dependencies-50150770f831b638-deps:post-build] warning: 'warn-short-path-literals' is deprecated, use 'lint-short-path-literals = ignore' instead
  74. 126.61 s [gammaloop-crate-test-dependencies-50150770f831b638-deps:post-build] copying 0 paths...
  75. 126.64 s Uploaded gammaloop-crate-test-dependencies-50150770f831b638-deps in 403ms
  76. 126.64 s Progress: 4 of 8 built, 1 of 1 downloaded from cache
  77. 126.64 s Built gammaloop-crate-test-dependencies-50150770f831b638-deps in 28.3s
  78. 126.70 s Building /nix/store/cbajpav159907dch3yn4yaxwgsywk6kx-gammaloop-crate-test-binaries-three-dimensional-reps-50150770f831b638-inputs.drv
  79. 130.99 s [gammaloop-crate-test-binaries-three-dimensional-reps-50150770f831b638-inputs:post-build] Uploading to the NixCI cache: /nix/store/1hkp51xn27aapbsqcb4apz40glk6yvlw-gammaloop-crate-test-binaries-three-dimensional-reps-50150770f831b638-inputs
  80. 131.05 s [gammaloop-crate-test-binaries-three-dimensional-reps-50150770f831b638-inputs:post-build] warning: 'warn-short-path-literals' is deprecated, use 'lint-short-path-literals = ignore' instead
  81. 131.09 s [gammaloop-crate-test-binaries-three-dimensional-reps-50150770f831b638-inputs:post-build] copying 0 paths...
  82. 131.35 s [gammaloop-crate-test-binaries-three-dimensional-reps-50150770f831b638-inputs:post-build] warning: 'warn-short-path-literals' is deprecated, use 'lint-short-path-literals = ignore' instead
  83. 131.56 s [gammaloop-crate-test-binaries-three-dimensional-reps-50150770f831b638-inputs:post-build] copying 0 paths...
  84. 131.60 s Uploaded gammaloop-crate-test-binaries-three-dimensional-reps-50150770f831b638-inputs in 623ms
  85. 131.60 s Progress: 5 of 8 built, 1 of 1 downloaded from cache
  86. 131.60 s Built gammaloop-crate-test-binaries-three-dimensional-reps-50150770f831b638-inputs in 4.9s
  87. 131.69 s Building /nix/store/7zw48naflmi73dxkqz28kzrmi51nzd6p-gammaloop-crate-test-binaries-three-dimensional-reps-50150770f831b638-deps-0.1.0.drv
  88. 131.77 s [gammaloop-crate-test-binaries-three-dimensional-reps-50150770f831b638-deps] Phase: unpackPhase
  89. 131.83 s [gammaloop-crate-test-binaries-three-dimensional-reps-50150770f831b638-deps] unpacking source archive /nix/store/w23i6db12qhinqrv98z967yzr6awmzqj-source
  90. 131.84 s [gammaloop-crate-test-binaries-three-dimensional-reps-50150770f831b638-deps] source root is source
  91. 131.85 s [gammaloop-crate-test-binaries-three-dimensional-reps-50150770f831b638-deps] Phase: patchPhase
  92. 131.97 s [gammaloop-crate-test-binaries-three-dimensional-reps-50150770f831b638-deps] Executing configureCargoCommonVars
  93. 131.97 s [gammaloop-crate-test-binaries-three-dimensional-reps-50150770f831b638-deps] copying cargo artifacts from /nix/store/1hkp51xn27aapbsqcb4apz40glk6yvlw-gammaloop-crate-test-binaries-three-dimensional-reps-50150770f831b638-inputs/target to target
  94. 131.97 s [gammaloop-crate-test-binaries-three-dimensional-reps-50150770f831b638-deps] will deep copy artifacts (instead of symlinking) as requested
  95. 132.95 s [gammaloop-crate-test-binaries-three-dimensional-reps-50150770f831b638-deps] Phase: updateAutotoolsGnuConfigScriptsPhase
  96. 132.98 s [gammaloop-crate-test-binaries-three-dimensional-reps-50150770f831b638-deps] Phase: configurePhase
  97. 133.00 s [gammaloop-crate-test-binaries-three-dimensional-reps-50150770f831b638-deps] will append /build/source/.cargo-home/config.toml with contents of /nix/store/1sigmg52bb61pfngmk9k8wq5fz9r7bf1-vendor-cargo-deps/config.toml
  98. 133.00 s [gammaloop-crate-test-binaries-three-dimensional-reps-50150770f831b638-deps] default configurePhase, nothing to do
  99. 133.00 s [gammaloop-crate-test-binaries-three-dimensional-reps-50150770f831b638-deps] Phase: buildPhase
  100. 133.00 s [gammaloop-crate-test-binaries-three-dimensional-reps-50150770f831b638-deps] +++ command cargo --version
  101. 133.01 s [gammaloop-crate-test-binaries-three-dimensional-reps-50150770f831b638-deps] cargo 1.97.0 (c980f4866 2026-06-30)
  102. 133.02 s [gammaloop-crate-test-binaries-three-dimensional-reps-50150770f831b638-deps] +++ command cargo test --profile ci-optim --no-run --offline -p three-dimensional-reps --features three-dimensional-reps/serde
  103. 133.59 s [gammaloop-crate-test-binaries-three-dimensional-reps-50150770f831b638-deps] Compiling three-dimensional-reps v0.1.0 (/build/source/crates/three-dimensional-reps)
  104. 133.77 s [gammaloop-crate-test-binaries-three-dimensional-reps-50150770f831b638-deps] error[E0433]: cannot find `eval` in `crate`
  105. 133.77 s [gammaloop-crate-test-binaries-three-dimensional-reps-50150770f831b638-deps] --> crates/three-dimensional-reps/src/generation.rs:7255:28
  106. 133.77 s [gammaloop-crate-test-binaries-three-dimensional-reps-50150770f831b638-deps] |
  107. 133.77 s [gammaloop-crate-test-binaries-three-dimensional-reps-50150770f831b638-deps] 7255 | let input = crate::eval::EvaluationInput {
  108. 133.77 s [gammaloop-crate-test-binaries-three-dimensional-reps-50150770f831b638-deps] | ^^^^ could not find `eval` in the crate root
  109. 133.77 s [gammaloop-crate-test-binaries-three-dimensional-reps-50150770f831b638-deps] |
  110. 133.77 s [gammaloop-crate-test-binaries-three-dimensional-reps-50150770f831b638-deps] note: found an item that was configured out
  111. 133.77 s [gammaloop-crate-test-binaries-three-dimensional-reps-50150770f831b638-deps] --> crates/three-dimensional-reps/src/lib.rs:7:9
  112. 133.77 s [gammaloop-crate-test-binaries-three-dimensional-reps-50150770f831b638-deps] |
  113. 133.77 s [gammaloop-crate-test-binaries-three-dimensional-reps-50150770f831b638-deps] 6 | #[cfg(feature = "eval")]
  114. 133.77 s [gammaloop-crate-test-binaries-three-dimensional-reps-50150770f831b638-deps] | ---------------- the item is gated behind the `eval` feature
  115. 133.77 s [gammaloop-crate-test-binaries-three-dimensional-reps-50150770f831b638-deps] 7 | pub mod eval;
  116. 133.77 s [gammaloop-crate-test-binaries-three-dimensional-reps-50150770f831b638-deps] | ^^^^
  117. 133.77 s [gammaloop-crate-test-binaries-three-dimensional-reps-50150770f831b638-deps]
  118. 133.78 s [gammaloop-crate-test-binaries-three-dimensional-reps-50150770f831b638-deps] error[E0433]: cannot find `eval` in `crate`
  119. 133.78 s [gammaloop-crate-test-binaries-three-dimensional-reps-50150770f831b638-deps] --> crates/three-dimensional-reps/src/generation.rs:7262:30
  120. 133.78 s [gammaloop-crate-test-binaries-three-dimensional-reps-50150770f831b638-deps] |
  121. 133.78 s [gammaloop-crate-test-binaries-three-dimensional-reps-50150770f831b638-deps] 7262 | let contact = crate::eval::evaluate_expression(
  122. 133.78 s [gammaloop-crate-test-binaries-three-dimensional-reps-50150770f831b638-deps] | ^^^^ could not find `eval` in the crate root
  123. 133.78 s [gammaloop-crate-test-binaries-three-dimensional-reps-50150770f831b638-deps] |
  124. 133.78 s [gammaloop-crate-test-binaries-three-dimensional-reps-50150770f831b638-deps] note: found an item that was configured out
  125. 133.78 s [gammaloop-crate-test-binaries-three-dimensional-reps-50150770f831b638-deps] --> crates/three-dimensional-reps/src/lib.rs:7:9
  126. 133.78 s [gammaloop-crate-test-binaries-three-dimensional-reps-50150770f831b638-deps] |
  127. 133.78 s [gammaloop-crate-test-binaries-three-dimensional-reps-50150770f831b638-deps] 6 | #[cfg(feature = "eval")]
  128. 133.78 s [gammaloop-crate-test-binaries-three-dimensional-reps-50150770f831b638-deps] | ---------------- the item is gated behind the `eval` feature
  129. 133.78 s [gammaloop-crate-test-binaries-three-dimensional-reps-50150770f831b638-deps] 7 | pub mod eval;
  130. 133.78 s [gammaloop-crate-test-binaries-three-dimensional-reps-50150770f831b638-deps] | ^^^^
  131. 133.78 s [gammaloop-crate-test-binaries-three-dimensional-reps-50150770f831b638-deps]
  132. 133.79 s [gammaloop-crate-test-binaries-three-dimensional-reps-50150770f831b638-deps] error[E0433]: cannot find `eval` in `crate`
  133. 133.79 s [gammaloop-crate-test-binaries-three-dimensional-reps-50150770f831b638-deps] --> crates/three-dimensional-reps/src/generation.rs:7270:32
  134. 133.79 s [gammaloop-crate-test-binaries-three-dimensional-reps-50150770f831b638-deps] |
  135. 133.79 s [gammaloop-crate-test-binaries-three-dimensional-reps-50150770f831b638-deps] 7270 | let remainder = crate::eval::evaluate_expression(
  136. 133.79 s [gammaloop-crate-test-binaries-three-dimensional-reps-50150770f831b638-deps] | ^^^^ could not find `eval` in the crate root
  137. 133.79 s [gammaloop-crate-test-binaries-three-dimensional-reps-50150770f831b638-deps] |
  138. 133.79 s [gammaloop-crate-test-binaries-three-dimensional-reps-50150770f831b638-deps] note: found an item that was configured out
  139. 133.79 s [gammaloop-crate-test-binaries-three-dimensional-reps-50150770f831b638-deps] --> crates/three-dimensional-reps/src/lib.rs:7:9
  140. 133.79 s [gammaloop-crate-test-binaries-three-dimensional-reps-50150770f831b638-deps] |
  141. 133.79 s [gammaloop-crate-test-binaries-three-dimensional-reps-50150770f831b638-deps] 6 | #[cfg(feature = "eval")]
  142. 133.79 s [gammaloop-crate-test-binaries-three-dimensional-reps-50150770f831b638-deps] | ---------------- the item is gated behind the `eval` feature
  143. 133.79 s [gammaloop-crate-test-binaries-three-dimensional-reps-50150770f831b638-deps] 7 | pub mod eval;
  144. 133.79 s [gammaloop-crate-test-binaries-three-dimensional-reps-50150770f831b638-deps] | ^^^^
  145. 133.79 s [gammaloop-crate-test-binaries-three-dimensional-reps-50150770f831b638-deps]
  146. 133.79 s [gammaloop-crate-test-binaries-three-dimensional-reps-50150770f831b638-deps] error[E0433]: cannot find `eval` in `crate`
  147. 133.79 s [gammaloop-crate-test-binaries-three-dimensional-reps-50150770f831b638-deps] --> crates/three-dimensional-reps/src/generation.rs:7278:28
  148. 133.79 s [gammaloop-crate-test-binaries-three-dimensional-reps-50150770f831b638-deps] |
  149. 133.79 s [gammaloop-crate-test-binaries-three-dimensional-reps-50150770f831b638-deps] 7278 | let total = crate::eval::evaluate_expression(&powered, &expression, numerator, &input)
  150. 133.79 s [gammaloop-crate-test-binaries-three-dimensional-reps-50150770f831b638-deps] | ^^^^ could not find `eval` in the crate root
  151. 133.79 s [gammaloop-crate-test-binaries-three-dimensional-reps-50150770f831b638-deps] |
  152. 133.79 s [gammaloop-crate-test-binaries-three-dimensional-reps-50150770f831b638-deps] note: found an item that was configured out
  153. 133.79 s [gammaloop-crate-test-binaries-three-dimensional-reps-50150770f831b638-deps] --> crates/three-dimensional-reps/src/lib.rs:7:9
  154. 133.79 s [gammaloop-crate-test-binaries-three-dimensional-reps-50150770f831b638-deps] |
  155. 133.79 s [gammaloop-crate-test-binaries-three-dimensional-reps-50150770f831b638-deps] 6 | #[cfg(feature = "eval")]
  156. 133.79 s [gammaloop-crate-test-binaries-three-dimensional-reps-50150770f831b638-deps] | ---------------- the item is gated behind the `eval` feature
  157. 133.79 s [gammaloop-crate-test-binaries-three-dimensional-reps-50150770f831b638-deps] 7 | pub mod eval;
  158. 133.79 s [gammaloop-crate-test-binaries-three-dimensional-reps-50150770f831b638-deps] | ^^^^
  159. 133.79 s [gammaloop-crate-test-binaries-three-dimensional-reps-50150770f831b638-deps]
  160. 135.39 s [gammaloop-crate-test-binaries-three-dimensional-reps-50150770f831b638-deps] For more information about this error, try `rustc --explain E0433`.
  161. 135.41 s [gammaloop-crate-test-binaries-three-dimensional-reps-50150770f831b638-deps] error: could not compile `three-dimensional-reps` (lib test) due to 4 previous errors
  162. 135.66 s Progress: 5 of 7 built (1 failed), 1 of 1 downloaded from cache
  163. 135.66 s Failed to build gammaloop-crate-test-binaries-three-dimensional-reps-50150770f831b638-deps after 3.9s
  164. 135.66 s error: Cannot build '/nix/store/7zw48naflmi73dxkqz28kzrmi51nzd6p-gammaloop-crate-test-binaries-three-dimensional-reps-50150770f831b638-deps-0.1.0.drv'.
  165. 135.66 s Reason: builder failed with exit code 101.
  166. 135.66 s Output paths:
  167. 135.66 s /nix/store/rbv8894f6hcln558p7qjz75i2d2w7jsa-gammaloop-crate-test-binaries-three-dimensional-reps-50150770f831b638-deps-0.1.0
  168. 135.66 s Last 74 log lines:
  169. 135.66 s > Running phase: unpackPhase
  170. 135.66 s > unpacking source archive /nix/store/w23i6db12qhinqrv98z967yzr6awmzqj-source
  171. 135.66 s > source root is source
  172. 135.66 s > Running phase: patchPhase
  173. 135.66 s > Executing configureCargoCommonVars
  174. 135.66 s > copying cargo artifacts from /nix/store/1hkp51xn27aapbsqcb4apz40glk6yvlw-gammaloop-crate-test-binaries-three-dimensional-reps-50150770f831b638-inputs/target to target
  175. 135.66 s > will deep copy artifacts (instead of symlinking) as requested
  176. 135.66 s > Running phase: updateAutotoolsGnuConfigScriptsPhase
  177. 135.66 s > Running phase: configurePhase
  178. 135.66 s > will append /build/source/.cargo-home/config.toml with contents of /nix/store/1sigmg52bb61pfngmk9k8wq5fz9r7bf1-vendor-cargo-deps/config.toml
  179. 135.66 s > default configurePhase, nothing to do
  180. 135.66 s > Running phase: buildPhase
  181. 135.66 s > +++ command cargo --version
  182. 135.66 s > cargo 1.97.0 (c980f4866 2026-06-30)
  183. 135.66 s > +++ command cargo test --profile ci-optim --no-run --offline -p three-dimensional-reps --features three-dimensional-reps/serde
  184. 135.66 s > Compiling three-dimensional-reps v0.1.0 (/build/source/crates/three-dimensional-reps)
  185. 135.66 s > error[E0433]: cannot find `eval` in `crate`
  186. 135.66 s > --> crates/three-dimensional-reps/src/generation.rs:7255:28
  187. 135.66 s > |
  188. 135.66 s > 7255 | let input = crate::eval::EvaluationInput {
  189. 135.66 s > | ^^^^ could not find `eval` in the crate root
  190. 135.66 s > |
  191. 135.66 s > note: found an item that was configured out
  192. 135.66 s > --> crates/three-dimensional-reps/src/lib.rs:7:9
  193. 135.66 s > |
  194. 135.66 s > 6 | #[cfg(feature = "eval")]
  195. 135.66 s > | ---------------- the item is gated behind the `eval` feature
  196. 135.66 s > 7 | pub mod eval;
  197. 135.66 s > | ^^^^
  198. 135.66 s >
  199. 135.66 s > error[E0433]: cannot find `eval` in `crate`
  200. 135.66 s > --> crates/three-dimensional-reps/src/generation.rs:7262:30
  201. 135.66 s > |
  202. 135.66 s > 7262 | let contact = crate::eval::evaluate_expression(
  203. 135.66 s > | ^^^^ could not find `eval` in the crate root
  204. 135.66 s > |
  205. 135.66 s > note: found an item that was configured out
  206. 135.66 s > --> crates/three-dimensional-reps/src/lib.rs:7:9
  207. 135.66 s > |
  208. 135.66 s > 6 | #[cfg(feature = "eval")]
  209. 135.66 s > | ---------------- the item is gated behind the `eval` feature
  210. 135.66 s > 7 | pub mod eval;
  211. 135.66 s > | ^^^^
  212. 135.66 s >
  213. 135.66 s > error[E0433]: cannot find `eval` in `crate`
  214. 135.66 s > --> crates/three-dimensional-reps/src/generation.rs:7270:32
  215. 135.66 s > |
  216. 135.66 s > 7270 | let remainder = crate::eval::evaluate_expression(
  217. 135.66 s > | ^^^^ could not find `eval` in the crate root
  218. 135.66 s > |
  219. 135.66 s > note: found an item that was configured out
  220. 135.66 s > --> crates/three-dimensional-reps/src/lib.rs:7:9
  221. 135.66 s > |
  222. 135.66 s > 6 | #[cfg(feature = "eval")]
  223. 135.66 s > | ---------------- the item is gated behind the `eval` feature
  224. 135.66 s > 7 | pub mod eval;
  225. 135.66 s > | ^^^^
  226. 135.66 s >
  227. 135.66 s > error[E0433]: cannot find `eval` in `crate`
  228. 135.66 s > --> crates/three-dimensional-reps/src/generation.rs:7278:28
  229. 135.66 s > |
  230. 135.66 s > 7278 | let total = crate::eval::evaluate_expression(&powered, &expression, numerator, &input)
  231. 135.66 s > | ^^^^ could not find `eval` in the crate root
  232. 135.66 s > |
  233. 135.66 s > note: found an item that was configured out
  234. 135.66 s > --> crates/three-dimensional-reps/src/lib.rs:7:9
  235. 135.66 s > |
  236. 135.66 s > 6 | #[cfg(feature = "eval")]
  237. 135.66 s > | ---------------- the item is gated behind the `eval` feature
  238. 135.66 s > 7 | pub mod eval;
  239. 135.66 s > | ^^^^
  240. 135.66 s >
  241. 135.66 s > For more information about this error, try `rustc --explain E0433`.
  242. 135.66 s > error: could not compile `three-dimensional-reps` (lib test) due to 4 previous errors
  243. 135.66 s For full logs, run:
  244. 135.66 s nix log /nix/store/7zw48naflmi73dxkqz28kzrmi51nzd6p-gammaloop-crate-test-binaries-three-dimensional-reps-50150770f831b638-deps-0.1.0.drv
  245. 135.66 s error: Cannot build '/nix/store/0arbyg6b93dlhf744x5n77jg72p0mag5-nix-ci-artifact-barrier-crate-test-binaries-three-dimensional-reps.drv'.
  246. 135.66 s Reason: 1 dependency failed.
  247. 135.66 s Output paths:
  248. 135.66 s /nix/store/jnhfchcdvn4xdz45qgcm3qsqbpl0q3gz-nix-ci-artifact-barrier-crate-test-binaries-three-dimensional-reps
  249. 135.66 s Build failed due to failed dependency
  250. 135.76 s Build failed.