build checks.x86_64-linux.gammaloop-nextest-binaries-core

Reproduce this run
Original Run
  1. 0.00 s $ /nix/store/9ypz3flqsrl5xl495mm8h645gadjsxi1-coreutils-9.11/bin/timeout --kill-after=15s 7200s /nix/store/23zk8sgzamrbmj1fday15szf7f2279s8-nix-2.34.7/bin/nix --extra-experimental-features nix-command --extra-experimental-features flakes --log-format internal-json build --no-link --print-out-paths git+https://github.com/alphal00p/gammaloop?ref=codex%2Fnix-metadata-20260906&rev=b6b126198170b848f9fdb11014d4af7e02fbf9b5&shallow=1#checks.x86_64-linux.gammaloop-nextest-binaries-core --print-build-logs
  2. 4.24 s
  3. 5.51 s Downloading cached gammaloop-ci-test-binary-dependencies-247ff5d63201fb2c-Cargo.toml from https://cache.nix-ci.com
  4. 5.51 s Downloading cached gammaloop-ci-test-binary-dependencies-31e37aec92971227-Cargo.toml from https://cache.nix-ci.com
  5. 5.51 s Downloading cached gammaloop-ci-test-binary-dependencies-50150770f831b638-Cargo.toml from https://cache.nix-ci.com
  6. 5.51 s Downloading cached gammaloop-ci-test-binary-dependencies-f0f952c3f8c3050c-Cargo.toml from https://cache.nix-ci.com
  7. 5.52 s Downloaded cached gammaloop-ci-test-binary-dependencies-f0f952c3f8c3050c-Cargo.toml (1320 B) in 9ms
  8. 5.52 s Downloaded cached gammaloop-ci-test-binary-dependencies-247ff5d63201fb2c-Cargo.toml (1368 B) in 10ms
  9. 5.52 s Downloaded cached gammaloop-ci-test-binary-dependencies-31e37aec92971227-Cargo.toml (824 B) in 10ms
  10. 5.52 s Downloaded cached gammaloop-ci-test-binary-dependencies-50150770f831b638-Cargo.toml (584 B) in 11ms
  11. 5.76 s Building /nix/store/d2ih04vym549rl0m3achp1b6siwkx67x-gammaloop-nextest-binaries-core-gammaloop-tracing-filter-macros-0.1.0.drv
  12. 5.77 s Downloading cached gammaloop-crate-test-dependencies-01b6df4f694091ad-inputs from https://cache.nix-ci.com
  13. 5.77 s Downloading cached gammaloop-crate-test-dependencies-31e37aec92971227-inputs from https://cache.nix-ci.com
  14. 5.81 s Building /nix/store/d803fdhy5vdmwg1bxnrdbbh443q5b2l1-gammaloop-ci-test-binary-dependencies-247ff5d63201fb2c-gammalooprs-dev-dependency.toml.drv
  15. 5.85 s Building /nix/store/8n7av5d2xzacvwsymvrcwygl7s0wgynb-gammaloop-ci-test-binary-dependencies-31e37aec92971227-gammaloop-tracing-filter-dev-dependency.toml.drv
  16. 5.89 s Building /nix/store/620cg4lxjsln105525v3nij0sy75ni31-gammaloop-ci-test-binary-dependencies-50150770f831b638-three-dimensional-reps-dev-dependency.toml.drv
  17. 5.92 s Building /nix/store/4wx7g7wm0incs1bkkmd6hnsr8bjq7s41-gammaloop-ci-test-binary-dependencies-f0f952c3f8c3050c-gammaloop-api-dev-dependency.toml.drv
  18. 5.98 s Building /nix/store/jxvw34bgxdnn9bkva90k3g1kdb1h3z69-gammaloop-ci-test-dependencies-50150770f831b638-Cargo.toml.drv
  19. 6.07 s Building /nix/store/jmhhhrwdm93h4plqd0nn7x0a47yf0nbh-gammaloop-crate-test-dependencies-50150770f831b638-inputs.drv
  20. 6.07 s Progress: 0 of 22 built (7 building), 1 of 18 downloaded from cache (5 downloading)
  21. 6.07 s Progress: 0 of 22 built (7 building), 2 of 18 downloaded from cache (4 downloading)
  22. 6.07 s Progress: 0 of 22 built (7 building), 3 of 18 downloaded from cache (3 downloading)
  23. 6.07 s Progress: 0 of 22 built (7 building), 4 of 18 downloaded from cache (2 downloading)
  24. 6.09 s [gammaloop-ci-test-binary-dependencies-247ff5d63201fb2c-gammalooprs-dev-dependency.toml:post-build] Uploading to the NixCI cache: /nix/store/fzwgaj7lkfphcc1g09xfmk55hmkxkr0x-gammaloop-ci-test-binary-dependencies-247ff5d63201fb2c-gammalooprs-dev-dependency.toml
  25. 6.15 s [gammaloop-ci-test-binary-dependencies-247ff5d63201fb2c-gammalooprs-dev-dependency.toml:post-build] warning: 'warn-short-path-literals' is deprecated, use 'lint-short-path-literals = ignore' instead
  26. 6.19 s [gammaloop-ci-test-binary-dependencies-247ff5d63201fb2c-gammalooprs-dev-dependency.toml:post-build] copying 0 paths...
  27. 6.26 s [gammaloop-ci-test-binary-dependencies-247ff5d63201fb2c-gammalooprs-dev-dependency.toml:post-build] warning: 'warn-short-path-literals' is deprecated, use 'lint-short-path-literals = ignore' instead
  28. 6.34 s [gammaloop-ci-test-binary-dependencies-247ff5d63201fb2c-gammalooprs-dev-dependency.toml:post-build] copying 0 paths...
  29. 6.36 s Uploaded gammaloop-ci-test-binary-dependencies-247ff5d63201fb2c-gammalooprs-dev-dependency.toml in 286ms
  30. 6.36 s Progress: 1 of 23 built (6 building), 4 of 18 downloaded from cache (2 downloading)
  31. 6.36 s Built gammaloop-ci-test-binary-dependencies-247ff5d63201fb2c-gammalooprs-dev-dependency.toml in 552ms
  32. 6.39 s [gammaloop-ci-test-binary-dependencies-31e37aec92971227-gammaloop-tracing-filter-dev-dependency.toml:post-build] Uploading to the NixCI cache: /nix/store/a90w47vskdc47wbbm7xrpzbp3hjc6n01-gammaloop-ci-test-binary-dependencies-31e37aec92971227-gammaloop-tracing-filter-dev-dependency.toml
  33. 6.45 s [gammaloop-ci-test-binary-dependencies-31e37aec92971227-gammaloop-tracing-filter-dev-dependency.toml:post-build] warning: 'warn-short-path-literals' is deprecated, use 'lint-short-path-literals = ignore' instead
  34. 6.49 s [gammaloop-ci-test-binary-dependencies-31e37aec92971227-gammaloop-tracing-filter-dev-dependency.toml:post-build] copying 0 paths...
  35. 6.57 s [gammaloop-ci-test-binary-dependencies-31e37aec92971227-gammaloop-tracing-filter-dev-dependency.toml:post-build] warning: 'warn-short-path-literals' is deprecated, use 'lint-short-path-literals = ignore' instead
  36. 6.65 s [gammaloop-ci-test-binary-dependencies-31e37aec92971227-gammaloop-tracing-filter-dev-dependency.toml:post-build] copying 0 paths...
  37. 6.67 s Uploaded gammaloop-ci-test-binary-dependencies-31e37aec92971227-gammaloop-tracing-filter-dev-dependency.toml in 301ms
  38. 6.67 s Progress: 2 of 24 built (5 building), 4 of 18 downloaded from cache (2 downloading)
  39. 6.67 s Built gammaloop-ci-test-binary-dependencies-31e37aec92971227-gammaloop-tracing-filter-dev-dependency.toml in 814ms
  40. 6.70 s [gammaloop-ci-test-binary-dependencies-50150770f831b638-three-dimensional-reps-dev-dependency.toml:post-build] Uploading to the NixCI cache: /nix/store/nkd9p6h639pp1ya2nb2yngjw7qb80nfg-gammaloop-ci-test-binary-dependencies-50150770f831b638-three-dimensional-reps-dev-dependency.toml
  41. 6.75 s [gammaloop-ci-test-binary-dependencies-50150770f831b638-three-dimensional-reps-dev-dependency.toml:post-build] warning: 'warn-short-path-literals' is deprecated, use 'lint-short-path-literals = ignore' instead
  42. 6.79 s [gammaloop-ci-test-binary-dependencies-50150770f831b638-three-dimensional-reps-dev-dependency.toml:post-build] copying 0 paths...
  43. 6.85 s [gammaloop-ci-test-binary-dependencies-50150770f831b638-three-dimensional-reps-dev-dependency.toml:post-build] warning: 'warn-short-path-literals' is deprecated, use 'lint-short-path-literals = ignore' instead
  44. 6.92 s [gammaloop-ci-test-binary-dependencies-50150770f831b638-three-dimensional-reps-dev-dependency.toml:post-build] copying 0 paths...
  45. 6.94 s Uploaded gammaloop-ci-test-binary-dependencies-50150770f831b638-three-dimensional-reps-dev-dependency.toml in 266ms
  46. 6.94 s Progress: 3 of 25 built (4 building), 4 of 18 downloaded from cache (2 downloading)
  47. 6.94 s Built gammaloop-ci-test-binary-dependencies-50150770f831b638-three-dimensional-reps-dev-dependency.toml in 1.0s
  48. 6.98 s [gammaloop-ci-test-binary-dependencies-f0f952c3f8c3050c-gammaloop-api-dev-dependency.toml:post-build] Uploading to the NixCI cache: /nix/store/8n1xwz3n1glb8aw2nw1zp5k5wfk62wm4-gammaloop-ci-test-binary-dependencies-f0f952c3f8c3050c-gammaloop-api-dev-dependency.toml
  49. 7.03 s [gammaloop-ci-test-binary-dependencies-f0f952c3f8c3050c-gammaloop-api-dev-dependency.toml:post-build] warning: 'warn-short-path-literals' is deprecated, use 'lint-short-path-literals = ignore' instead
  50. 7.07 s [gammaloop-ci-test-binary-dependencies-f0f952c3f8c3050c-gammaloop-api-dev-dependency.toml:post-build] copying 0 paths...
  51. 7.14 s [gammaloop-ci-test-binary-dependencies-f0f952c3f8c3050c-gammaloop-api-dev-dependency.toml:post-build] warning: 'warn-short-path-literals' is deprecated, use 'lint-short-path-literals = ignore' instead
  52. 7.21 s [gammaloop-ci-test-binary-dependencies-f0f952c3f8c3050c-gammaloop-api-dev-dependency.toml:post-build] copying 0 paths...
  53. 7.23 s Uploaded gammaloop-ci-test-binary-dependencies-f0f952c3f8c3050c-gammaloop-api-dev-dependency.toml in 279ms
  54. 7.23 s Progress: 4 of 26 built (3 building), 4 of 18 downloaded from cache (2 downloading)
  55. 7.23 s Built gammaloop-ci-test-binary-dependencies-f0f952c3f8c3050c-gammaloop-api-dev-dependency.toml in 1.3s
  56. 7.26 s [gammaloop-ci-test-dependencies-50150770f831b638-Cargo.toml:post-build] Uploading to the NixCI cache: /nix/store/l910djsa81d33bspw74vkisyvzi8c7k4-gammaloop-ci-test-dependencies-50150770f831b638-Cargo.toml
  57. 7.32 s [gammaloop-ci-test-dependencies-50150770f831b638-Cargo.toml:post-build] warning: 'warn-short-path-literals' is deprecated, use 'lint-short-path-literals = ignore' instead
  58. 7.36 s [gammaloop-ci-test-dependencies-50150770f831b638-Cargo.toml:post-build] copying 0 paths...
  59. 7.43 s [gammaloop-ci-test-dependencies-50150770f831b638-Cargo.toml:post-build] warning: 'warn-short-path-literals' is deprecated, use 'lint-short-path-literals = ignore' instead
  60. 7.52 s [gammaloop-ci-test-dependencies-50150770f831b638-Cargo.toml:post-build] copying 0 paths...
  61. 7.54 s Uploaded gammaloop-ci-test-dependencies-50150770f831b638-Cargo.toml in 300ms
  62. 7.54 s Progress: 5 of 27 built (2 building), 4 of 18 downloaded from cache (2 downloading)
  63. 7.54 s Built gammaloop-ci-test-dependencies-50150770f831b638-Cargo.toml in 1.5s
  64. 7.54 s [gammaloop-nextest-binaries-core-gammaloop-tracing-filter-macros] Phase: unpackPhase
  65. 7.54 s [gammaloop-nextest-binaries-core-gammaloop-tracing-filter-macros] unpacking source archive /nix/store/s9laxhmq01dchxb20prkpgsrbcz36iqj-source
  66. 7.54 s [gammaloop-nextest-binaries-core-gammaloop-tracing-filter-macros] source root is source
  67. 7.54 s [gammaloop-nextest-binaries-core-gammaloop-tracing-filter-macros] Phase: patchPhase
  68. 7.54 s [gammaloop-nextest-binaries-core-gammaloop-tracing-filter-macros] copying cargo artifacts from /nix/store/dlh3rl0zih31g7l8hwjabhdf9wlzr0db-gammaloop-crate-test-binaries-gammaloop-tracing-filter-macros-1b17e1ec025c6580-inputs/target to target
  69. 8.07 s [gammaloop-nextest-binaries-core-gammaloop-tracing-filter-macros] Executing configureCargoCommonVars
  70. 8.08 s [gammaloop-nextest-binaries-core-gammaloop-tracing-filter-macros] decompressing cargo artifacts from /nix/store/7v5kj1x4cvs2ixg2cjqarhd57l0d9d3b-gammaloop-crate-test-binaries-gammaloop-tracing-filter-macros-1b17e1ec025c6580-deps-0.1.0/target.tar.zst to target
  71. 8.09 s [gammaloop-nextest-binaries-core-gammaloop-tracing-filter-macros] Phase: updateAutotoolsGnuConfigScriptsPhase
  72. 8.12 s [gammaloop-nextest-binaries-core-gammaloop-tracing-filter-macros] Phase: configurePhase
  73. 8.13 s [gammaloop-nextest-binaries-core-gammaloop-tracing-filter-macros] will append /build/source/.cargo-home/config.toml with contents of /nix/store/1sigmg52bb61pfngmk9k8wq5fz9r7bf1-vendor-cargo-deps/config.toml
  74. 8.13 s [gammaloop-nextest-binaries-core-gammaloop-tracing-filter-macros] default configurePhase, nothing to do
  75. 8.13 s [gammaloop-nextest-binaries-core-gammaloop-tracing-filter-macros] Phase: buildPhase
  76. 8.14 s [gammaloop-nextest-binaries-core-gammaloop-tracing-filter-macros] +++ command cargo --version
  77. 8.14 s [gammaloop-nextest-binaries-core-gammaloop-tracing-filter-macros] cargo 1.97.0 (c980f4866 2026-06-30)
  78. 8.19 s [gammaloop-nextest-binaries-core-gammaloop-tracing-filter-macros] +++ command cargo nextest --version
  79. 8.20 s [gammaloop-nextest-binaries-core-gammaloop-tracing-filter-macros] cargo-nextest 0.9.140
  80. 8.20 s [gammaloop-nextest-binaries-core-gammaloop-tracing-filter-macros] release: 0.9.140
  81. 8.20 s [gammaloop-nextest-binaries-core-gammaloop-tracing-filter-macros] host: x86_64-unknown-linux-gnu
  82. 8.20 s [gammaloop-nextest-binaries-core-gammaloop-tracing-filter-macros] +++ command cargo nextest archive --cargo-profile ci-optim --offline -p gammaloop-tracing-filter-macros -E 'package(gammaloop-tracing-filter-macros)' --profile ci_gammaloop --archive-file /nix/store/jmd0j7nbbzgsx3807p0jfp45dmkc88ji-gammaloop-nextest-binaries-core-gammaloop-tracing-filter-macros-0.1.0/gammaloop-nextest-core-gammaloop-tracing-filter-macros.tar.zst
  83. 8.87 s [gammaloop-nextest-binaries-core-gammaloop-tracing-filter-macros] Finished `ci-optim` profile [optimized] target(s) in 0.20s
  84. 8.90 s [gammaloop-nextest-binaries-core-gammaloop-tracing-filter-macros] Archiving 1 binary and 1 standard library to /nix/store/jmd0j7nbbzgsx3807p0jfp45dmkc88ji-gammaloop-nextest-binaries-core-gammaloop-tracing-filter-macros-0.1.0/gammaloop-nextest-core-gammaloop-tracing-filter-macros.tar.zst
  85. 8.95 s [gammaloop-nextest-binaries-core-gammaloop-tracing-filter-macros] Archived 4 files to /nix/store/jmd0j7nbbzgsx3807p0jfp45dmkc88ji-gammaloop-nextest-binaries-core-gammaloop-tracing-filter-macros-0.1.0/gammaloop-nextest-core-gammaloop-tracing-filter-macros.tar.zst in 0.05s
  86. 8.96 s [gammaloop-nextest-binaries-core-gammaloop-tracing-filter-macros] Phase: installPhase
  87. 8.97 s [gammaloop-nextest-binaries-core-gammaloop-tracing-filter-macros] Phase: fixupPhase
  88. 8.99 s [gammaloop-nextest-binaries-core-gammaloop-tracing-filter-macros] shrinking RPATHs of ELF executables and libraries in /nix/store/jmd0j7nbbzgsx3807p0jfp45dmkc88ji-gammaloop-nextest-binaries-core-gammaloop-tracing-filter-macros-0.1.0
  89. 8.99 s [gammaloop-nextest-binaries-core-gammaloop-tracing-filter-macros] checking for references to /build/ in /nix/store/jmd0j7nbbzgsx3807p0jfp45dmkc88ji-gammaloop-nextest-binaries-core-gammaloop-tracing-filter-macros-0.1.0...
  90. 9.00 s [gammaloop-nextest-binaries-core-gammaloop-tracing-filter-macros] patching script interpreter paths in /nix/store/jmd0j7nbbzgsx3807p0jfp45dmkc88ji-gammaloop-nextest-binaries-core-gammaloop-tracing-filter-macros-0.1.0
  91. 9.20 s [gammaloop-nextest-binaries-core-gammaloop-tracing-filter-macros:post-build] Uploading to the NixCI cache: /nix/store/jmd0j7nbbzgsx3807p0jfp45dmkc88ji-gammaloop-nextest-binaries-core-gammaloop-tracing-filter-macros-0.1.0
  92. 9.25 s [gammaloop-nextest-binaries-core-gammaloop-tracing-filter-macros:post-build] warning: 'warn-short-path-literals' is deprecated, use 'lint-short-path-literals = ignore' instead
  93. 9.26 s [gammaloop-nextest-binaries-core-gammaloop-tracing-filter-macros:post-build] copying 1 paths...
  94. 9.26 s [gammaloop-nextest-binaries-core-gammaloop-tracing-filter-macros:post-build] copying path '/nix/store/jmd0j7nbbzgsx3807p0jfp45dmkc88ji-gammaloop-nextest-binaries-core-gammaloop-tracing-filter-macros-0.1.0' to 'https://cache.nix-ci.com'...
  95. 10.02 s [gammaloop-nextest-binaries-core-gammaloop-tracing-filter-macros:post-build] warning: 'warn-short-path-literals' is deprecated, use 'lint-short-path-literals = ignore' instead
  96. 10.27 s [gammaloop-nextest-binaries-core-gammaloop-tracing-filter-macros:post-build] copying 2 paths...
  97. 10.27 s [gammaloop-nextest-binaries-core-gammaloop-tracing-filter-macros:post-build] copying path '/nix/store/s9laxhmq01dchxb20prkpgsrbcz36iqj-source' to 'https://cache.nix-ci.com'...
  98. 10.44 s [gammaloop-nextest-binaries-core-gammaloop-tracing-filter-macros:post-build] copying path '/nix/store/d2ih04vym549rl0m3achp1b6siwkx67x-gammaloop-nextest-binaries-core-gammaloop-tracing-filter-macros-0.1.0.drv' to 'https://cache.nix-ci.com'...
  99. 10.60 s Uploaded gammaloop-nextest-binaries-core-gammaloop-tracing-filter-macros in 1.4s
  100. 10.60 s Progress: 6 of 19 built (1 building), 4 of 18 downloaded from cache (2 downloading)
  101. 10.60 s Built gammaloop-nextest-binaries-core-gammaloop-tracing-filter-macros in 4.8s
  102. 12.25 s [gammaloop-crate-test-dependencies-50150770f831b638-inputs:post-build] Uploading to the NixCI cache: /nix/store/f2rkqh3q0lxip9bacx3qjgahcv40f7v1-gammaloop-crate-test-dependencies-50150770f831b638-inputs
  103. 12.30 s [gammaloop-crate-test-dependencies-50150770f831b638-inputs:post-build] warning: 'warn-short-path-literals' is deprecated, use 'lint-short-path-literals = ignore' instead
  104. 12.34 s [gammaloop-crate-test-dependencies-50150770f831b638-inputs:post-build] copying 1 paths...
  105. 12.34 s [gammaloop-crate-test-dependencies-50150770f831b638-inputs:post-build] copying path '/nix/store/f2rkqh3q0lxip9bacx3qjgahcv40f7v1-gammaloop-crate-test-dependencies-50150770f831b638-inputs' to 'https://cache.nix-ci.com'...
  106. 14.65 s Downloaded cached gammaloop-crate-test-dependencies-01b6df4f694091ad-inputs (1.1 GiB) in 8.8s
  107. 18.65 s Downloaded cached gammaloop-crate-test-dependencies-31e37aec92971227-inputs (1.5 GiB) in 12.8s
  108. 52.38 s [gammaloop-crate-test-dependencies-50150770f831b638-inputs:post-build] warning: 'warn-short-path-literals' is deprecated, use 'lint-short-path-literals = ignore' instead
  109. 52.53 s [gammaloop-crate-test-dependencies-50150770f831b638-inputs:post-build] copying 0 paths...
  110. 52.55 s Uploaded gammaloop-crate-test-dependencies-50150770f831b638-inputs in 40.3s
  111. 52.55 s Progress: 7 of 19 built, 4 of 18 downloaded from cache (2 downloading)
  112. 52.55 s Built gammaloop-crate-test-dependencies-50150770f831b638-inputs in 46.4s
  113. 52.62 s Building /nix/store/cix37g28bf54jqs4499qhq07m0qdnw8l-gammaloop-crate-test-dependencies-50150770f831b638-deps-0.1.0.drv
  114. 52.62 s Progress: 7 of 18 built (1 building), 5 of 18 downloaded from cache (1 downloading)
  115. 52.62 s Progress: 7 of 18 built (1 building), 6 of 18 downloaded from cache
  116. 52.62 s Downloading cached gammaloop-crate-test-dependencies-31e37aec92971227-deps from https://cache.nix-ci.com
  117. 52.62 s Downloading cached gammaloop-crate-test-dependencies-01b6df4f694091ad-deps from https://cache.nix-ci.com
  118. 52.69 s [gammaloop-crate-test-dependencies-50150770f831b638-deps] Phase: unpackPhase
  119. 52.69 s [gammaloop-crate-test-dependencies-50150770f831b638-deps] unpacking source archive /nix/store/w23i6db12qhinqrv98z967yzr6awmzqj-source
  120. 52.72 s [gammaloop-crate-test-dependencies-50150770f831b638-deps] source root is source
  121. 52.73 s [gammaloop-crate-test-dependencies-50150770f831b638-deps] Phase: patchPhase
  122. 52.85 s [gammaloop-crate-test-dependencies-50150770f831b638-deps] Executing configureCargoCommonVars
  123. 52.86 s [gammaloop-crate-test-dependencies-50150770f831b638-deps] copying cargo artifacts from /nix/store/f2rkqh3q0lxip9bacx3qjgahcv40f7v1-gammaloop-crate-test-dependencies-50150770f831b638-inputs/target to target
  124. 52.86 s [gammaloop-crate-test-dependencies-50150770f831b638-deps] will deep copy artifacts (instead of symlinking) as requested
  125. 52.94 s Downloaded cached gammaloop-crate-test-dependencies-31e37aec92971227-deps (17.9 MiB) in 315ms
  126. 52.94 s Progress: 7 of 18 built (1 building), 7 of 18 downloaded from cache (1 downloading)
  127. 52.94 s Downloading cached gammaloop-crate-test-binaries-gammaloop-tracing-filter-31e37aec92971227-inputs from https://cache.nix-ci.com
  128. 53.07 s Downloaded cached gammaloop-crate-test-dependencies-01b6df4f694091ad-deps (22.1 MiB) in 454ms
  129. 53.07 s Progress: 7 of 18 built (1 building), 8 of 18 downloaded from cache (1 downloading)
  130. 53.12 s Downloading cached gammaloop-crate-test-dependencies-50150770f831b638-deps from https://cache.nix-ci.com
  131. 54.15 s [gammaloop-crate-test-dependencies-50150770f831b638-deps] Phase: updateAutotoolsGnuConfigScriptsPhase
  132. 54.19 s [gammaloop-crate-test-dependencies-50150770f831b638-deps] Phase: configurePhase
  133. 54.20 s [gammaloop-crate-test-dependencies-50150770f831b638-deps] will append /build/source/.cargo-home/config.toml with contents of /nix/store/1sigmg52bb61pfngmk9k8wq5fz9r7bf1-vendor-cargo-deps/config.toml
  134. 54.20 s [gammaloop-crate-test-dependencies-50150770f831b638-deps] default configurePhase, nothing to do
  135. 54.20 s [gammaloop-crate-test-dependencies-50150770f831b638-deps] Phase: buildPhase
  136. 54.21 s [gammaloop-crate-test-dependencies-50150770f831b638-deps] +++ command cargo --version
  137. 54.21 s [gammaloop-crate-test-dependencies-50150770f831b638-deps] cargo 1.97.0 (c980f4866 2026-06-30)
  138. 54.21 s [gammaloop-crate-test-dependencies-50150770f831b638-deps] +++ command cargo build --profile ci-optim --offline -p gammaloop-ci-test-dependencies-50150770f831b638 -p gammaloop-workspace-hack --features linnet/bincode,linnet/drawing,linnet/serde,linnet/symbolica,symbolica/tracing_max_level_info,three-dimensional-reps/serde --lib
  139. 54.63 s [gammaloop-crate-test-dependencies-50150770f831b638-deps] Compiling three-dimensional-reps v0.1.0 (/build/source/crates/three-dimensional-reps)
  140. 54.63 s [gammaloop-crate-test-dependencies-50150770f831b638-deps] Compiling linnet v0.17.0 (/build/source/crates/linnet)
  141. 61.30 s [gammaloop-crate-test-dependencies-50150770f831b638-deps] Compiling gammaloop-ci-test-dependencies-50150770f831b638 v0.1.0 (/build/source/crates/gammaloop-ci-test-dependencies-50150770f831b638)
  142. 65.04 s Downloaded cached gammaloop-crate-test-binaries-gammaloop-tracing-filter-31e37aec92971227-inputs (1.6 GiB) in 12.0s
  143. 65.04 s Progress: 7 of 20 built (1 building), 9 of 17 downloaded from cache (1 downloading)
  144. 65.04 s Downloading cached gammaloop-crate-test-binaries-gammaloop-tracing-filter-31e37aec92971227-deps from https://cache.nix-ci.com
  145. 65.13 s Downloaded cached gammaloop-crate-test-binaries-gammaloop-tracing-filter-31e37aec92971227-deps (5.8 MiB) in 91ms
  146. 65.13 s Progress: 7 of 20 built (1 building), 10 of 17 downloaded from cache (1 downloading)
  147. 65.23 s Building /nix/store/2n977ah3gns09cpp2wnl2avvx8mvm02a-gammaloop-nextest-binaries-core-gammaloop-tracing-filter-0.1.0.drv
  148. 65.31 s [gammaloop-nextest-binaries-core-gammaloop-tracing-filter] Phase: unpackPhase
  149. 65.32 s [gammaloop-nextest-binaries-core-gammaloop-tracing-filter] unpacking source archive /nix/store/djzi7dr8aljl7w6cicwyzlpw8h37hbxm-source
  150. 65.36 s [gammaloop-nextest-binaries-core-gammaloop-tracing-filter] source root is source
  151. 65.38 s [gammaloop-nextest-binaries-core-gammaloop-tracing-filter] Phase: patchPhase
  152. 65.50 s [gammaloop-nextest-binaries-core-gammaloop-tracing-filter] copying cargo artifacts from /nix/store/5r0im23nfwyv9jk3nymzlx3sd00sqns5-gammaloop-crate-test-binaries-gammaloop-tracing-filter-31e37aec92971227-inputs/target to target
  153. 66.34 s [gammaloop-crate-test-dependencies-50150770f831b638-deps] Finished `ci-optim` profile [optimized] target(s) in 12.12s
  154. 66.53 s [gammaloop-crate-test-dependencies-50150770f831b638-deps] warning: the following packages contain code that will be rejected by a future version of Rust: proc-macro-error2 v2.0.1
  155. 66.53 s [gammaloop-crate-test-dependencies-50150770f831b638-deps] note: to see what the problems were, use the option `--future-incompat-report`, or run `cargo report future-incompatibilities --id 1`
  156. 66.59 s [gammaloop-crate-test-dependencies-50150770f831b638-deps] +++ command cargo build --profile ci-optim --offline -p gammaloop-ci-test-binary-dependencies-50150770f831b638 -p three-dimensional-reps --features linnet/bincode,linnet/drawing,linnet/serde,linnet/symbolica,symbolica/tracing_max_level_info,three-dimensional-reps/serde --lib
  157. 66.98 s [gammaloop-crate-test-dependencies-50150770f831b638-deps] Compiling linnet v0.17.0 (/build/source/crates/linnet)
  158. 67.63 s [gammaloop-nextest-binaries-core-gammaloop-tracing-filter] Executing configureCargoCommonVars
  159. 67.64 s [gammaloop-nextest-binaries-core-gammaloop-tracing-filter] decompressing cargo artifacts from /nix/store/38lall6l0hvfh8il113w32ls0iismlsn-gammaloop-crate-test-binaries-gammaloop-tracing-filter-31e37aec92971227-deps-0.1.0/target.tar.zst to target
  160. 67.68 s [gammaloop-nextest-binaries-core-gammaloop-tracing-filter] Phase: updateAutotoolsGnuConfigScriptsPhase
  161. 67.72 s [gammaloop-nextest-binaries-core-gammaloop-tracing-filter] Phase: configurePhase
  162. 67.73 s [gammaloop-nextest-binaries-core-gammaloop-tracing-filter] will append /build/source/.cargo-home/config.toml with contents of /nix/store/1sigmg52bb61pfngmk9k8wq5fz9r7bf1-vendor-cargo-deps/config.toml
  163. 67.73 s [gammaloop-nextest-binaries-core-gammaloop-tracing-filter] default configurePhase, nothing to do
  164. 67.73 s [gammaloop-nextest-binaries-core-gammaloop-tracing-filter] Phase: buildPhase
  165. 67.74 s [gammaloop-nextest-binaries-core-gammaloop-tracing-filter] +++ command cargo --version
  166. 67.74 s [gammaloop-nextest-binaries-core-gammaloop-tracing-filter] cargo 1.97.0 (c980f4866 2026-06-30)
  167. 67.80 s [gammaloop-nextest-binaries-core-gammaloop-tracing-filter] +++ command cargo nextest --version
  168. 67.82 s [gammaloop-nextest-binaries-core-gammaloop-tracing-filter] cargo-nextest 0.9.140
  169. 67.82 s [gammaloop-nextest-binaries-core-gammaloop-tracing-filter] release: 0.9.140
  170. 67.82 s [gammaloop-nextest-binaries-core-gammaloop-tracing-filter] host: x86_64-unknown-linux-gnu
  171. 67.82 s [gammaloop-nextest-binaries-core-gammaloop-tracing-filter] +++ command cargo nextest archive --cargo-profile ci-optim --offline -p gammaloop-tracing-filter --features gammaloop-tracing-filter/clap,gammaloop-tracing-filter/symbolica -E 'package(gammaloop-tracing-filter)' --profile ci_gammaloop --archive-file /nix/store/5j7gb8x4i5y8si5qh1fn8jrajidvv1dw-gammaloop-nextest-binaries-core-gammaloop-tracing-filter-0.1.0/gammaloop-nextest-core-gammaloop-tracing-filter.tar.zst
  172. 68.87 s [gammaloop-nextest-binaries-core-gammaloop-tracing-filter] Finished `ci-optim` profile [optimized] target(s) in 0.36s
  173. 69.05 s [gammaloop-nextest-binaries-core-gammaloop-tracing-filter] warning: the following packages contain code that will be rejected by a future version of Rust: proc-macro-error2 v2.0.1
  174. 69.05 s [gammaloop-nextest-binaries-core-gammaloop-tracing-filter] note: to see what the problems were, use the option `--future-incompat-report`, or run `cargo report future-incompatibilities --id 1`
  175. 69.10 s [gammaloop-nextest-binaries-core-gammaloop-tracing-filter] Archiving 1 binary, 1 linked path, and 1 standard library to /nix/store/5j7gb8x4i5y8si5qh1fn8jrajidvv1dw-gammaloop-nextest-binaries-core-gammaloop-tracing-filter-0.1.0/gammaloop-nextest-core-gammaloop-tracing-filter.tar.zst
  176. 69.20 s [gammaloop-nextest-binaries-core-gammaloop-tracing-filter] Archived 7 files to /nix/store/5j7gb8x4i5y8si5qh1fn8jrajidvv1dw-gammaloop-nextest-binaries-core-gammaloop-tracing-filter-0.1.0/gammaloop-nextest-core-gammaloop-tracing-filter.tar.zst in 0.10s
  177. 69.22 s [gammaloop-nextest-binaries-core-gammaloop-tracing-filter] Phase: installPhase
  178. 69.22 s [gammaloop-nextest-binaries-core-gammaloop-tracing-filter] Phase: fixupPhase
  179. 69.24 s [gammaloop-nextest-binaries-core-gammaloop-tracing-filter] shrinking RPATHs of ELF executables and libraries in /nix/store/5j7gb8x4i5y8si5qh1fn8jrajidvv1dw-gammaloop-nextest-binaries-core-gammaloop-tracing-filter-0.1.0
  180. 69.24 s [gammaloop-nextest-binaries-core-gammaloop-tracing-filter] checking for references to /build/ in /nix/store/5j7gb8x4i5y8si5qh1fn8jrajidvv1dw-gammaloop-nextest-binaries-core-gammaloop-tracing-filter-0.1.0...
  181. 69.25 s [gammaloop-nextest-binaries-core-gammaloop-tracing-filter] patching script interpreter paths in /nix/store/5j7gb8x4i5y8si5qh1fn8jrajidvv1dw-gammaloop-nextest-binaries-core-gammaloop-tracing-filter-0.1.0
  182. 69.50 s [gammaloop-nextest-binaries-core-gammaloop-tracing-filter:post-build] Uploading to the NixCI cache: /nix/store/5j7gb8x4i5y8si5qh1fn8jrajidvv1dw-gammaloop-nextest-binaries-core-gammaloop-tracing-filter-0.1.0
  183. 69.55 s [gammaloop-nextest-binaries-core-gammaloop-tracing-filter:post-build] warning: 'warn-short-path-literals' is deprecated, use 'lint-short-path-literals = ignore' instead
  184. 69.57 s [gammaloop-nextest-binaries-core-gammaloop-tracing-filter:post-build] copying 1 paths...
  185. 69.57 s [gammaloop-nextest-binaries-core-gammaloop-tracing-filter:post-build] copying path '/nix/store/5j7gb8x4i5y8si5qh1fn8jrajidvv1dw-gammaloop-nextest-binaries-core-gammaloop-tracing-filter-0.1.0' to 'https://cache.nix-ci.com'...
  186. 73.38 s [gammaloop-nextest-binaries-core-gammaloop-tracing-filter:post-build] warning: 'warn-short-path-literals' is deprecated, use 'lint-short-path-literals = ignore' instead
  187. 73.72 s [gammaloop-nextest-binaries-core-gammaloop-tracing-filter:post-build] copying 2 paths...
  188. 73.72 s [gammaloop-nextest-binaries-core-gammaloop-tracing-filter:post-build] copying path '/nix/store/djzi7dr8aljl7w6cicwyzlpw8h37hbxm-source' to 'https://cache.nix-ci.com'...
  189. 74.80 s [gammaloop-nextest-binaries-core-gammaloop-tracing-filter:post-build] copying path '/nix/store/2n977ah3gns09cpp2wnl2avvx8mvm02a-gammaloop-nextest-binaries-core-gammaloop-tracing-filter-0.1.0.drv' to 'https://cache.nix-ci.com'...
  190. 74.98 s Uploaded gammaloop-nextest-binaries-core-gammaloop-tracing-filter in 5.4s
  191. 74.98 s Progress: 8 of 20 built (1 building), 10 of 17 downloaded from cache (1 downloading)
  192. 74.98 s Built gammaloop-nextest-binaries-core-gammaloop-tracing-filter in 9.7s
  193. 74.98 s [gammaloop-crate-test-dependencies-50150770f831b638-deps] Compiling three-dimensional-reps v0.1.0 (/build/source/crates/three-dimensional-reps)
  194. 74.98 s [gammaloop-crate-test-dependencies-50150770f831b638-deps] Compiling gammaloop-ci-test-binary-dependencies-50150770f831b638 v0.1.0 (/build/source/crates/gammaloop-ci-test-binary-dependencies-50150770f831b638)
  195. 81.61 s [gammaloop-crate-test-dependencies-50150770f831b638-deps] Finished `ci-optim` profile [optimized] target(s) in 15.01s
  196. 81.80 s [gammaloop-crate-test-dependencies-50150770f831b638-deps] warning: the following packages contain code that will be rejected by a future version of Rust: proc-macro-error2 v2.0.1
  197. 81.80 s [gammaloop-crate-test-dependencies-50150770f831b638-deps] note: to see what the problems were, use the option `--future-incompat-report`, or run `cargo report future-incompatibilities --id 1`
  198. 81.87 s [gammaloop-crate-test-dependencies-50150770f831b638-deps] Phase: installPhase
  199. 81.89 s [gammaloop-crate-test-dependencies-50150770f831b638-deps] linking previous artifacts /nix/store/f2rkqh3q0lxip9bacx3qjgahcv40f7v1-gammaloop-crate-test-dependencies-50150770f831b638-inputs to /nix/store/kvgz31glz0hjbmhwp8r0iwkl7v62inwy-gammaloop-crate-test-dependencies-50150770f831b638-deps-0.1.0/target.tar.zst
  200. 82.01 s [gammaloop-crate-test-dependencies-50150770f831b638-deps] /*stdin*\ : 30.92% ( 66.3 MiB => 20.5 MiB, /nix/store/kvgz31glz0hjbmhwp8r0iwkl7v62inwy-gammaloop-crate-test-dependencies-50150770f831b638-deps-0.1.0/target.tar.zst)
  201. 82.03 s [gammaloop-crate-test-dependencies-50150770f831b638-deps] Phase: fixupPhase
  202. 82.05 s [gammaloop-crate-test-dependencies-50150770f831b638-deps] shrinking RPATHs of ELF executables and libraries in /nix/store/kvgz31glz0hjbmhwp8r0iwkl7v62inwy-gammaloop-crate-test-dependencies-50150770f831b638-deps-0.1.0
  203. 82.05 s [gammaloop-crate-test-dependencies-50150770f831b638-deps] checking for references to /build/ in /nix/store/kvgz31glz0hjbmhwp8r0iwkl7v62inwy-gammaloop-crate-test-dependencies-50150770f831b638-deps-0.1.0...
  204. 82.06 s [gammaloop-crate-test-dependencies-50150770f831b638-deps] patching script interpreter paths in /nix/store/kvgz31glz0hjbmhwp8r0iwkl7v62inwy-gammaloop-crate-test-dependencies-50150770f831b638-deps-0.1.0
  205. 82.42 s [gammaloop-crate-test-dependencies-50150770f831b638-deps:post-build] Uploading to the NixCI cache: /nix/store/kvgz31glz0hjbmhwp8r0iwkl7v62inwy-gammaloop-crate-test-dependencies-50150770f831b638-deps-0.1.0
  206. 82.48 s [gammaloop-crate-test-dependencies-50150770f831b638-deps:post-build] warning: 'warn-short-path-literals' is deprecated, use 'lint-short-path-literals = ignore' instead
  207. 82.53 s [gammaloop-crate-test-dependencies-50150770f831b638-deps:post-build] copying 0 paths...
  208. 82.61 s [gammaloop-crate-test-dependencies-50150770f831b638-deps:post-build] warning: 'warn-short-path-literals' is deprecated, use 'lint-short-path-literals = ignore' instead
  209. 82.82 s [gammaloop-crate-test-dependencies-50150770f831b638-deps:post-build] copying 0 paths...
  210. 82.86 s Uploaded gammaloop-crate-test-dependencies-50150770f831b638-deps in 454ms
  211. 82.86 s Progress: 9 of 20 built, 10 of 17 downloaded from cache (1 downloading)
  212. 82.86 s Built gammaloop-crate-test-dependencies-50150770f831b638-deps in 30.2s
  213. 82.98 s Building /nix/store/cbajpav159907dch3yn4yaxwgsywk6kx-gammaloop-crate-test-binaries-three-dimensional-reps-50150770f831b638-inputs.drv
  214. 83.06 s Downloaded cached gammaloop-crate-test-dependencies-50150770f831b638-deps (20.5 MiB) in 29.9s
  215. 83.06 s Progress: 9 of 19 built (1 building), 11 of 17 downloaded from cache
  216. 83.07 s Downloading cached gammaloop-crate-test-dependencies-247ff5d63201fb2c-inputs from https://cache.nix-ci.com
  217. 88.12 s [gammaloop-crate-test-binaries-three-dimensional-reps-50150770f831b638-inputs:post-build] Uploading to the NixCI cache: /nix/store/1hkp51xn27aapbsqcb4apz40glk6yvlw-gammaloop-crate-test-binaries-three-dimensional-reps-50150770f831b638-inputs
  218. 88.18 s [gammaloop-crate-test-binaries-three-dimensional-reps-50150770f831b638-inputs:post-build] warning: 'warn-short-path-literals' is deprecated, use 'lint-short-path-literals = ignore' instead
  219. 88.23 s [gammaloop-crate-test-binaries-three-dimensional-reps-50150770f831b638-inputs:post-build] copying 0 paths...
  220. 88.30 s [gammaloop-crate-test-binaries-three-dimensional-reps-50150770f831b638-inputs:post-build] warning: 'warn-short-path-literals' is deprecated, use 'lint-short-path-literals = ignore' instead
  221. 88.48 s [gammaloop-crate-test-binaries-three-dimensional-reps-50150770f831b638-inputs:post-build] copying 0 paths...
  222. 88.51 s Uploaded gammaloop-crate-test-binaries-three-dimensional-reps-50150770f831b638-inputs in 420ms
  223. 88.51 s Progress: 10 of 20 built, 11 of 17 downloaded from cache (1 downloading)
  224. 88.51 s Built gammaloop-crate-test-binaries-three-dimensional-reps-50150770f831b638-inputs in 5.5s
  225. 88.63 s Building /nix/store/7zw48naflmi73dxkqz28kzrmi51nzd6p-gammaloop-crate-test-binaries-three-dimensional-reps-50150770f831b638-deps-0.1.0.drv
  226. 88.74 s [gammaloop-crate-test-binaries-three-dimensional-reps-50150770f831b638-deps] Phase: unpackPhase
  227. 88.75 s [gammaloop-crate-test-binaries-three-dimensional-reps-50150770f831b638-deps] unpacking source archive /nix/store/w23i6db12qhinqrv98z967yzr6awmzqj-source
  228. 88.76 s [gammaloop-crate-test-binaries-three-dimensional-reps-50150770f831b638-deps] source root is source
  229. 88.78 s [gammaloop-crate-test-binaries-three-dimensional-reps-50150770f831b638-deps] Phase: patchPhase
  230. 88.92 s [gammaloop-crate-test-binaries-three-dimensional-reps-50150770f831b638-deps] Executing configureCargoCommonVars
  231. 88.93 s [gammaloop-crate-test-binaries-three-dimensional-reps-50150770f831b638-deps] copying cargo artifacts from /nix/store/1hkp51xn27aapbsqcb4apz40glk6yvlw-gammaloop-crate-test-binaries-three-dimensional-reps-50150770f831b638-inputs/target to target
  232. 88.93 s [gammaloop-crate-test-binaries-three-dimensional-reps-50150770f831b638-deps] will deep copy artifacts (instead of symlinking) as requested
  233. 90.25 s [gammaloop-crate-test-binaries-three-dimensional-reps-50150770f831b638-deps] Phase: updateAutotoolsGnuConfigScriptsPhase
  234. 92.08 s [gammaloop-crate-test-binaries-three-dimensional-reps-50150770f831b638-deps] Phase: configurePhase
  235. 92.09 s [gammaloop-crate-test-binaries-three-dimensional-reps-50150770f831b638-deps] will append /build/source/.cargo-home/config.toml with contents of /nix/store/1sigmg52bb61pfngmk9k8wq5fz9r7bf1-vendor-cargo-deps/config.toml
  236. 92.09 s [gammaloop-crate-test-binaries-three-dimensional-reps-50150770f831b638-deps] default configurePhase, nothing to do
  237. 92.10 s [gammaloop-crate-test-binaries-three-dimensional-reps-50150770f831b638-deps] Phase: buildPhase
  238. 92.14 s [gammaloop-crate-test-binaries-three-dimensional-reps-50150770f831b638-deps] +++ command cargo --version
  239. 92.15 s [gammaloop-crate-test-binaries-three-dimensional-reps-50150770f831b638-deps] cargo 1.97.0 (c980f4866 2026-06-30)
  240. 92.15 s [gammaloop-crate-test-binaries-three-dimensional-reps-50150770f831b638-deps] +++ command cargo test --profile ci-optim --no-run --offline -p three-dimensional-reps --features three-dimensional-reps/serde
  241. 93.53 s [gammaloop-crate-test-binaries-three-dimensional-reps-50150770f831b638-deps] Compiling three-dimensional-reps v0.1.0 (/build/source/crates/three-dimensional-reps)
  242. 93.81 s [gammaloop-crate-test-binaries-three-dimensional-reps-50150770f831b638-deps] error[E0433]: cannot find `eval` in `crate`
  243. 93.81 s [gammaloop-crate-test-binaries-three-dimensional-reps-50150770f831b638-deps] --> crates/three-dimensional-reps/src/generation.rs:7255:28
  244. 93.81 s [gammaloop-crate-test-binaries-three-dimensional-reps-50150770f831b638-deps] |
  245. 93.81 s [gammaloop-crate-test-binaries-three-dimensional-reps-50150770f831b638-deps] 7255 | let input = crate::eval::EvaluationInput {
  246. 93.81 s [gammaloop-crate-test-binaries-three-dimensional-reps-50150770f831b638-deps] | ^^^^ could not find `eval` in the crate root
  247. 93.81 s [gammaloop-crate-test-binaries-three-dimensional-reps-50150770f831b638-deps] |
  248. 93.81 s [gammaloop-crate-test-binaries-three-dimensional-reps-50150770f831b638-deps] note: found an item that was configured out
  249. 93.81 s [gammaloop-crate-test-binaries-three-dimensional-reps-50150770f831b638-deps] --> crates/three-dimensional-reps/src/lib.rs:7:9
  250. 93.81 s [gammaloop-crate-test-binaries-three-dimensional-reps-50150770f831b638-deps] |
  251. 93.81 s [gammaloop-crate-test-binaries-three-dimensional-reps-50150770f831b638-deps] 6 | #[cfg(feature = "eval")]
  252. 93.81 s [gammaloop-crate-test-binaries-three-dimensional-reps-50150770f831b638-deps] | ---------------- the item is gated behind the `eval` feature
  253. 93.81 s [gammaloop-crate-test-binaries-three-dimensional-reps-50150770f831b638-deps] 7 | pub mod eval;
  254. 93.81 s [gammaloop-crate-test-binaries-three-dimensional-reps-50150770f831b638-deps] | ^^^^
  255. 93.81 s [gammaloop-crate-test-binaries-three-dimensional-reps-50150770f831b638-deps]
  256. 93.82 s [gammaloop-crate-test-binaries-three-dimensional-reps-50150770f831b638-deps] error[E0433]: cannot find `eval` in `crate`
  257. 93.82 s [gammaloop-crate-test-binaries-three-dimensional-reps-50150770f831b638-deps] --> crates/three-dimensional-reps/src/generation.rs:7262:30
  258. 93.82 s [gammaloop-crate-test-binaries-three-dimensional-reps-50150770f831b638-deps] |
  259. 93.82 s [gammaloop-crate-test-binaries-three-dimensional-reps-50150770f831b638-deps] 7262 | let contact = crate::eval::evaluate_expression(
  260. 93.82 s [gammaloop-crate-test-binaries-three-dimensional-reps-50150770f831b638-deps] | ^^^^ could not find `eval` in the crate root
  261. 93.82 s [gammaloop-crate-test-binaries-three-dimensional-reps-50150770f831b638-deps] |
  262. 93.82 s [gammaloop-crate-test-binaries-three-dimensional-reps-50150770f831b638-deps] note: found an item that was configured out
  263. 93.82 s [gammaloop-crate-test-binaries-three-dimensional-reps-50150770f831b638-deps] --> crates/three-dimensional-reps/src/lib.rs:7:9
  264. 93.82 s [gammaloop-crate-test-binaries-three-dimensional-reps-50150770f831b638-deps] |
  265. 93.82 s [gammaloop-crate-test-binaries-three-dimensional-reps-50150770f831b638-deps] 6 | #[cfg(feature = "eval")]
  266. 93.82 s [gammaloop-crate-test-binaries-three-dimensional-reps-50150770f831b638-deps] | ---------------- the item is gated behind the `eval` feature
  267. 93.82 s [gammaloop-crate-test-binaries-three-dimensional-reps-50150770f831b638-deps] 7 | pub mod eval;
  268. 93.82 s [gammaloop-crate-test-binaries-three-dimensional-reps-50150770f831b638-deps] | ^^^^
  269. 93.82 s [gammaloop-crate-test-binaries-three-dimensional-reps-50150770f831b638-deps]
  270. 93.83 s [gammaloop-crate-test-binaries-three-dimensional-reps-50150770f831b638-deps] error[E0433]: cannot find `eval` in `crate`
  271. 93.83 s [gammaloop-crate-test-binaries-three-dimensional-reps-50150770f831b638-deps] --> crates/three-dimensional-reps/src/generation.rs:7270:32
  272. 93.83 s [gammaloop-crate-test-binaries-three-dimensional-reps-50150770f831b638-deps] |
  273. 93.83 s [gammaloop-crate-test-binaries-three-dimensional-reps-50150770f831b638-deps] 7270 | let remainder = crate::eval::evaluate_expression(
  274. 93.83 s [gammaloop-crate-test-binaries-three-dimensional-reps-50150770f831b638-deps] | ^^^^ could not find `eval` in the crate root
  275. 93.83 s [gammaloop-crate-test-binaries-three-dimensional-reps-50150770f831b638-deps] |
  276. 93.83 s [gammaloop-crate-test-binaries-three-dimensional-reps-50150770f831b638-deps] note: found an item that was configured out
  277. 93.83 s [gammaloop-crate-test-binaries-three-dimensional-reps-50150770f831b638-deps] --> crates/three-dimensional-reps/src/lib.rs:7:9
  278. 93.83 s [gammaloop-crate-test-binaries-three-dimensional-reps-50150770f831b638-deps] |
  279. 93.83 s [gammaloop-crate-test-binaries-three-dimensional-reps-50150770f831b638-deps] 6 | #[cfg(feature = "eval")]
  280. 93.83 s [gammaloop-crate-test-binaries-three-dimensional-reps-50150770f831b638-deps] | ---------------- the item is gated behind the `eval` feature
  281. 93.83 s [gammaloop-crate-test-binaries-three-dimensional-reps-50150770f831b638-deps] 7 | pub mod eval;
  282. 93.83 s [gammaloop-crate-test-binaries-three-dimensional-reps-50150770f831b638-deps] | ^^^^
  283. 93.83 s [gammaloop-crate-test-binaries-three-dimensional-reps-50150770f831b638-deps]
  284. 93.84 s [gammaloop-crate-test-binaries-three-dimensional-reps-50150770f831b638-deps] error[E0433]: cannot find `eval` in `crate`
  285. 93.84 s [gammaloop-crate-test-binaries-three-dimensional-reps-50150770f831b638-deps] --> crates/three-dimensional-reps/src/generation.rs:7278:28
  286. 93.84 s [gammaloop-crate-test-binaries-three-dimensional-reps-50150770f831b638-deps] |
  287. 93.84 s [gammaloop-crate-test-binaries-three-dimensional-reps-50150770f831b638-deps] 7278 | let total = crate::eval::evaluate_expression(&powered, &expression, numerator, &input)
  288. 93.84 s [gammaloop-crate-test-binaries-three-dimensional-reps-50150770f831b638-deps] | ^^^^ could not find `eval` in the crate root
  289. 93.84 s [gammaloop-crate-test-binaries-three-dimensional-reps-50150770f831b638-deps] |
  290. 93.84 s [gammaloop-crate-test-binaries-three-dimensional-reps-50150770f831b638-deps] note: found an item that was configured out
  291. 93.84 s [gammaloop-crate-test-binaries-three-dimensional-reps-50150770f831b638-deps] --> crates/three-dimensional-reps/src/lib.rs:7:9
  292. 93.84 s [gammaloop-crate-test-binaries-three-dimensional-reps-50150770f831b638-deps] |
  293. 93.84 s [gammaloop-crate-test-binaries-three-dimensional-reps-50150770f831b638-deps] 6 | #[cfg(feature = "eval")]
  294. 93.84 s [gammaloop-crate-test-binaries-three-dimensional-reps-50150770f831b638-deps] | ---------------- the item is gated behind the `eval` feature
  295. 93.84 s [gammaloop-crate-test-binaries-three-dimensional-reps-50150770f831b638-deps] 7 | pub mod eval;
  296. 93.84 s [gammaloop-crate-test-binaries-three-dimensional-reps-50150770f831b638-deps] | ^^^^
  297. 93.84 s [gammaloop-crate-test-binaries-three-dimensional-reps-50150770f831b638-deps]
  298. 96.06 s [gammaloop-crate-test-binaries-three-dimensional-reps-50150770f831b638-deps] For more information about this error, try `rustc --explain E0433`.
  299. 96.08 s [gammaloop-crate-test-binaries-three-dimensional-reps-50150770f831b638-deps] error: could not compile `three-dimensional-reps` (lib test) due to 4 previous errors
  300. 96.43 s Progress: 10 of 19 built (1 failed), 11 of 17 downloaded from cache (1 downloading)
  301. 96.43 s Failed to build gammaloop-crate-test-binaries-three-dimensional-reps-50150770f831b638-deps after 7.7s
  302. 96.43 s error: Cannot build '/nix/store/7zw48naflmi73dxkqz28kzrmi51nzd6p-gammaloop-crate-test-binaries-three-dimensional-reps-50150770f831b638-deps-0.1.0.drv'.
  303. 96.43 s Reason: builder failed with exit code 101.
  304. 96.43 s Output paths:
  305. 96.43 s /nix/store/rbv8894f6hcln558p7qjz75i2d2w7jsa-gammaloop-crate-test-binaries-three-dimensional-reps-50150770f831b638-deps-0.1.0
  306. 96.43 s Last 74 log lines:
  307. 96.43 s > Running phase: unpackPhase
  308. 96.43 s > unpacking source archive /nix/store/w23i6db12qhinqrv98z967yzr6awmzqj-source
  309. 96.43 s > source root is source
  310. 96.43 s > Running phase: patchPhase
  311. 96.43 s > Executing configureCargoCommonVars
  312. 96.43 s > copying cargo artifacts from /nix/store/1hkp51xn27aapbsqcb4apz40glk6yvlw-gammaloop-crate-test-binaries-three-dimensional-reps-50150770f831b638-inputs/target to target
  313. 96.43 s > will deep copy artifacts (instead of symlinking) as requested
  314. 96.43 s > Running phase: updateAutotoolsGnuConfigScriptsPhase
  315. 96.43 s > Running phase: configurePhase
  316. 96.43 s > will append /build/source/.cargo-home/config.toml with contents of /nix/store/1sigmg52bb61pfngmk9k8wq5fz9r7bf1-vendor-cargo-deps/config.toml
  317. 96.43 s > default configurePhase, nothing to do
  318. 96.43 s > Running phase: buildPhase
  319. 96.43 s > +++ command cargo --version
  320. 96.43 s > cargo 1.97.0 (c980f4866 2026-06-30)
  321. 96.43 s > +++ command cargo test --profile ci-optim --no-run --offline -p three-dimensional-reps --features three-dimensional-reps/serde
  322. 96.43 s > Compiling three-dimensional-reps v0.1.0 (/build/source/crates/three-dimensional-reps)
  323. 96.43 s > error[E0433]: cannot find `eval` in `crate`
  324. 96.43 s > --> crates/three-dimensional-reps/src/generation.rs:7255:28
  325. 96.43 s > |
  326. 96.43 s > 7255 | let input = crate::eval::EvaluationInput {
  327. 96.43 s > | ^^^^ could not find `eval` in the crate root
  328. 96.43 s > |
  329. 96.43 s > note: found an item that was configured out
  330. 96.43 s > --> crates/three-dimensional-reps/src/lib.rs:7:9
  331. 96.43 s > |
  332. 96.43 s > 6 | #[cfg(feature = "eval")]
  333. 96.43 s > | ---------------- the item is gated behind the `eval` feature
  334. 96.43 s > 7 | pub mod eval;
  335. 96.43 s > | ^^^^
  336. 96.43 s >
  337. 96.43 s > error[E0433]: cannot find `eval` in `crate`
  338. 96.43 s > --> crates/three-dimensional-reps/src/generation.rs:7262:30
  339. 96.43 s > |
  340. 96.43 s > 7262 | let contact = crate::eval::evaluate_expression(
  341. 96.43 s > | ^^^^ could not find `eval` in the crate root
  342. 96.43 s > |
  343. 96.43 s > note: found an item that was configured out
  344. 96.43 s > --> crates/three-dimensional-reps/src/lib.rs:7:9
  345. 96.43 s > |
  346. 96.43 s > 6 | #[cfg(feature = "eval")]
  347. 96.43 s > | ---------------- the item is gated behind the `eval` feature
  348. 96.43 s > 7 | pub mod eval;
  349. 96.43 s > | ^^^^
  350. 96.43 s >
  351. 96.43 s > error[E0433]: cannot find `eval` in `crate`
  352. 96.43 s > --> crates/three-dimensional-reps/src/generation.rs:7270:32
  353. 96.43 s > |
  354. 96.43 s > 7270 | let remainder = crate::eval::evaluate_expression(
  355. 96.43 s > | ^^^^ could not find `eval` in the crate root
  356. 96.43 s > |
  357. 96.43 s > note: found an item that was configured out
  358. 96.43 s > --> crates/three-dimensional-reps/src/lib.rs:7:9
  359. 96.43 s > |
  360. 96.43 s > 6 | #[cfg(feature = "eval")]
  361. 96.43 s > | ---------------- the item is gated behind the `eval` feature
  362. 96.43 s > 7 | pub mod eval;
  363. 96.43 s > | ^^^^
  364. 96.43 s >
  365. 96.43 s > error[E0433]: cannot find `eval` in `crate`
  366. 96.43 s > --> crates/three-dimensional-reps/src/generation.rs:7278:28
  367. 96.43 s > |
  368. 96.43 s > 7278 | let total = crate::eval::evaluate_expression(&powered, &expression, numerator, &input)
  369. 96.43 s > | ^^^^ could not find `eval` in the crate root
  370. 96.43 s > |
  371. 96.43 s > note: found an item that was configured out
  372. 96.43 s > --> crates/three-dimensional-reps/src/lib.rs:7:9
  373. 96.43 s > |
  374. 96.43 s > 6 | #[cfg(feature = "eval")]
  375. 96.43 s > | ---------------- the item is gated behind the `eval` feature
  376. 96.43 s > 7 | pub mod eval;
  377. 96.43 s > | ^^^^
  378. 96.43 s >
  379. 96.43 s > For more information about this error, try `rustc --explain E0433`.
  380. 96.43 s > error: could not compile `three-dimensional-reps` (lib test) due to 4 previous errors
  381. 96.43 s For full logs, run:
  382. 96.43 s nix log /nix/store/7zw48naflmi73dxkqz28kzrmi51nzd6p-gammaloop-crate-test-binaries-three-dimensional-reps-50150770f831b638-deps-0.1.0.drv
  383. 96.43 s error: Cannot build '/nix/store/mj3pf6c3fjp5zadvvgw8xqd5c328983v-gammaloop-nextest-binaries-core-three-dimensional-reps-0.1.0.drv'.
  384. 96.43 s Reason: 1 dependency failed.
  385. 96.43 s Output paths:
  386. 96.43 s /nix/store/08ckdvc5a851x7bjzyl911f0r34j39y6-gammaloop-nextest-binaries-core-three-dimensional-reps-0.1.0
  387. 96.43 s error: Build failed due to failed dependency
  388. 96.43 s error: Cannot build '/nix/store/lh3brzm0pijkby2zxlwzwy3cpw6dli9y-gammaloop-nextest-binaries-core.drv'.
  389. 96.43 s Reason: 1 dependency failed.
  390. 96.43 s Output paths:
  391. 96.43 s /nix/store/9qyldachbc63nff7ijv5qyhdy1g09nai-gammaloop-nextest-binaries-core
  392. 99.18 s Downloaded cached gammaloop-crate-test-dependencies-247ff5d63201fb2c-inputs (1.8 GiB) in 16.1s
  393. 99.19 s Build failed due to failed dependency
  394. 99.26 s Build failed.