1. 0.00 s $ /nix/store/9ypz3flqsrl5xl495mm8h645gadjsxi1-coreutils-9.11/bin/timeout --kill-after=15s 7200s /nix/store/23zk8sgzamrbmj1fday15szf7f2279s8-nix-2.34.7/bin/nix --extra-experimental-features nix-command --extra-experimental-features flakes --log-format internal-json build --no-link --print-out-paths git+https://github.com/alphal00p/gammaloop?ref=codex%2Fnix-metadata-20260906&rev=b6b126198170b848f9fdb11014d4af7e02fbf9b5&shallow=1#checks.x86_64-linux.gammaloop-nextest-binaries-core --print-build-logs
  2. 0.23 s error (ignored): SQLite database '/var/cache/nix-ci-worker/eval-cache-v6/41b07a2447b635a17b55eb27dcc0bc05ad3296641599d2837b9bd299212231a8.sqlite' is busy
  3. 5.19 s
  4. 5.69 s Downloading cached gammaloop-crate-test-binaries-gammaloop-tracing-filter-31e37aec92971227-inputs from https://cache.nix-ci.com
  5. 5.69 s Downloading cached gammaloop-crate-test-binaries-gammalooprs-247ff5d63201fb2c-inputs from https://cache.nix-ci.com
  6. 5.69 s Downloading cached gammaloop-crate-test-binaries-gammaloop-tracing-filter-macros-1b17e1ec025c6580-inputs from https://cache.nix-ci.com
  7. 5.85 s Building /nix/store/ka75f7a7iyjn6wn74yll6xg8z17h0kl5-gammaloop-nextest-binaries-core-gammaloop-api-0.1.0.drv
  8. 5.91 s Building /nix/store/hb7vrvwgsdv3zmb4nk4r2bwgj32kasrf-gammaloop-ci-test-binary-dependencies-1b17e1ec025c6580-gammaloop-tracing-filter-macros-dev-dependency.toml.drv
  9. 5.95 s Building /nix/store/d803fdhy5vdmwg1bxnrdbbh443q5b2l1-gammaloop-ci-test-binary-dependencies-247ff5d63201fb2c-gammalooprs-dev-dependency.toml.drv
  10. 5.99 s Building /nix/store/8n7av5d2xzacvwsymvrcwygl7s0wgynb-gammaloop-ci-test-binary-dependencies-31e37aec92971227-gammaloop-tracing-filter-dev-dependency.toml.drv
  11. 6.11 s Building /nix/store/7zw48naflmi73dxkqz28kzrmi51nzd6p-gammaloop-crate-test-binaries-three-dimensional-reps-50150770f831b638-deps-0.1.0.drv
  12. 6.15 s [gammaloop-ci-test-binary-dependencies-1b17e1ec025c6580-gammaloop-tracing-filter-macros-dev-dependency.toml:post-build] Uploading to the NixCI cache: /nix/store/gczxq1jnxb2f6nwcbl5zwmigdpgim7v7-gammaloop-ci-test-binary-dependencies-1b17e1ec025c6580-gammaloop-tracing-filter-macros-dev-dependency.toml
  13. 6.35 s [gammaloop-ci-test-binary-dependencies-1b17e1ec025c6580-gammaloop-tracing-filter-macros-dev-dependency.toml:post-build] warning: 'warn-short-path-literals' is deprecated, use 'lint-short-path-literals = ignore' instead
  14. 6.40 s [gammaloop-ci-test-binary-dependencies-1b17e1ec025c6580-gammaloop-tracing-filter-macros-dev-dependency.toml:post-build] copying 0 paths...
  15. 6.53 s [gammaloop-ci-test-binary-dependencies-1b17e1ec025c6580-gammaloop-tracing-filter-macros-dev-dependency.toml:post-build] warning: 'warn-short-path-literals' is deprecated, use 'lint-short-path-literals = ignore' instead
  16. 6.64 s [gammaloop-ci-test-binary-dependencies-1b17e1ec025c6580-gammaloop-tracing-filter-macros-dev-dependency.toml:post-build] copying 0 paths...
  17. 6.70 s Uploaded gammaloop-ci-test-binary-dependencies-1b17e1ec025c6580-gammaloop-tracing-filter-macros-dev-dependency.toml in 575ms
  18. 6.70 s Progress: 1 of 14 built (4 building), 0 of 6 downloaded from cache (3 downloading)
  19. 6.70 s Built gammaloop-ci-test-binary-dependencies-1b17e1ec025c6580-gammaloop-tracing-filter-macros-dev-dependency.toml in 790ms
  20. 6.74 s [gammaloop-ci-test-binary-dependencies-247ff5d63201fb2c-gammalooprs-dev-dependency.toml:post-build] Uploading to the NixCI cache: /nix/store/fzwgaj7lkfphcc1g09xfmk55hmkxkr0x-gammaloop-ci-test-binary-dependencies-247ff5d63201fb2c-gammalooprs-dev-dependency.toml
  21. 6.84 s [gammaloop-ci-test-binary-dependencies-247ff5d63201fb2c-gammalooprs-dev-dependency.toml:post-build] warning: 'warn-short-path-literals' is deprecated, use 'lint-short-path-literals = ignore' instead
  22. 6.90 s [gammaloop-ci-test-binary-dependencies-247ff5d63201fb2c-gammalooprs-dev-dependency.toml:post-build] copying 0 paths...
  23. 7.04 s [gammaloop-ci-test-binary-dependencies-247ff5d63201fb2c-gammalooprs-dev-dependency.toml:post-build] warning: 'warn-short-path-literals' is deprecated, use 'lint-short-path-literals = ignore' instead
  24. 7.17 s [gammaloop-ci-test-binary-dependencies-247ff5d63201fb2c-gammalooprs-dev-dependency.toml:post-build] copying 0 paths...
  25. 7.19 s Uploaded gammaloop-ci-test-binary-dependencies-247ff5d63201fb2c-gammalooprs-dev-dependency.toml in 480ms
  26. 7.19 s Progress: 2 of 15 built (3 building), 0 of 6 downloaded from cache (3 downloading)
  27. 7.19 s Built gammaloop-ci-test-binary-dependencies-247ff5d63201fb2c-gammalooprs-dev-dependency.toml in 1.2s
  28. 7.22 s [gammaloop-ci-test-binary-dependencies-31e37aec92971227-gammaloop-tracing-filter-dev-dependency.toml:post-build] Uploading to the NixCI cache: /nix/store/a90w47vskdc47wbbm7xrpzbp3hjc6n01-gammaloop-ci-test-binary-dependencies-31e37aec92971227-gammaloop-tracing-filter-dev-dependency.toml
  29. 7.33 s [gammaloop-ci-test-binary-dependencies-31e37aec92971227-gammaloop-tracing-filter-dev-dependency.toml:post-build] warning: 'warn-short-path-literals' is deprecated, use 'lint-short-path-literals = ignore' instead
  30. 7.43 s [gammaloop-ci-test-binary-dependencies-31e37aec92971227-gammaloop-tracing-filter-dev-dependency.toml:post-build] copying 0 paths...
  31. 7.55 s [gammaloop-ci-test-binary-dependencies-31e37aec92971227-gammaloop-tracing-filter-dev-dependency.toml:post-build] warning: 'warn-short-path-literals' is deprecated, use 'lint-short-path-literals = ignore' instead
  32. 7.63 s [gammaloop-ci-test-binary-dependencies-31e37aec92971227-gammaloop-tracing-filter-dev-dependency.toml:post-build] copying 0 paths...
  33. 7.66 s Uploaded gammaloop-ci-test-binary-dependencies-31e37aec92971227-gammaloop-tracing-filter-dev-dependency.toml in 466ms
  34. 7.66 s Progress: 3 of 16 built (2 building), 0 of 6 downloaded from cache (3 downloading)
  35. 7.66 s Built gammaloop-ci-test-binary-dependencies-31e37aec92971227-gammaloop-tracing-filter-dev-dependency.toml in 1.6s
  36. 7.66 s [gammaloop-nextest-binaries-core-gammaloop-api] Phase: unpackPhase
  37. 7.66 s [gammaloop-nextest-binaries-core-gammaloop-api] unpacking source archive /nix/store/355hd4cv34a8xybddr5sfn05c64f97id-source
  38. 7.66 s [gammaloop-nextest-binaries-core-gammaloop-api] source root is source
  39. 7.66 s [gammaloop-nextest-binaries-core-gammaloop-api] Phase: patchPhase
  40. 7.66 s [gammaloop-crate-test-binaries-three-dimensional-reps-50150770f831b638-deps] Phase: unpackPhase
  41. 7.66 s [gammaloop-crate-test-binaries-three-dimensional-reps-50150770f831b638-deps] unpacking source archive /nix/store/w23i6db12qhinqrv98z967yzr6awmzqj-source
  42. 7.66 s [gammaloop-crate-test-binaries-three-dimensional-reps-50150770f831b638-deps] source root is source
  43. 7.66 s [gammaloop-crate-test-binaries-three-dimensional-reps-50150770f831b638-deps] Phase: patchPhase
  44. 7.66 s [gammaloop-crate-test-binaries-three-dimensional-reps-50150770f831b638-deps] Executing configureCargoCommonVars
  45. 7.66 s [gammaloop-crate-test-binaries-three-dimensional-reps-50150770f831b638-deps] copying cargo artifacts from /nix/store/1hkp51xn27aapbsqcb4apz40glk6yvlw-gammaloop-crate-test-binaries-three-dimensional-reps-50150770f831b638-inputs/target to target
  46. 7.66 s [gammaloop-crate-test-binaries-three-dimensional-reps-50150770f831b638-deps] will deep copy artifacts (instead of symlinking) as requested
  47. 7.66 s [gammaloop-nextest-binaries-core-gammaloop-api] copying cargo artifacts from /nix/store/1jzyqjvqk2wf34yfa55n305iw469l3xs-gammaloop-crate-test-binaries-gammaloop-api-f0f952c3f8c3050c-inputs/target to target
  48. 10.20 s [gammaloop-nextest-binaries-core-gammaloop-api] Executing configureCargoCommonVars
  49. 10.21 s [gammaloop-nextest-binaries-core-gammaloop-api] decompressing cargo artifacts from /nix/store/a6ak28qka7khs9g0svmjbfwigxqv7ai0-gammaloop-crate-test-binaries-gammaloop-api-f0f952c3f8c3050c-deps-0.1.0/target.tar.zst to target
  50. 10.76 s [gammaloop-nextest-binaries-core-gammaloop-api] Phase: updateAutotoolsGnuConfigScriptsPhase
  51. 11.73 s [gammaloop-nextest-binaries-core-gammaloop-api] Phase: configurePhase
  52. 11.74 s [gammaloop-nextest-binaries-core-gammaloop-api] will append /build/source/.cargo-home/config.toml with contents of /nix/store/1sigmg52bb61pfngmk9k8wq5fz9r7bf1-vendor-cargo-deps/config.toml
  53. 11.75 s [gammaloop-nextest-binaries-core-gammaloop-api] default configurePhase, nothing to do
  54. 11.75 s [gammaloop-nextest-binaries-core-gammaloop-api] Phase: buildPhase
  55. 11.76 s [gammaloop-nextest-binaries-core-gammaloop-api] +++ command cargo --version
  56. 11.77 s [gammaloop-nextest-binaries-core-gammaloop-api] cargo 1.97.0 (c980f4866 2026-06-30)
  57. 11.84 s [gammaloop-nextest-binaries-core-gammaloop-api] +++ command cargo nextest --version
  58. 11.85 s [gammaloop-nextest-binaries-core-gammaloop-api] cargo-nextest 0.9.140
  59. 11.85 s [gammaloop-nextest-binaries-core-gammaloop-api] release: 0.9.140
  60. 11.85 s [gammaloop-nextest-binaries-core-gammaloop-api] host: x86_64-unknown-linux-gnu
  61. 11.85 s [gammaloop-nextest-binaries-core-gammaloop-api] +++ command cargo nextest archive --cargo-profile ci-optim --offline -p gammaloop-api -E 'package(gammaloop-api)' --profile ci_gammaloop --archive-file /nix/store/3885lzwck5i592mrshd1azdzl50xvkxv-gammaloop-nextest-binaries-core-gammaloop-api-0.1.0/gammaloop-nextest-core-gammaloop-api.tar.zst
  62. 12.08 s [gammaloop-crate-test-binaries-three-dimensional-reps-50150770f831b638-deps] Phase: updateAutotoolsGnuConfigScriptsPhase
  63. 12.12 s [gammaloop-crate-test-binaries-three-dimensional-reps-50150770f831b638-deps] Phase: configurePhase
  64. 12.13 s [gammaloop-crate-test-binaries-three-dimensional-reps-50150770f831b638-deps] will append /build/source/.cargo-home/config.toml with contents of /nix/store/1sigmg52bb61pfngmk9k8wq5fz9r7bf1-vendor-cargo-deps/config.toml
  65. 12.13 s [gammaloop-crate-test-binaries-three-dimensional-reps-50150770f831b638-deps] default configurePhase, nothing to do
  66. 12.14 s [gammaloop-crate-test-binaries-three-dimensional-reps-50150770f831b638-deps] Phase: buildPhase
  67. 12.14 s [gammaloop-crate-test-binaries-three-dimensional-reps-50150770f831b638-deps] +++ command cargo --version
  68. 12.15 s [gammaloop-crate-test-binaries-three-dimensional-reps-50150770f831b638-deps] cargo 1.97.0 (c980f4866 2026-06-30)
  69. 12.15 s [gammaloop-crate-test-binaries-three-dimensional-reps-50150770f831b638-deps] +++ command cargo test --profile ci-optim --no-run --offline -p three-dimensional-reps --features three-dimensional-reps/serde
  70. 13.99 s [gammaloop-crate-test-binaries-three-dimensional-reps-50150770f831b638-deps] Compiling three-dimensional-reps v0.1.0 (/build/source/crates/three-dimensional-reps)
  71. 14.36 s [gammaloop-crate-test-binaries-three-dimensional-reps-50150770f831b638-deps] error[E0433]: cannot find `eval` in `crate`
  72. 14.36 s [gammaloop-crate-test-binaries-three-dimensional-reps-50150770f831b638-deps] --> crates/three-dimensional-reps/src/generation.rs:7255:28
  73. 14.36 s [gammaloop-crate-test-binaries-three-dimensional-reps-50150770f831b638-deps] |
  74. 14.36 s [gammaloop-crate-test-binaries-three-dimensional-reps-50150770f831b638-deps] 7255 | let input = crate::eval::EvaluationInput {
  75. 14.36 s [gammaloop-crate-test-binaries-three-dimensional-reps-50150770f831b638-deps] | ^^^^ could not find `eval` in the crate root
  76. 14.36 s [gammaloop-crate-test-binaries-three-dimensional-reps-50150770f831b638-deps] |
  77. 14.36 s [gammaloop-crate-test-binaries-three-dimensional-reps-50150770f831b638-deps] note: found an item that was configured out
  78. 14.36 s [gammaloop-crate-test-binaries-three-dimensional-reps-50150770f831b638-deps] --> crates/three-dimensional-reps/src/lib.rs:7:9
  79. 14.36 s [gammaloop-crate-test-binaries-three-dimensional-reps-50150770f831b638-deps] |
  80. 14.36 s [gammaloop-crate-test-binaries-three-dimensional-reps-50150770f831b638-deps] 6 | #[cfg(feature = "eval")]
  81. 14.36 s [gammaloop-crate-test-binaries-three-dimensional-reps-50150770f831b638-deps] | ---------------- the item is gated behind the `eval` feature
  82. 14.36 s [gammaloop-crate-test-binaries-three-dimensional-reps-50150770f831b638-deps] 7 | pub mod eval;
  83. 14.36 s [gammaloop-crate-test-binaries-three-dimensional-reps-50150770f831b638-deps] | ^^^^
  84. 14.36 s [gammaloop-crate-test-binaries-three-dimensional-reps-50150770f831b638-deps]
  85. 14.37 s [gammaloop-crate-test-binaries-three-dimensional-reps-50150770f831b638-deps] error[E0433]: cannot find `eval` in `crate`
  86. 14.37 s [gammaloop-crate-test-binaries-three-dimensional-reps-50150770f831b638-deps] --> crates/three-dimensional-reps/src/generation.rs:7262:30
  87. 14.37 s [gammaloop-crate-test-binaries-three-dimensional-reps-50150770f831b638-deps] |
  88. 14.37 s [gammaloop-crate-test-binaries-three-dimensional-reps-50150770f831b638-deps] 7262 | let contact = crate::eval::evaluate_expression(
  89. 14.37 s [gammaloop-crate-test-binaries-three-dimensional-reps-50150770f831b638-deps] | ^^^^ could not find `eval` in the crate root
  90. 14.37 s [gammaloop-crate-test-binaries-three-dimensional-reps-50150770f831b638-deps] |
  91. 14.37 s [gammaloop-crate-test-binaries-three-dimensional-reps-50150770f831b638-deps] note: found an item that was configured out
  92. 14.37 s [gammaloop-crate-test-binaries-three-dimensional-reps-50150770f831b638-deps] --> crates/three-dimensional-reps/src/lib.rs:7:9
  93. 14.37 s [gammaloop-crate-test-binaries-three-dimensional-reps-50150770f831b638-deps] |
  94. 14.37 s [gammaloop-crate-test-binaries-three-dimensional-reps-50150770f831b638-deps] 6 | #[cfg(feature = "eval")]
  95. 14.37 s [gammaloop-crate-test-binaries-three-dimensional-reps-50150770f831b638-deps] | ---------------- the item is gated behind the `eval` feature
  96. 14.37 s [gammaloop-crate-test-binaries-three-dimensional-reps-50150770f831b638-deps] 7 | pub mod eval;
  97. 14.37 s [gammaloop-crate-test-binaries-three-dimensional-reps-50150770f831b638-deps] | ^^^^
  98. 14.37 s [gammaloop-crate-test-binaries-three-dimensional-reps-50150770f831b638-deps]
  99. 14.38 s [gammaloop-crate-test-binaries-three-dimensional-reps-50150770f831b638-deps] error[E0433]: cannot find `eval` in `crate`
  100. 14.38 s [gammaloop-crate-test-binaries-three-dimensional-reps-50150770f831b638-deps] --> crates/three-dimensional-reps/src/generation.rs:7270:32
  101. 14.38 s [gammaloop-crate-test-binaries-three-dimensional-reps-50150770f831b638-deps] |
  102. 14.38 s [gammaloop-crate-test-binaries-three-dimensional-reps-50150770f831b638-deps] 7270 | let remainder = crate::eval::evaluate_expression(
  103. 14.38 s [gammaloop-crate-test-binaries-three-dimensional-reps-50150770f831b638-deps] | ^^^^ could not find `eval` in the crate root
  104. 14.38 s [gammaloop-crate-test-binaries-three-dimensional-reps-50150770f831b638-deps] |
  105. 14.38 s [gammaloop-crate-test-binaries-three-dimensional-reps-50150770f831b638-deps] note: found an item that was configured out
  106. 14.38 s [gammaloop-crate-test-binaries-three-dimensional-reps-50150770f831b638-deps] --> crates/three-dimensional-reps/src/lib.rs:7:9
  107. 14.38 s [gammaloop-crate-test-binaries-three-dimensional-reps-50150770f831b638-deps] |
  108. 14.38 s [gammaloop-crate-test-binaries-three-dimensional-reps-50150770f831b638-deps] 6 | #[cfg(feature = "eval")]
  109. 14.38 s [gammaloop-crate-test-binaries-three-dimensional-reps-50150770f831b638-deps] | ---------------- the item is gated behind the `eval` feature
  110. 14.38 s [gammaloop-crate-test-binaries-three-dimensional-reps-50150770f831b638-deps] 7 | pub mod eval;
  111. 14.38 s [gammaloop-crate-test-binaries-three-dimensional-reps-50150770f831b638-deps] | ^^^^
  112. 14.38 s [gammaloop-crate-test-binaries-three-dimensional-reps-50150770f831b638-deps]
  113. 14.38 s [gammaloop-crate-test-binaries-three-dimensional-reps-50150770f831b638-deps] error[E0433]: cannot find `eval` in `crate`
  114. 14.38 s [gammaloop-crate-test-binaries-three-dimensional-reps-50150770f831b638-deps] --> crates/three-dimensional-reps/src/generation.rs:7278:28
  115. 14.38 s [gammaloop-crate-test-binaries-three-dimensional-reps-50150770f831b638-deps] |
  116. 14.38 s [gammaloop-crate-test-binaries-three-dimensional-reps-50150770f831b638-deps] 7278 | let total = crate::eval::evaluate_expression(&powered, &expression, numerator, &input)
  117. 14.38 s [gammaloop-crate-test-binaries-three-dimensional-reps-50150770f831b638-deps] | ^^^^ could not find `eval` in the crate root
  118. 14.38 s [gammaloop-crate-test-binaries-three-dimensional-reps-50150770f831b638-deps] |
  119. 14.38 s [gammaloop-crate-test-binaries-three-dimensional-reps-50150770f831b638-deps] note: found an item that was configured out
  120. 14.38 s [gammaloop-crate-test-binaries-three-dimensional-reps-50150770f831b638-deps] --> crates/three-dimensional-reps/src/lib.rs:7:9
  121. 14.38 s [gammaloop-crate-test-binaries-three-dimensional-reps-50150770f831b638-deps] |
  122. 14.38 s [gammaloop-crate-test-binaries-three-dimensional-reps-50150770f831b638-deps] 6 | #[cfg(feature = "eval")]
  123. 14.38 s [gammaloop-crate-test-binaries-three-dimensional-reps-50150770f831b638-deps] | ---------------- the item is gated behind the `eval` feature
  124. 14.38 s [gammaloop-crate-test-binaries-three-dimensional-reps-50150770f831b638-deps] 7 | pub mod eval;
  125. 14.38 s [gammaloop-crate-test-binaries-three-dimensional-reps-50150770f831b638-deps] | ^^^^
  126. 14.38 s [gammaloop-crate-test-binaries-three-dimensional-reps-50150770f831b638-deps]
  127. 14.47 s [gammaloop-nextest-binaries-core-gammaloop-api] Finished `ci-optim` profile [optimized] target(s) in 0.66s
  128. 14.65 s [gammaloop-nextest-binaries-core-gammaloop-api] warning: the following packages contain code that will be rejected by a future version of Rust: proc-macro-error2 v2.0.1
  129. 14.65 s [gammaloop-nextest-binaries-core-gammaloop-api] note: to see what the problems were, use the option `--future-incompat-report`, or run `cargo report future-incompatibilities --id 1`
  130. 15.58 s Downloaded cached gammaloop-crate-test-binaries-gammaloop-tracing-filter-macros-1b17e1ec025c6580-inputs (1.1 GiB) in 9.8s
  131. 15.58 s Progress: 3 of 13 built (2 building), 1 of 6 downloaded from cache (2 downloading)
  132. 15.58 s Downloading cached gammaloop-crate-test-binaries-gammaloop-tracing-filter-macros-1b17e1ec025c6580-deps from https://cache.nix-ci.com
  133. 15.76 s [gammaloop-nextest-binaries-core-gammaloop-api] Archiving 4 binaries (including 1 non-test binary; 1 non-test binary filtered out), 1 build script output directory, 2 linked paths, and 1 standard library to /nix/store/3885lzwck5i592mrshd1azdzl50xvkxv-gammaloop-nextest-binaries-core-gammaloop-api-0.1.0/gammaloop-nextest-core-gammaloop-api.tar.zst
  134. 15.79 s Downloaded cached gammaloop-crate-test-binaries-gammaloop-tracing-filter-macros-1b17e1ec025c6580-deps (183 KiB) in 206ms
  135. 15.79 s Progress: 3 of 13 built (2 building), 2 of 6 downloaded from cache (2 downloading)
  136. 15.98 s Building /nix/store/d2ih04vym549rl0m3achp1b6siwkx67x-gammaloop-nextest-binaries-core-gammaloop-tracing-filter-macros-0.1.0.drv
  137. 16.09 s [gammaloop-nextest-binaries-core-gammaloop-tracing-filter-macros] Phase: unpackPhase
  138. 16.20 s [gammaloop-nextest-binaries-core-gammaloop-tracing-filter-macros] unpacking source archive /nix/store/s9laxhmq01dchxb20prkpgsrbcz36iqj-source
  139. 16.22 s [gammaloop-nextest-binaries-core-gammaloop-tracing-filter-macros] source root is source
  140. 16.24 s [gammaloop-nextest-binaries-core-gammaloop-tracing-filter-macros] Phase: patchPhase
  141. 16.36 s [gammaloop-nextest-binaries-core-gammaloop-tracing-filter-macros] copying cargo artifacts from /nix/store/dlh3rl0zih31g7l8hwjabhdf9wlzr0db-gammaloop-crate-test-binaries-gammaloop-tracing-filter-macros-1b17e1ec025c6580-inputs/target to target
  142. 17.03 s [gammaloop-crate-test-binaries-three-dimensional-reps-50150770f831b638-deps] For more information about this error, try `rustc --explain E0433`.
  143. 17.36 s [gammaloop-crate-test-binaries-three-dimensional-reps-50150770f831b638-deps] error: could not compile `three-dimensional-reps` (lib test) due to 4 previous errors
  144. 17.59 s Progress: 3 of 12 built (2 building, 1 failed), 2 of 6 downloaded from cache (2 downloading)
  145. 17.59 s Failed to build gammaloop-crate-test-binaries-three-dimensional-reps-50150770f831b638-deps after 11.4s
  146. 17.59 s error: Cannot build '/nix/store/7zw48naflmi73dxkqz28kzrmi51nzd6p-gammaloop-crate-test-binaries-three-dimensional-reps-50150770f831b638-deps-0.1.0.drv'.
  147. 17.59 s Reason: builder failed with exit code 101.
  148. 17.59 s Output paths:
  149. 17.59 s /nix/store/rbv8894f6hcln558p7qjz75i2d2w7jsa-gammaloop-crate-test-binaries-three-dimensional-reps-50150770f831b638-deps-0.1.0
  150. 17.59 s Last 74 log lines:
  151. 17.59 s > Running phase: unpackPhase
  152. 17.59 s > unpacking source archive /nix/store/w23i6db12qhinqrv98z967yzr6awmzqj-source
  153. 17.59 s > source root is source
  154. 17.59 s > Running phase: patchPhase
  155. 17.59 s > Executing configureCargoCommonVars
  156. 17.59 s > copying cargo artifacts from /nix/store/1hkp51xn27aapbsqcb4apz40glk6yvlw-gammaloop-crate-test-binaries-three-dimensional-reps-50150770f831b638-inputs/target to target
  157. 17.59 s > will deep copy artifacts (instead of symlinking) as requested
  158. 17.59 s > Running phase: updateAutotoolsGnuConfigScriptsPhase
  159. 17.59 s > Running phase: configurePhase
  160. 17.59 s > will append /build/source/.cargo-home/config.toml with contents of /nix/store/1sigmg52bb61pfngmk9k8wq5fz9r7bf1-vendor-cargo-deps/config.toml
  161. 17.59 s > default configurePhase, nothing to do
  162. 17.59 s > Running phase: buildPhase
  163. 17.59 s > +++ command cargo --version
  164. 17.59 s > cargo 1.97.0 (c980f4866 2026-06-30)
  165. 17.59 s > +++ command cargo test --profile ci-optim --no-run --offline -p three-dimensional-reps --features three-dimensional-reps/serde
  166. 17.59 s > Compiling three-dimensional-reps v0.1.0 (/build/source/crates/three-dimensional-reps)
  167. 17.59 s > error[E0433]: cannot find `eval` in `crate`
  168. 17.59 s > --> crates/three-dimensional-reps/src/generation.rs:7255:28
  169. 17.59 s > |
  170. 17.59 s > 7255 | let input = crate::eval::EvaluationInput {
  171. 17.59 s > | ^^^^ could not find `eval` in the crate root
  172. 17.59 s > |
  173. 17.59 s > note: found an item that was configured out
  174. 17.59 s > --> crates/three-dimensional-reps/src/lib.rs:7:9
  175. 17.59 s > |
  176. 17.59 s > 6 | #[cfg(feature = "eval")]
  177. 17.59 s > | ---------------- the item is gated behind the `eval` feature
  178. 17.59 s > 7 | pub mod eval;
  179. 17.59 s > | ^^^^
  180. 17.59 s >
  181. 17.59 s > error[E0433]: cannot find `eval` in `crate`
  182. 17.59 s > --> crates/three-dimensional-reps/src/generation.rs:7262:30
  183. 17.59 s > |
  184. 17.59 s > 7262 | let contact = crate::eval::evaluate_expression(
  185. 17.59 s > | ^^^^ could not find `eval` in the crate root
  186. 17.59 s > |
  187. 17.59 s > note: found an item that was configured out
  188. 17.59 s > --> crates/three-dimensional-reps/src/lib.rs:7:9
  189. 17.59 s > |
  190. 17.59 s > 6 | #[cfg(feature = "eval")]
  191. 17.59 s > | ---------------- the item is gated behind the `eval` feature
  192. 17.59 s > 7 | pub mod eval;
  193. 17.59 s > | ^^^^
  194. 17.59 s >
  195. 17.59 s > error[E0433]: cannot find `eval` in `crate`
  196. 17.59 s > --> crates/three-dimensional-reps/src/generation.rs:7270:32
  197. 17.59 s > |
  198. 17.59 s > 7270 | let remainder = crate::eval::evaluate_expression(
  199. 17.59 s > | ^^^^ could not find `eval` in the crate root
  200. 17.59 s > |
  201. 17.59 s > note: found an item that was configured out
  202. 17.59 s > --> crates/three-dimensional-reps/src/lib.rs:7:9
  203. 17.59 s > |
  204. 17.59 s > 6 | #[cfg(feature = "eval")]
  205. 17.59 s > | ---------------- the item is gated behind the `eval` feature
  206. 17.59 s > 7 | pub mod eval;
  207. 17.59 s > | ^^^^
  208. 17.59 s >
  209. 17.59 s > error[E0433]: cannot find `eval` in `crate`
  210. 17.59 s > --> crates/three-dimensional-reps/src/generation.rs:7278:28
  211. 17.59 s > |
  212. 17.59 s > 7278 | let total = crate::eval::evaluate_expression(&powered, &expression, numerator, &input)
  213. 17.59 s > | ^^^^ could not find `eval` in the crate root
  214. 17.59 s > |
  215. 17.59 s > note: found an item that was configured out
  216. 17.59 s > --> crates/three-dimensional-reps/src/lib.rs:7:9
  217. 17.59 s > |
  218. 17.59 s > 6 | #[cfg(feature = "eval")]
  219. 17.59 s > | ---------------- the item is gated behind the `eval` feature
  220. 17.59 s > 7 | pub mod eval;
  221. 17.59 s > | ^^^^
  222. 17.59 s >
  223. 17.59 s > For more information about this error, try `rustc --explain E0433`.
  224. 17.59 s > error: could not compile `three-dimensional-reps` (lib test) due to 4 previous errors
  225. 17.59 s For full logs, run:
  226. 17.59 s nix log /nix/store/7zw48naflmi73dxkqz28kzrmi51nzd6p-gammaloop-crate-test-binaries-three-dimensional-reps-50150770f831b638-deps-0.1.0.drv
  227. 17.59 s error: Cannot build '/nix/store/mj3pf6c3fjp5zadvvgw8xqd5c328983v-gammaloop-nextest-binaries-core-three-dimensional-reps-0.1.0.drv'.
  228. 17.59 s Reason: 1 dependency failed.
  229. 17.59 s Output paths:
  230. 17.59 s /nix/store/08ckdvc5a851x7bjzyl911f0r34j39y6-gammaloop-nextest-binaries-core-three-dimensional-reps-0.1.0
  231. 17.59 s error: Build failed due to failed dependency
  232. 17.59 s error: Cannot build '/nix/store/lh3brzm0pijkby2zxlwzwy3cpw6dli9y-gammaloop-nextest-binaries-core.drv'.
  233. 17.59 s Reason: 1 dependency failed.
  234. 17.59 s Output paths:
  235. 17.59 s /nix/store/9qyldachbc63nff7ijv5qyhdy1g09nai-gammaloop-nextest-binaries-core
  236. 17.59 s warning: killing stray builder process 406654 ()...
  237. 17.59 s warning: killing stray builder process 409615 (/nix/store/zmvy2d25yndq6i05zkvclf1f56pdh6l1-cargo-nextest-0.9.140/bin/cargo-nextest nextest archive --cargo-profile ci-optim --offline -p gammaloop-api -E package(gammaloop-api) --profile ci_gammaloop --archive-file /nix/store/3885lzwck5i592mrshd1azdzl50xvkxv-gammaloop-nextest-binaries-core-gammaloop-api-0.1.0/gammaloop-nextest-core-gammaloop-api.tar.zst)...
  238. 17.98 s Built gammaloop-nextest-binaries-core-gammaloop-api in 12.1s
  239. 17.98 s warning: killing stray builder process 409743 ()...
  240. 17.98 s warning: killing stray builder process 409875 ()...
  241. 17.98 s warning: killing stray builder process 409876 ()...
  242. 17.98 s warning: killing stray builder process 409877 ()...
  243. 18.62 s Built gammaloop-nextest-binaries-core-gammaloop-tracing-filter-macros in 2.6s
  244. 19.65 s Downloaded cached gammaloop-crate-test-binaries-gammaloop-tracing-filter-31e37aec92971227-inputs (1.6 GiB) in 13.9s
  245. 24.25 s Downloaded cached gammaloop-crate-test-binaries-gammalooprs-247ff5d63201fb2c-inputs (2.3 GiB) in 18.5s
  246. 24.25 s Build failed due to failed dependency
  247. 24.30 s Build failed.