build packages.x86_64-linux.crate-test-binaries-three-dimensional-reps
0.00 s
$ /nix/store/9ypz3flqsrl5xl495mm8h645gadjsxi1-coreutils-9.11/bin/timeout --kill-after=15s 7200s /nix/store/23zk8sgzamrbmj1fday15szf7f2279s8-nix-2.34.7/bin/nix --extra-experimental-features nix-command --extra-experimental-features flakes --log-format internal-json build --no-link --print-out-paths git+https://github.com/alphal00p/gammaloop?ref=codex%2Fnix-metadata-20260906&rev=b6b126198170b848f9fdb11014d4af7e02fbf9b5&shallow=1#packages.x86_64-linux.crate-test-binaries-three-dimensional-reps --print-build-logs
0.13 s
error (ignored): SQLite database '/var/cache/nix-ci-worker/eval-cache-v6/41b07a2447b635a17b55eb27dcc0bc05ad3296641599d2837b9bd299212231a8.sqlite ' is busy
2.42 s
4.59 s
Downloading cached gammaloop-ci-test-binary-dependencies-50150770f831b638-Cargo.toml from https://cache.nix-ci.com
4.60 s
Downloaded cached gammaloop-ci-test-binary-dependencies-50150770f831b638-Cargo.toml (584 B) in 15ms
4.63 s
Building /nix/store/620cg4lxjsln105525v3nij0sy75ni31-gammaloop-ci-test-binary-dependencies-50150770f831b638-three-dimensional-reps-dev-dependency.toml.drv
4.66 s
Waiting for lock on gammaloop-ci-prebuild-Cargo.toml
4.69 s
Building /nix/store/jxvw34bgxdnn9bkva90k3g1kdb1h3z69-gammaloop-ci-test-dependencies-50150770f831b638-Cargo.toml.drv
4.70 s
Downloading cached gammaloop-ci-test-binary-dependencies-78814cb8a1862b52-Cargo.toml from https://cache.nix-ci.com
4.71 s
Downloaded cached gammaloop-ci-test-binary-dependencies-78814cb8a1862b52-Cargo.toml (848 B) in 6ms
4.71 s
Waiting for lock on gammaloop-crate-gammaloop-workspace-hack-deps
4.75 s
Building /nix/store/yilhlj16j6kgrr04dfbsvm0dwrqh02dx-gammaloop-ci-test-dependencies-78814cb8a1862b52-Cargo.toml.drv
4.75 s
Downloading cached gammaloop-ci-test-binary-dependencies-2487cdc24b69b833-Cargo.toml from https://cache.nix-ci.com
4.76 s
Downloaded cached gammaloop-ci-test-binary-dependencies-2487cdc24b69b833-Cargo.toml (424 B) in 5ms
4.79 s
Building /nix/store/jxdzj8d3qdg8x070lm5khrh3qk8j9wgq-gammaloop-ci-test-dependencies-2487cdc24b69b833-Cargo.toml.drv
4.79 s
Progress: 0 of 21 built (4 building), 1 of 3 downloaded from cache (2 downloading)
4.79 s
Progress: 0 of 21 built (4 building), 2 of 3 downloaded from cache (1 downloading)
4.79 s
Progress: 0 of 21 built (4 building), 3 of 3 downloaded from cache
4.82 s
[gammaloop-ci-test-binary-dependencies-50150770f831b638-three-dimensional-reps-dev-dependency.toml:post-build] Uploading to the NixCI cache: /nix/store/nkd9p6h639pp1ya2nb2yngjw7qb80nfg-gammaloop-ci-test-binary-dependencies-50150770f831b638-three-dimensional-reps-dev-dependency.toml
4.93 s
[gammaloop-ci-test-binary-dependencies-50150770f831b638-three-dimensional-reps-dev-dependency.toml:post-build] warning: 'warn-short-path-literals' is deprecated, use 'lint-short-path-literals = ignore' instead
4.99 s
[gammaloop-ci-test-binary-dependencies-50150770f831b638-three-dimensional-reps-dev-dependency.toml:post-build] copying 0 paths...
5.16 s
[gammaloop-ci-test-binary-dependencies-50150770f831b638-three-dimensional-reps-dev-dependency.toml:post-build] warning: 'warn-short-path-literals' is deprecated, use 'lint-short-path-literals = ignore' instead
5.23 s
[gammaloop-ci-test-binary-dependencies-50150770f831b638-three-dimensional-reps-dev-dependency.toml:post-build] copying 0 paths...
5.26 s
Uploaded gammaloop-ci-test-binary-dependencies-50150770f831b638-three-dimensional-reps-dev-dependency.toml in 458ms
5.26 s
Progress: 1 of 22 built (3 building), 3 of 3 downloaded from cache
5.26 s
Built gammaloop-ci-test-binary-dependencies-50150770f831b638-three-dimensional-reps-dev-dependency.toml in 624ms
5.28 s
[gammaloop-ci-test-dependencies-50150770f831b638-Cargo.toml:post-build] Uploading to the NixCI cache: /nix/store/l910djsa81d33bspw74vkisyvzi8c7k4-gammaloop-ci-test-dependencies-50150770f831b638-Cargo.toml
5.37 s
[gammaloop-ci-test-dependencies-50150770f831b638-Cargo.toml:post-build] warning: 'warn-short-path-literals' is deprecated, use 'lint-short-path-literals = ignore' instead
5.41 s
[gammaloop-ci-test-dependencies-50150770f831b638-Cargo.toml:post-build] copying 0 paths...
5.55 s
[gammaloop-ci-test-dependencies-50150770f831b638-Cargo.toml:post-build] warning: 'warn-short-path-literals' is deprecated, use 'lint-short-path-literals = ignore' instead
5.63 s
[gammaloop-ci-test-dependencies-50150770f831b638-Cargo.toml:post-build] copying 0 paths...
5.67 s
Uploaded gammaloop-ci-test-dependencies-50150770f831b638-Cargo.toml in 407ms
5.67 s
Progress: 2 of 23 built (2 building), 3 of 3 downloaded from cache
5.67 s
Built gammaloop-ci-test-dependencies-50150770f831b638-Cargo.toml in 977ms
5.70 s
[gammaloop-ci-test-dependencies-2487cdc24b69b833-Cargo.toml:post-build] Uploading to the NixCI cache: /nix/store/l1ylambkrws6lqkabrjfvkckjd7arvl1-gammaloop-ci-test-dependencies-2487cdc24b69b833-Cargo.toml
5.77 s
[gammaloop-ci-test-dependencies-2487cdc24b69b833-Cargo.toml:post-build] warning: 'warn-short-path-literals' is deprecated, use 'lint-short-path-literals = ignore' instead
5.81 s
[gammaloop-ci-test-dependencies-2487cdc24b69b833-Cargo.toml:post-build] copying 0 paths...
5.87 s
[gammaloop-ci-test-dependencies-2487cdc24b69b833-Cargo.toml:post-build] warning: 'warn-short-path-literals' is deprecated, use 'lint-short-path-literals = ignore' instead
5.92 s
[gammaloop-ci-test-dependencies-2487cdc24b69b833-Cargo.toml:post-build] copying 0 paths...
5.93 s
Uploaded gammaloop-ci-test-dependencies-2487cdc24b69b833-Cargo.toml in 255ms
5.93 s
Progress: 3 of 19 built (1 building), 3 of 3 downloaded from cache
5.93 s
Built gammaloop-ci-test-dependencies-2487cdc24b69b833-Cargo.toml in 1.1s
5.95 s
[gammaloop-ci-test-dependencies-78814cb8a1862b52-Cargo.toml:post-build] Uploading to the NixCI cache: /nix/store/b2x2yjjsjn0z6cz0rnyvf4nam1pcinw9-gammaloop-ci-test-dependencies-78814cb8a1862b52-Cargo.toml
5.99 s
[gammaloop-ci-test-dependencies-78814cb8a1862b52-Cargo.toml:post-build] warning: 'warn-short-path-literals' is deprecated, use 'lint-short-path-literals = ignore' instead
6.02 s
[gammaloop-ci-test-dependencies-78814cb8a1862b52-Cargo.toml:post-build] copying 0 paths...
6.06 s
[gammaloop-ci-test-dependencies-78814cb8a1862b52-Cargo.toml:post-build] warning: 'warn-short-path-literals' is deprecated, use 'lint-short-path-literals = ignore' instead
6.12 s
[gammaloop-ci-test-dependencies-78814cb8a1862b52-Cargo.toml:post-build] copying 0 paths...
6.14 s
Uploaded gammaloop-ci-test-dependencies-78814cb8a1862b52-Cargo.toml in 196ms
6.14 s
Progress: 4 of 20 built, 3 of 3 downloaded from cache
6.14 s
Built gammaloop-ci-test-dependencies-78814cb8a1862b52-Cargo.toml in 1.3s
10.15 s
Waiting for lock on source
275.44 s
Waiting for lock on gammaloop-crate-gammaloop-workspace-hack-build
280.56 s
Building /nix/store/n3mc716dqir9mphypp35l3kvmzd4mms5-gammaloop-workspace-deps-deps-0.1.0.drv
280.62 s
[gammaloop-workspace-deps-deps] Phase: unpackPhase
280.63 s
[gammaloop-workspace-deps-deps] unpacking source archive /nix/store/rypdci796a83my1vpk7ixr3v8nnfca3d-source
280.64 s
[gammaloop-workspace-deps-deps] source root is source
280.65 s
[gammaloop-workspace-deps-deps] Phase: patchPhase
280.65 s
[gammaloop-workspace-deps-deps] Executing configureCargoCommonVars
280.66 s
[gammaloop-workspace-deps-deps] decompressing cargo artifacts from /nix/store/l26rynqj02sah2g22ghjqn36zsgk3qrm-gammaloop-crate-gammaloop-workspace-hack-deps-0.1.0/target.tar.zst to target
281.34 s
[gammaloop-workspace-deps-deps] decompressing cargo artifacts from /nix/store/78a6ng21mm54dsfh73lm7infp4gr4yd9-gammaloop-crate-gammaloop-workspace-hack-build-0.1.0/target.tar.zst to target
281.35 s
[gammaloop-workspace-deps-deps] Phase: updateAutotoolsGnuConfigScriptsPhase
281.37 s
[gammaloop-workspace-deps-deps] Phase: configurePhase
281.37 s
[gammaloop-workspace-deps-deps] will append /build/source/.cargo-home/config.toml with contents of /nix/store/1sigmg52bb61pfngmk9k8wq5fz9r7bf1-vendor-cargo-deps/config.toml
281.37 s
[gammaloop-workspace-deps-deps] default configurePhase, nothing to do
281.38 s
[gammaloop-workspace-deps-deps] Phase: buildPhase
281.38 s
[gammaloop-workspace-deps-deps] +++ command cargo --version
281.38 s
[gammaloop-workspace-deps-deps] cargo 1.97.0 (c980f4866 2026-06-30)
281.38 s
[gammaloop-workspace-deps-deps] +++ command cargo build --profile ci-optim --offline -p gammaloop-ci-prebuild -p gammaloop-workspace-hack --features gammaloop-tracing-filter/clap,gammaloop-tracing-filter/symbolica,idenso/bincode,idenso/reference-cases,linnet/bincode,linnet/drawing,linnet/rkyv,linnet/serde,linnet/symbolica,spenso-macros/shadowing,spenso/shadowing,symbolica/tracing_max_level_info,three-dimensional-reps/display,three-dimensional-reps/eval,three-dimensional-reps/serde
281.65 s
[gammaloop-workspace-deps-deps] Compiling thiserror v2.0.18
281.65 s
[gammaloop-workspace-deps-deps] Compiling thiserror-impl v2.0.18
281.66 s
[gammaloop-workspace-deps-deps] Compiling ident_case v1.0.1
281.67 s
[gammaloop-workspace-deps-deps] Compiling rand_core v0.6.4
281.67 s
[gammaloop-workspace-deps-deps] Compiling ucd-trie v0.1.7
281.67 s
[gammaloop-workspace-deps-deps] Compiling ptr_meta_derive v0.1.4
281.68 s
[gammaloop-workspace-deps-deps] Compiling ahash v0.7.8
281.68 s
[gammaloop-workspace-deps-deps] Compiling rustversion v1.0.22
281.68 s
[gammaloop-workspace-deps-deps] Compiling bytecheck v0.6.12
281.69 s
[gammaloop-workspace-deps-deps] Compiling bytecheck_derive v0.6.12
281.69 s
[gammaloop-workspace-deps-deps] Compiling proc-macro2-diagnostics v0.10.1
281.69 s
[gammaloop-workspace-deps-deps] Compiling rend v0.4.2
281.69 s
[gammaloop-workspace-deps-deps] Compiling simdutf8 v0.1.5
281.69 s
[gammaloop-workspace-deps-deps] Compiling gammaloop-workspace-hack v0.1.0 (/build/source/crates/gammaloop-workspace-hack)
281.70 s
[gammaloop-workspace-deps-deps] Compiling cgmath v0.18.0
281.70 s
[gammaloop-workspace-deps-deps] Compiling symbolica-utils v0.1.0 (/build/source/crates/symbolica-utils)
281.71 s
[gammaloop-workspace-deps-deps] Compiling rkyv v0.7.46
281.86 s
[gammaloop-workspace-deps-deps] Compiling rand_chacha v0.3.1
281.86 s
[gammaloop-workspace-deps-deps] Compiling pest v2.8.6
281.92 s
[gammaloop-workspace-deps-deps] Compiling num-rational v0.4.2
281.93 s
[gammaloop-workspace-deps-deps] Compiling rkyv_derive v0.7.46
281.96 s
[gammaloop-workspace-deps-deps] Compiling approx v0.4.0
281.96 s
[gammaloop-workspace-deps-deps] Compiling proc-macro-error-attr v1.0.4
281.98 s
[gammaloop-workspace-deps-deps] Compiling find-msvc-tools v0.1.9
281.98 s
[gammaloop-workspace-deps-deps] Compiling seahash v4.1.0
282.07 s
[gammaloop-workspace-deps-deps] Compiling rand v0.8.6
282.11 s
[gammaloop-workspace-deps-deps] Compiling hashbrown v0.12.3
282.13 s
[gammaloop-workspace-deps-deps] Compiling eyre v0.6.12
282.17 s
[gammaloop-workspace-deps-deps] Compiling shlex v1.3.0
282.25 s
[gammaloop-workspace-deps-deps] Compiling linnet v0.17.0 (/build/source/crates/linnet)
282.27 s
[gammaloop-workspace-deps-deps] Compiling strsim v0.10.0
282.31 s
[gammaloop-workspace-deps-deps] Compiling cc v1.2.61
282.39 s
[gammaloop-workspace-deps-deps] Compiling darling_core v0.14.4
282.40 s
[gammaloop-workspace-deps-deps] Compiling duplicate v2.0.1
282.50 s
[gammaloop-workspace-deps-deps] Compiling darling_core v0.23.0
282.55 s
[gammaloop-workspace-deps-deps] Compiling serde_repr v0.1.20
282.56 s
[gammaloop-workspace-deps-deps] Compiling proc-macro-error v1.0.4
282.75 s
[gammaloop-workspace-deps-deps] Compiling ryu v1.0.23
282.89 s
[gammaloop-workspace-deps-deps] Compiling pest_meta v2.8.6
282.97 s
[gammaloop-workspace-deps-deps] Compiling strum_macros v0.27.2
283.10 s
[gammaloop-workspace-deps-deps] Compiling siphasher v1.0.2
283.24 s
[gammaloop-workspace-deps-deps] Compiling instability v0.3.12
283.24 s
[gammaloop-workspace-deps-deps] Compiling heck v0.4.1
283.38 s
[gammaloop-workspace-deps-deps] Compiling castaway v0.2.4
283.41 s
[gammaloop-workspace-deps-deps] Compiling spenso-macros v0.3.2 (/build/source/crates/spenso-macros)
283.46 s
[gammaloop-workspace-deps-deps] Compiling pest_generator v2.8.6
283.58 s
[gammaloop-workspace-deps-deps] Compiling indoc v2.0.7
283.82 s
[gammaloop-workspace-deps-deps] Compiling compact_str v0.9.0
284.10 s
[gammaloop-workspace-deps-deps] Compiling env_filter v1.0.1
284.14 s
[gammaloop-workspace-deps-deps] Compiling num-iter v0.1.45
284.20 s
[gammaloop-workspace-deps-deps] Compiling unicode-truncate v2.0.1
284.28 s
[gammaloop-workspace-deps-deps] Compiling lru v0.16.4
284.30 s
[gammaloop-workspace-deps-deps] Compiling spenso v0.6.0 (/build/source/crates/spenso)
284.34 s
[gammaloop-workspace-deps-deps] Compiling ptr_meta v0.1.4
284.40 s
[gammaloop-workspace-deps-deps] Compiling jiff v0.2.24
284.41 s
[gammaloop-workspace-deps-deps] Compiling convert_case v0.4.0
284.44 s
[gammaloop-workspace-deps-deps] Compiling ref-ops v0.2.5
284.51 s
[gammaloop-workspace-deps-deps] Compiling option-ext v0.2.0
284.55 s
[gammaloop-workspace-deps-deps] Compiling dirs-sys v0.5.0
284.77 s
[gammaloop-workspace-deps-deps] Compiling num v0.4.3
284.81 s
[gammaloop-workspace-deps-deps] Compiling duplicate v1.0.0
284.92 s
[gammaloop-workspace-deps-deps] Compiling enum-try-as-inner v0.1.1
285.03 s
[gammaloop-workspace-deps-deps] Compiling phf_shared v0.13.1
285.19 s
[gammaloop-workspace-deps-deps] Compiling derive_more v0.99.20
285.24 s
[gammaloop-workspace-deps-deps] Compiling rand_xoshiro v0.6.0
285.45 s
[gammaloop-workspace-deps-deps] Compiling features v0.10.0
285.49 s
[gammaloop-workspace-deps-deps] Compiling delegate v0.12.0
285.74 s
[gammaloop-workspace-deps-deps] Compiling colored v2.2.0
286.30 s
[gammaloop-workspace-deps-deps] Compiling owo-colors v4.3.0
286.49 s
[gammaloop-workspace-deps-deps] Compiling litrs v1.0.0
286.68 s
[gammaloop-workspace-deps-deps] Compiling portable-atomic v1.13.1
286.79 s
[gammaloop-workspace-deps-deps] Compiling blake3 v1.8.5
287.38 s
[gammaloop-workspace-deps-deps] Compiling env_logger v0.11.10
287.43 s
[gammaloop-workspace-deps-deps] Compiling gat-lending-iterator v0.1.8
287.57 s
[gammaloop-workspace-deps-deps] Compiling constcat v0.5.1
287.61 s
[gammaloop-workspace-deps-deps] Compiling cfg_aliases v0.2.1
287.61 s
[gammaloop-workspace-deps-deps] Compiling object v0.37.3
287.64 s
[gammaloop-workspace-deps-deps] Compiling thiserror v1.0.69
287.65 s
[gammaloop-workspace-deps-deps] Compiling nix v0.31.2
288.00 s
[gammaloop-workspace-deps-deps] Compiling document-features v0.2.12
288.04 s
[gammaloop-workspace-deps-deps] Compiling phf_generator v0.13.1
288.11 s
[gammaloop-workspace-deps-deps] Compiling dirs v6.0.0
288.17 s
[gammaloop-workspace-deps-deps] Compiling rand_distr v0.4.3
288.19 s
[gammaloop-workspace-deps-deps] Compiling simba v0.6.0
288.25 s
[gammaloop-workspace-deps-deps] Compiling line-clipping v0.3.7
288.29 s
[gammaloop-workspace-deps-deps] Compiling nalgebra-macros v0.1.0
288.32 s
[gammaloop-workspace-deps-deps] Compiling thiserror-impl v1.0.69
288.44 s
[gammaloop-workspace-deps-deps] Compiling vte v0.15.0
288.44 s
[gammaloop-workspace-deps-deps] Compiling ref-cast v1.0.25
288.61 s
[gammaloop-workspace-deps-deps] Compiling gammaloop-tracing-filter-macros v0.1.0 (/build/source/crates/gammaloop-tracing-filter-macros)
288.70 s
[gammaloop-workspace-deps-deps] Compiling pest_derive v2.8.6
288.78 s
[gammaloop-workspace-deps-deps] Compiling cpufeatures v0.3.0
288.82 s
[gammaloop-workspace-deps-deps] Compiling color-spantrace v0.3.0
288.89 s
[gammaloop-workspace-deps-deps] Compiling arrayref v0.3.9
288.94 s
[gammaloop-workspace-deps-deps] Compiling clarabel v0.11.1
289.13 s
[gammaloop-workspace-deps-deps] Compiling dot-parser v0.5.1
289.16 s
[gammaloop-workspace-deps-deps] Compiling constant_time_eq v0.4.2
289.18 s
[gammaloop-workspace-deps-deps] Compiling idenso v0.3.0 (/build/source/crates/idenso)
289.27 s
[gammaloop-workspace-deps-deps] Compiling adler2 v2.0.1
289.30 s
[gammaloop-workspace-deps-deps] Compiling joinery v2.1.0
289.32 s
[gammaloop-workspace-deps-deps] Compiling gimli v0.32.3
289.37 s
[gammaloop-workspace-deps-deps] Compiling miniz_oxide v0.8.9
289.40 s
[gammaloop-workspace-deps-deps] Compiling titlecase v2.2.1
289.76 s
[gammaloop-workspace-deps-deps] Compiling crossterm v0.29.0
290.28 s
[gammaloop-workspace-deps-deps] Compiling vt100 v0.16.2
290.49 s
[gammaloop-workspace-deps-deps] Compiling phf_macros v0.13.1
291.18 s
[gammaloop-workspace-deps-deps] Compiling addr2line v0.25.1
291.18 s
[gammaloop-workspace-deps-deps] Compiling nalgebra v0.29.0
291.81 s
[gammaloop-workspace-deps-deps] Compiling tracing-error v0.2.1
291.91 s
[gammaloop-workspace-deps-deps] Compiling kasuari v0.4.12
291.96 s
[gammaloop-workspace-deps-deps] Compiling serde-big-array v0.5.1
292.02 s
[gammaloop-workspace-deps-deps] Compiling ref-cast-impl v1.0.25
292.04 s
[gammaloop-workspace-deps-deps] Compiling amd v0.2.2
292.09 s
[gammaloop-workspace-deps-deps] Compiling delegate v0.13.5
292.28 s
[gammaloop-workspace-deps-deps] Compiling enum_dispatch v0.3.13
292.31 s
[gammaloop-workspace-deps-deps] Compiling serde_derive_internals v0.29.1
292.35 s
[gammaloop-workspace-deps-deps] Compiling subprocess v0.2.15
293.02 s
[gammaloop-workspace-deps-deps] Compiling rust_lisp v0.18.0
293.82 s
[gammaloop-workspace-deps-deps] Compiling darling_macro v0.14.4
294.50 s
[gammaloop-workspace-deps-deps] Compiling slotmap v1.1.1
294.67 s
[gammaloop-workspace-deps-deps] Compiling itertools v0.11.0
294.67 s
[gammaloop-workspace-deps-deps] Compiling semver v1.0.28
294.75 s
[gammaloop-workspace-deps-deps] Compiling vakint v0.1.2 (/build/source/crates/vakint)
294.82 s
[gammaloop-workspace-deps-deps] Compiling spenso-hep-lib v0.1.7 (/build/source/crates/spenso-hep-lib)
294.94 s
[gammaloop-workspace-deps-deps] Compiling rustc-demangle v0.1.27
294.97 s
[gammaloop-workspace-deps-deps] Compiling three-dimensional-reps v0.1.0 (/build/source/crates/three-dimensional-reps)
295.09 s
[gammaloop-workspace-deps-deps] Compiling gammaloop-tracing-filter v0.1.0 (/build/source/crates/gammaloop-tracing-filter)
295.15 s
[gammaloop-workspace-deps-deps] Compiling base64 v0.22.1
295.25 s
[gammaloop-workspace-deps-deps] Compiling unit-prefix v0.5.2
295.26 s
[gammaloop-workspace-deps-deps] Compiling phf v0.13.1
295.31 s
[gammaloop-workspace-deps-deps] Compiling indicatif v0.18.4
295.35 s
[gammaloop-workspace-deps-deps] Compiling strum v0.27.2
295.39 s
[gammaloop-workspace-deps-deps] Compiling ratatui-core v0.1.0
295.42 s
[gammaloop-workspace-deps-deps] Compiling backtrace v0.3.76
295.54 s
[gammaloop-workspace-deps-deps] Compiling deprecate-until v1.0.0
295.79 s
[gammaloop-workspace-deps-deps] Compiling string-template-plus v0.4.3
296.29 s
[gammaloop-workspace-deps-deps] Compiling shellexpand v3.1.2
296.38 s
[gammaloop-workspace-deps-deps] Compiling xpct v0.5.1
296.43 s
[gammaloop-workspace-deps-deps] Compiling darling v0.14.4
296.45 s
[gammaloop-workspace-deps-deps] Compiling statrs v0.16.1
296.47 s
[gammaloop-workspace-deps-deps] Compiling derive_builder_core v0.11.2
296.54 s
[gammaloop-workspace-deps-deps] Compiling brotli-decompressor v4.0.3
296.56 s
[gammaloop-workspace-deps-deps] Compiling typed-index-collections v3.5.0
296.76 s
[gammaloop-workspace-deps-deps] Compiling integer-sqrt v0.1.5
296.82 s
[gammaloop-workspace-deps-deps] Compiling crossbeam-channel v0.5.15
296.83 s
[gammaloop-workspace-deps-deps] Compiling toml_datetime v0.7.5+spec-1.1.0
296.98 s
[gammaloop-workspace-deps-deps] Compiling include_dir_macros v0.7.4
297.13 s
[gammaloop-workspace-deps-deps] Compiling itertools v0.12.1
297.32 s
[gammaloop-workspace-deps-deps] Compiling futures-core v0.3.32
297.41 s
[gammaloop-workspace-deps-deps] Compiling symlink v0.1.0
297.46 s
[gammaloop-workspace-deps-deps] Compiling slab v0.4.12
297.61 s
[gammaloop-workspace-deps-deps] Compiling futures-task v0.3.32
297.70 s
[gammaloop-workspace-deps-deps] Compiling unsafe-libyaml v0.2.11
297.75 s
[gammaloop-workspace-deps-deps] Compiling darling_macro v0.23.0
297.77 s
[gammaloop-workspace-deps-deps] Compiling rustc-hash v2.1.2
297.82 s
[gammaloop-workspace-deps-deps] Compiling version-compare v0.2.1
298.05 s
[gammaloop-workspace-deps-deps] Compiling gammalooprs v0.3.4 (/build/source/crates/gammalooprs)
298.15 s
[gammaloop-workspace-deps-deps] Compiling pathfinding v4.15.0
298.22 s
[gammaloop-workspace-deps-deps] Compiling serde_yaml v0.9.34+deprecated
298.28 s
[gammaloop-workspace-deps-deps] Compiling include_dir v0.7.4
298.40 s
[gammaloop-workspace-deps-deps] Compiling futures-util v0.3.32
298.48 s
[gammaloop-workspace-deps-deps] Compiling tracing-appender v0.2.5
298.62 s
[gammaloop-workspace-deps-deps] Compiling brotli v7.0.0
299.10 s
[gammaloop-workspace-deps-deps] Compiling toml v0.9.12+spec-1.1.0
299.59 s
[gammaloop-workspace-deps-deps] Compiling rust-embed-impl v8.11.0
299.63 s
[gammaloop-workspace-deps-deps] Compiling ctrlc v3.5.2
299.73 s
[gammaloop-workspace-deps-deps] Compiling color-eyre v0.6.5
299.82 s
[gammaloop-workspace-deps-deps] Compiling tracing-indicatif v0.3.14
299.85 s
[gammaloop-workspace-deps-deps] Compiling json5 v0.4.1
300.03 s
[gammaloop-workspace-deps-deps] Compiling darling v0.23.0
300.27 s
[gammaloop-workspace-deps-deps] Compiling strum_macros v0.26.4
300.28 s
[gammaloop-workspace-deps-deps] Compiling clap_complete v4.6.3
300.36 s
[gammaloop-workspace-deps-deps] Compiling gammaloop-api v0.1.0 (/build/source/crates/gammaloop-api)
300.52 s
[gammaloop-workspace-deps-deps] Compiling strip-ansi-escapes v0.2.1
300.66 s
[gammaloop-workspace-deps-deps] Compiling vectorize v0.2.0
300.71 s
[gammaloop-workspace-deps-deps] Compiling fd-lock v4.0.4
300.78 s
[gammaloop-workspace-deps-deps] Compiling venial v0.5.0
300.91 s
[gammaloop-workspace-deps-deps] Compiling itertools v0.13.0
301.02 s
[gammaloop-workspace-deps-deps] Compiling sdd v3.0.10
301.26 s
[gammaloop-workspace-deps-deps] Compiling strum v0.26.3
301.33 s
[gammaloop-workspace-deps-deps] Compiling ringbuffer v0.16.0
301.55 s
[gammaloop-workspace-deps-deps] Compiling base62 v2.2.4
301.56 s
[gammaloop-workspace-deps-deps] Compiling scc v2.4.0
301.76 s
[gammaloop-workspace-deps-deps] Compiling clap_complete_nushell v4.6.0
301.79 s
[gammaloop-workspace-deps-deps] Compiling futures-executor v0.3.32
301.91 s
[gammaloop-workspace-deps-deps] Compiling schemars_derive v1.2.1
302.00 s
[gammaloop-workspace-deps-deps] Compiling gammaloop-integration-tests v0.1.0 (/build/source/tests)
302.11 s
[gammaloop-workspace-deps-deps] Compiling ndarray v0.17.2
302.18 s
[gammaloop-workspace-deps-deps] Compiling sysinfo v0.33.1
302.21 s
[gammaloop-workspace-deps-deps] Compiling serial_test_derive v3.4.0
302.23 s
[gammaloop-workspace-deps-deps] Compiling linnest v0.1.0 (/build/source/crates/linnest)
302.28 s
[gammaloop-workspace-deps-deps] Compiling kurvst v0.1.0 (/build/source/crates/kurvst)
302.39 s
[gammaloop-workspace-deps-deps] Compiling kurbo v0.13.0
302.40 s
[gammaloop-workspace-deps-deps] Compiling which v8.0.2
303.06 s
[gammaloop-workspace-deps-deps] Compiling rust-embed v8.11.0
303.29 s
[gammaloop-workspace-deps-deps] Compiling derive_builder_macro v0.11.2
303.42 s
[gammaloop-workspace-deps-deps] Compiling wasm-minimal-protocol v0.2.0
303.90 s
[gammaloop-workspace-deps-deps] Compiling ratatui-widgets v0.3.0
303.96 s
[gammaloop-workspace-deps-deps] Compiling ratatui-crossterm v0.1.0
304.88 s
[gammaloop-workspace-deps-deps] Compiling derive_builder v0.11.2
304.89 s
[gammaloop-workspace-deps-deps] Compiling ratatui-macros v0.7.0
304.93 s
[gammaloop-workspace-deps-deps] Compiling ratatui v0.30.0
305.21 s
[gammaloop-workspace-deps-deps] Compiling serial_test v3.4.0
305.51 s
[gammaloop-workspace-deps-deps] Compiling reedline v0.42.0
306.38 s
[gammaloop-workspace-deps-deps] Compiling schemars v1.2.1
306.51 s
[gammaloop-workspace-deps-deps] Compiling momtrop v0.3.0
308.18 s
[gammaloop-workspace-deps-deps] Compiling gammaloop-ci-prebuild v0.1.0 (/build/source/crates/gammaloop-ci-prebuild)
308.20 s
[gammaloop-workspace-deps-deps] Finished `ci-optim` profile [optimized] target(s) in 26.81s
308.31 s
[gammaloop-workspace-deps-deps] warning : the following packages contain code that will be rejected by a future version of Rust: proc-macro-error2 v2.0.1
308.31 s
[gammaloop-workspace-deps-deps] note : to see what the problems were, use the option `--future-incompat-report`, or run `cargo report future-incompatibilities --id 1`
308.66 s
[gammaloop-workspace-deps-deps] Phase: installPhase
308.67 s
[gammaloop-workspace-deps-deps] linking previous artifacts /nix/store/78a6ng21mm54dsfh73lm7infp4gr4yd9-gammaloop-crate-gammaloop-workspace-hack-build-0.1.0/target.tar.zst to /nix/store/md7w582nvwga8z57kcpxp2jcvpsfz1ch-gammaloop-workspace-deps-deps-0.1.0/target.tar.zst
309.07 s
[gammaloop-workspace-deps-deps] /*stdin*\ : 30.99% ( 427 MiB => 132 MiB, /nix/store/md7w582nvwga8z57kcpxp2jcvpsfz1ch-gammaloop-workspace-deps-deps-0.1.0/target.tar.zst)
309.11 s
[gammaloop-workspace-deps-deps] Phase: fixupPhase
313.06 s
[gammaloop-workspace-deps-deps] shrinking RPATHs of ELF executables and libraries in /nix/store/md7w582nvwga8z57kcpxp2jcvpsfz1ch-gammaloop-workspace-deps-deps-0.1.0
313.06 s
[gammaloop-workspace-deps-deps] checking for references to /build/ in /nix/store/md7w582nvwga8z57kcpxp2jcvpsfz1ch-gammaloop-workspace-deps-deps-0.1.0...
313.07 s
[gammaloop-workspace-deps-deps] patching script interpreter paths in /nix/store/md7w582nvwga8z57kcpxp2jcvpsfz1ch-gammaloop-workspace-deps-deps-0.1.0
313.64 s
[gammaloop-workspace-deps-deps:post-build] Uploading to the NixCI cache: /nix/store/md7w582nvwga8z57kcpxp2jcvpsfz1ch-gammaloop-workspace-deps-deps-0.1.0
313.67 s
[gammaloop-workspace-deps-deps:post-build] warning: 'warn-short-path-literals' is deprecated, use 'lint-short-path-literals = ignore' instead
313.70 s
[gammaloop-workspace-deps-deps:post-build] copying 1 paths...
313.70 s
[gammaloop-workspace-deps-deps:post-build] copying path '/nix/store/md7w582nvwga8z57kcpxp2jcvpsfz1ch-gammaloop-workspace-deps-deps-0.1.0' to 'https://cache.nix-ci.com'...
337.40 s
[gammaloop-workspace-deps-deps:post-build] warning: 'warn-short-path-literals' is deprecated, use 'lint-short-path-literals = ignore' instead
337.72 s
[gammaloop-workspace-deps-deps:post-build] copying 1 paths...
337.72 s
[gammaloop-workspace-deps-deps:post-build] copying path '/nix/store/n3mc716dqir9mphypp35l3kvmzd4mms5-gammaloop-workspace-deps-deps-0.1.0.drv' to 'https://cache.nix-ci.com'...
337.90 s
Uploaded gammaloop-workspace-deps-deps in 24.2s
337.90 s
Progress: 5 of 15 built, 3 of 3 downloaded from cache
337.90 s
Built gammaloop-workspace-deps-deps in 57.3s
337.97 s
Building /nix/store/kjli088phyd22h0kl6j9b0213xqp7vb8-gammaloop-crate-test-dependencies-2487cdc24b69b833-inputs.drv
342.49 s
[gammaloop-crate-test-dependencies-2487cdc24b69b833-inputs:post-build] Uploading to the NixCI cache: /nix/store/hgkwsny9zx85kj0l3dl6ghkxl99glk2a-gammaloop-crate-test-dependencies-2487cdc24b69b833-inputs
342.56 s
[gammaloop-crate-test-dependencies-2487cdc24b69b833-inputs:post-build] warning: 'warn-short-path-literals' is deprecated, use 'lint-short-path-literals = ignore' instead
342.60 s
[gammaloop-crate-test-dependencies-2487cdc24b69b833-inputs:post-build] copying 1 paths...
342.60 s
[gammaloop-crate-test-dependencies-2487cdc24b69b833-inputs:post-build] copying path '/nix/store/hgkwsny9zx85kj0l3dl6ghkxl99glk2a-gammaloop-crate-test-dependencies-2487cdc24b69b833-inputs' to 'https://cache.nix-ci.com'...
434.94 s
[gammaloop-crate-test-dependencies-2487cdc24b69b833-inputs:post-build] warning: 'warn-short-path-literals' is deprecated, use 'lint-short-path-literals = ignore' instead
435.26 s
[gammaloop-crate-test-dependencies-2487cdc24b69b833-inputs:post-build] copying 1 paths...
435.26 s
[gammaloop-crate-test-dependencies-2487cdc24b69b833-inputs:post-build] copying path '/nix/store/kjli088phyd22h0kl6j9b0213xqp7vb8-gammaloop-crate-test-dependencies-2487cdc24b69b833-inputs.drv' to 'https://cache.nix-ci.com'...
435.45 s
Uploaded gammaloop-crate-test-dependencies-2487cdc24b69b833-inputs in 1m32s
435.45 s
Progress: 6 of 15 built, 3 of 3 downloaded from cache
435.46 s
Built gammaloop-crate-test-dependencies-2487cdc24b69b833-inputs in 1m37s
435.47 s
Waiting for lock on gammaloop-crate-test-dependencies-2487cdc24b69b833-deps
440.56 s
Building /nix/store/gb4h4cmgp95fizilkav764gv9dkl1mjh-gammaloop-crate-test-dependencies-78814cb8a1862b52-inputs.drv
448.46 s
[gammaloop-crate-test-dependencies-78814cb8a1862b52-inputs:post-build] Uploading to the NixCI cache: /nix/store/1d0p4518ykvawya0lhjglqs8j6m1ybs9-gammaloop-crate-test-dependencies-78814cb8a1862b52-inputs
448.58 s
[gammaloop-crate-test-dependencies-78814cb8a1862b52-inputs:post-build] warning: 'warn-short-path-literals' is deprecated, use 'lint-short-path-literals = ignore' instead
448.64 s
[gammaloop-crate-test-dependencies-78814cb8a1862b52-inputs:post-build] copying 1 paths...
448.64 s
[gammaloop-crate-test-dependencies-78814cb8a1862b52-inputs:post-build] copying path '/nix/store/1d0p4518ykvawya0lhjglqs8j6m1ybs9-gammaloop-crate-test-dependencies-78814cb8a1862b52-inputs' to 'https://cache.nix-ci.com'...
503.40 s
[gammaloop-crate-test-dependencies-78814cb8a1862b52-inputs:post-build] warning: 'warn-short-path-literals' is deprecated, use 'lint-short-path-literals = ignore' instead
503.80 s
[gammaloop-crate-test-dependencies-78814cb8a1862b52-inputs:post-build] copying 1 paths...
503.80 s
[gammaloop-crate-test-dependencies-78814cb8a1862b52-inputs:post-build] copying path '/nix/store/gb4h4cmgp95fizilkav764gv9dkl1mjh-gammaloop-crate-test-dependencies-78814cb8a1862b52-inputs.drv' to 'https://cache.nix-ci.com'...
504.32 s
Uploaded gammaloop-crate-test-dependencies-78814cb8a1862b52-inputs in 55.8s
504.32 s
Progress: 7 of 14 built, 3 of 3 downloaded from cache
504.32 s
Built gammaloop-crate-test-dependencies-78814cb8a1862b52-inputs in 1m03s
504.44 s
Building /nix/store/41a2nn540ms3n2l4cz3zrrjlm4m4by9s-gammaloop-crate-test-dependencies-78814cb8a1862b52-deps-0.1.0.drv
504.67 s
[gammaloop-crate-test-dependencies-78814cb8a1862b52-deps] Phase: unpackPhase
504.69 s
[gammaloop-crate-test-dependencies-78814cb8a1862b52-deps] unpacking source archive /nix/store/3whgj8q0ff4zwrn3l2lb8v1v11h0m03v-source
504.71 s
[gammaloop-crate-test-dependencies-78814cb8a1862b52-deps] source root is source
504.76 s
[gammaloop-crate-test-dependencies-78814cb8a1862b52-deps] Phase: patchPhase
504.94 s
[gammaloop-crate-test-dependencies-78814cb8a1862b52-deps] Executing configureCargoCommonVars
504.94 s
[gammaloop-crate-test-dependencies-78814cb8a1862b52-deps] copying cargo artifacts from /nix/store/1d0p4518ykvawya0lhjglqs8j6m1ybs9-gammaloop-crate-test-dependencies-78814cb8a1862b52-inputs/target to target
504.94 s
[gammaloop-crate-test-dependencies-78814cb8a1862b52-deps] will deep copy artifacts (instead of symlinking) as requested
506.04 s
[gammaloop-crate-test-dependencies-78814cb8a1862b52-deps] Phase: updateAutotoolsGnuConfigScriptsPhase
506.09 s
[gammaloop-crate-test-dependencies-78814cb8a1862b52-deps] Phase: configurePhase
506.09 s
[gammaloop-crate-test-dependencies-78814cb8a1862b52-deps] will append /build/source/.cargo-home/config.toml with contents of /nix/store/1sigmg52bb61pfngmk9k8wq5fz9r7bf1-vendor-cargo-deps/config.toml
506.09 s
[gammaloop-crate-test-dependencies-78814cb8a1862b52-deps] default configurePhase, nothing to do
506.10 s
[gammaloop-crate-test-dependencies-78814cb8a1862b52-deps] Phase: buildPhase
506.10 s
[gammaloop-crate-test-dependencies-78814cb8a1862b52-deps] +++ command cargo --version
506.10 s
[gammaloop-crate-test-dependencies-78814cb8a1862b52-deps] cargo 1.97.0 (c980f4866 2026-06-30)
506.11 s
[gammaloop-crate-test-dependencies-78814cb8a1862b52-deps] +++ command cargo build --profile ci-optim --offline -p gammaloop-ci-test-dependencies-78814cb8a1862b52 -p gammaloop-workspace-hack --features linnet/bincode,linnet/drawing,linnet/rkyv,linnet/serde,linnet/symbolica,symbolica/tracing_max_level_info --lib
506.72 s
[gammaloop-crate-test-dependencies-78814cb8a1862b52-deps] Compiling linnet v0.17.0 (/build/source/crates/linnet)
516.53 s
[gammaloop-crate-test-dependencies-78814cb8a1862b52-deps] Compiling linnest v0.1.0 (/build/source/crates/linnest)
530.16 s
[gammaloop-crate-test-dependencies-78814cb8a1862b52-deps] Compiling gammaloop-ci-test-dependencies-78814cb8a1862b52 v0.1.0 (/build/source/crates/gammaloop-ci-test-dependencies-78814cb8a1862b52)
530.21 s
[gammaloop-crate-test-dependencies-78814cb8a1862b52-deps] Finished `ci-optim` profile [optimized] target(s) in 24.10s
530.43 s
[gammaloop-crate-test-dependencies-78814cb8a1862b52-deps] warning : the following packages contain code that will be rejected by a future version of Rust: proc-macro-error2 v2.0.1
530.43 s
[gammaloop-crate-test-dependencies-78814cb8a1862b52-deps] note : to see what the problems were, use the option `--future-incompat-report`, or run `cargo report future-incompatibilities --id 1`
530.52 s
[gammaloop-crate-test-dependencies-78814cb8a1862b52-deps] +++ command cargo build --profile ci-optim --offline -p gammaloop-ci-test-binary-dependencies-78814cb8a1862b52 -p linnest -p linnet --features linnet/bincode,linnet/drawing,linnet/rkyv,linnet/serde,linnet/symbolica,symbolica/tracing_max_level_info --lib
530.96 s
[gammaloop-crate-test-dependencies-78814cb8a1862b52-deps] Compiling symbolica v2.2.0 (https://github.com/symbolica-dev/symbolica?branch=dev#0441bd7a)
530.97 s
[gammaloop-crate-test-dependencies-78814cb8a1862b52-deps] Compiling iai-callgrind-runner v0.14.2
530.97 s
[gammaloop-crate-test-dependencies-78814cb8a1862b52-deps] Compiling wait-timeout v0.2.1
530.97 s
[gammaloop-crate-test-dependencies-78814cb8a1862b52-deps] Compiling bit-vec v0.8.0
530.97 s
[gammaloop-crate-test-dependencies-78814cb8a1862b52-deps] Compiling quick-error v1.2.3
530.98 s
[gammaloop-crate-test-dependencies-78814cb8a1862b52-deps] Compiling iai-callgrind v0.14.2
530.99 s
[gammaloop-crate-test-dependencies-78814cb8a1862b52-deps] Compiling iai-callgrind-macros v0.5.1
530.99 s
[gammaloop-crate-test-dependencies-78814cb8a1862b52-deps] Compiling rand_xorshift v0.4.0
530.99 s
[gammaloop-crate-test-dependencies-78814cb8a1862b52-deps] Compiling bincode v1.3.3
530.99 s
[gammaloop-crate-test-dependencies-78814cb8a1862b52-deps] Compiling console v0.15.11
531.02 s
[gammaloop-crate-test-dependencies-78814cb8a1862b52-deps] Compiling unarray v0.1.4
531.12 s
[gammaloop-crate-test-dependencies-78814cb8a1862b52-deps] Compiling rusty-fork v0.3.1
531.29 s
[gammaloop-crate-test-dependencies-78814cb8a1862b52-deps] Compiling bit-set v0.8.0
531.51 s
[gammaloop-crate-test-dependencies-78814cb8a1862b52-deps] Compiling proptest v1.11.0
531.69 s
[gammaloop-crate-test-dependencies-78814cb8a1862b52-deps] Compiling similar-asserts v1.7.0
749.66 s
[gammaloop-crate-test-dependencies-78814cb8a1862b52-deps] Compiling gammaloop-workspace-hack v0.1.0 (/build/source/crates/gammaloop-workspace-hack)
749.80 s
[gammaloop-crate-test-dependencies-78814cb8a1862b52-deps] Compiling linnet v0.17.0 (/build/source/crates/linnet)
749.80 s
[gammaloop-crate-test-dependencies-78814cb8a1862b52-deps] Compiling gammaloop-ci-test-binary-dependencies-78814cb8a1862b52 v0.1.0 (/build/source/crates/gammaloop-ci-test-binary-dependencies-78814cb8a1862b52)
754.57 s
[gammaloop-crate-test-dependencies-78814cb8a1862b52-deps] Compiling linnest v0.1.0 (/build/source/crates/linnest)
760.38 s
[gammaloop-crate-test-dependencies-78814cb8a1862b52-deps] Finished `ci-optim` profile [optimized] target(s) in 3m 49s
760.50 s
[gammaloop-crate-test-dependencies-78814cb8a1862b52-deps] warning : the following packages contain code that will be rejected by a future version of Rust: proc-macro-error2 v2.0.1
760.50 s
[gammaloop-crate-test-dependencies-78814cb8a1862b52-deps] note : to see what the problems were, use the option `--future-incompat-report`, or run `cargo report future-incompatibilities --id 1`
760.54 s
[gammaloop-crate-test-dependencies-78814cb8a1862b52-deps] buildPhase completed in 4 minutes 14 seconds
760.54 s
[gammaloop-crate-test-dependencies-78814cb8a1862b52-deps] Phase: installPhase
760.55 s
[gammaloop-crate-test-dependencies-78814cb8a1862b52-deps] linking previous artifacts /nix/store/1d0p4518ykvawya0lhjglqs8j6m1ybs9-gammaloop-crate-test-dependencies-78814cb8a1862b52-inputs to /nix/store/v70mrna85bkpfambyjyqb7fk1jb1nq3d-gammaloop-crate-test-dependencies-78814cb8a1862b52-deps-0.1.0/target.tar.zst
760.74 s
[gammaloop-crate-test-dependencies-78814cb8a1862b52-deps] /*stdin*\ : 27.10% ( 224 MiB => 60.8 MiB, /nix/store/v70mrna85bkpfambyjyqb7fk1jb1nq3d-gammaloop-crate-test-dependencies-78814cb8a1862b52-deps-0.1.0/target.tar.zst)
760.76 s
[gammaloop-crate-test-dependencies-78814cb8a1862b52-deps] Phase: fixupPhase
760.77 s
[gammaloop-crate-test-dependencies-78814cb8a1862b52-deps] shrinking RPATHs of ELF executables and libraries in /nix/store/v70mrna85bkpfambyjyqb7fk1jb1nq3d-gammaloop-crate-test-dependencies-78814cb8a1862b52-deps-0.1.0
760.77 s
[gammaloop-crate-test-dependencies-78814cb8a1862b52-deps] checking for references to /build/ in /nix/store/v70mrna85bkpfambyjyqb7fk1jb1nq3d-gammaloop-crate-test-dependencies-78814cb8a1862b52-deps-0.1.0...
760.78 s
[gammaloop-crate-test-dependencies-78814cb8a1862b52-deps] patching script interpreter paths in /nix/store/v70mrna85bkpfambyjyqb7fk1jb1nq3d-gammaloop-crate-test-dependencies-78814cb8a1862b52-deps-0.1.0
761.07 s
[gammaloop-crate-test-dependencies-78814cb8a1862b52-deps:post-build] Uploading to the NixCI cache: /nix/store/v70mrna85bkpfambyjyqb7fk1jb1nq3d-gammaloop-crate-test-dependencies-78814cb8a1862b52-deps-0.1.0
761.10 s
[gammaloop-crate-test-dependencies-78814cb8a1862b52-deps:post-build] warning: 'warn-short-path-literals' is deprecated, use 'lint-short-path-literals = ignore' instead
761.14 s
[gammaloop-crate-test-dependencies-78814cb8a1862b52-deps:post-build] copying 1 paths...
761.14 s
[gammaloop-crate-test-dependencies-78814cb8a1862b52-deps:post-build] copying path '/nix/store/v70mrna85bkpfambyjyqb7fk1jb1nq3d-gammaloop-crate-test-dependencies-78814cb8a1862b52-deps-0.1.0' to 'https://cache.nix-ci.com'...
849.02 s
[gammaloop-crate-test-dependencies-78814cb8a1862b52-deps:post-build] warning: 'warn-short-path-literals' is deprecated, use 'lint-short-path-literals = ignore' instead
849.25 s
[gammaloop-crate-test-dependencies-78814cb8a1862b52-deps:post-build] copying 2 paths...
849.25 s
[gammaloop-crate-test-dependencies-78814cb8a1862b52-deps:post-build] copying path '/nix/store/3whgj8q0ff4zwrn3l2lb8v1v11h0m03v-source' to 'https://cache.nix-ci.com'...
849.86 s
[gammaloop-crate-test-dependencies-78814cb8a1862b52-deps:post-build] copying path '/nix/store/41a2nn540ms3n2l4cz3zrrjlm4m4by9s-gammaloop-crate-test-dependencies-78814cb8a1862b52-deps-0.1.0.drv' to 'https://cache.nix-ci.com'...
850.12 s
Uploaded gammaloop-crate-test-dependencies-78814cb8a1862b52-deps in 1m29s
850.12 s
Progress: 8 of 14 built, 3 of 3 downloaded from cache
850.12 s
Built gammaloop-crate-test-dependencies-78814cb8a1862b52-deps in 5m45s
850.18 s
Building /nix/store/jmhhhrwdm93h4plqd0nn7x0a47yf0nbh-gammaloop-crate-test-dependencies-50150770f831b638-inputs.drv
854.75 s
[gammaloop-crate-test-dependencies-50150770f831b638-inputs:post-build] Uploading to the NixCI cache: /nix/store/f2rkqh3q0lxip9bacx3qjgahcv40f7v1-gammaloop-crate-test-dependencies-50150770f831b638-inputs
854.80 s
[gammaloop-crate-test-dependencies-50150770f831b638-inputs:post-build] warning: 'warn-short-path-literals' is deprecated, use 'lint-short-path-literals = ignore' instead
854.84 s
[gammaloop-crate-test-dependencies-50150770f831b638-inputs:post-build] copying 1 paths...
854.84 s
[gammaloop-crate-test-dependencies-50150770f831b638-inputs:post-build] copying path '/nix/store/f2rkqh3q0lxip9bacx3qjgahcv40f7v1-gammaloop-crate-test-dependencies-50150770f831b638-inputs' to 'https://cache.nix-ci.com'...
977.16 s
[gammaloop-crate-test-dependencies-50150770f831b638-inputs:post-build] warning: 'warn-short-path-literals' is deprecated, use 'lint-short-path-literals = ignore' instead
978.04 s
[gammaloop-crate-test-dependencies-50150770f831b638-inputs:post-build] copying 1 paths...
978.04 s
[gammaloop-crate-test-dependencies-50150770f831b638-inputs:post-build] copying path '/nix/store/jmhhhrwdm93h4plqd0nn7x0a47yf0nbh-gammaloop-crate-test-dependencies-50150770f831b638-inputs.drv' to 'https://cache.nix-ci.com'...
979.25 s
Uploaded gammaloop-crate-test-dependencies-50150770f831b638-inputs in 2m04s
979.26 s
Progress: 9 of 14 built, 3 of 3 downloaded from cache
979.26 s
Built gammaloop-crate-test-dependencies-50150770f831b638-inputs in 2m09s
979.39 s
Building /nix/store/cix37g28bf54jqs4499qhq07m0qdnw8l-gammaloop-crate-test-dependencies-50150770f831b638-deps-0.1.0.drv
979.60 s
[gammaloop-crate-test-dependencies-50150770f831b638-deps] Phase: unpackPhase
979.62 s
[gammaloop-crate-test-dependencies-50150770f831b638-deps] unpacking source archive /nix/store/w23i6db12qhinqrv98z967yzr6awmzqj-source
979.65 s
[gammaloop-crate-test-dependencies-50150770f831b638-deps] source root is source
979.68 s
[gammaloop-crate-test-dependencies-50150770f831b638-deps] Phase: patchPhase
979.82 s
[gammaloop-crate-test-dependencies-50150770f831b638-deps] Executing configureCargoCommonVars
979.82 s
[gammaloop-crate-test-dependencies-50150770f831b638-deps] copying cargo artifacts from /nix/store/f2rkqh3q0lxip9bacx3qjgahcv40f7v1-gammaloop-crate-test-dependencies-50150770f831b638-inputs/target to target
979.82 s
[gammaloop-crate-test-dependencies-50150770f831b638-deps] will deep copy artifacts (instead of symlinking) as requested
981.27 s
[gammaloop-crate-test-dependencies-50150770f831b638-deps] Phase: updateAutotoolsGnuConfigScriptsPhase
981.32 s
[gammaloop-crate-test-dependencies-50150770f831b638-deps] Phase: configurePhase
981.32 s
[gammaloop-crate-test-dependencies-50150770f831b638-deps] will append /build/source/.cargo-home/config.toml with contents of /nix/store/1sigmg52bb61pfngmk9k8wq5fz9r7bf1-vendor-cargo-deps/config.toml
981.33 s
[gammaloop-crate-test-dependencies-50150770f831b638-deps] default configurePhase, nothing to do
981.33 s
[gammaloop-crate-test-dependencies-50150770f831b638-deps] Phase: buildPhase
981.34 s
[gammaloop-crate-test-dependencies-50150770f831b638-deps] +++ command cargo --version
981.34 s
[gammaloop-crate-test-dependencies-50150770f831b638-deps] cargo 1.97.0 (c980f4866 2026-06-30)
981.35 s
[gammaloop-crate-test-dependencies-50150770f831b638-deps] +++ command cargo build --profile ci-optim --offline -p gammaloop-ci-test-dependencies-50150770f831b638 -p gammaloop-workspace-hack --features linnet/bincode,linnet/drawing,linnet/serde,linnet/symbolica,symbolica/tracing_max_level_info,three-dimensional-reps/serde --lib
982.16 s
[gammaloop-crate-test-dependencies-50150770f831b638-deps] Compiling three-dimensional-reps v0.1.0 (/build/source/crates/three-dimensional-reps)
982.16 s
[gammaloop-crate-test-dependencies-50150770f831b638-deps] Compiling linnet v0.17.0 (/build/source/crates/linnet)
994.51 s
[gammaloop-crate-test-dependencies-50150770f831b638-deps] Compiling gammaloop-ci-test-dependencies-50150770f831b638 v0.1.0 (/build/source/crates/gammaloop-ci-test-dependencies-50150770f831b638)
1000.72 s
[gammaloop-crate-test-dependencies-50150770f831b638-deps] Finished `ci-optim` profile [optimized] target(s) in 19.36s
1000.86 s
[gammaloop-crate-test-dependencies-50150770f831b638-deps] warning : the following packages contain code that will be rejected by a future version of Rust: proc-macro-error2 v2.0.1
1000.86 s
[gammaloop-crate-test-dependencies-50150770f831b638-deps] note : to see what the problems were, use the option `--future-incompat-report`, or run `cargo report future-incompatibilities --id 1`
1000.92 s
[gammaloop-crate-test-dependencies-50150770f831b638-deps] +++ command cargo build --profile ci-optim --offline -p gammaloop-ci-test-binary-dependencies-50150770f831b638 -p three-dimensional-reps --features linnet/bincode,linnet/drawing,linnet/serde,linnet/symbolica,symbolica/tracing_max_level_info,three-dimensional-reps/serde --lib
1001.30 s
[gammaloop-crate-test-dependencies-50150770f831b638-deps] Compiling linnet v0.17.0 (/build/source/crates/linnet)
1008.08 s
[gammaloop-crate-test-dependencies-50150770f831b638-deps] Compiling gammaloop-ci-test-binary-dependencies-50150770f831b638 v0.1.0 (/build/source/crates/gammaloop-ci-test-binary-dependencies-50150770f831b638)
1008.08 s
[gammaloop-crate-test-dependencies-50150770f831b638-deps] Compiling three-dimensional-reps v0.1.0 (/build/source/crates/three-dimensional-reps)
1022.35 s
[gammaloop-crate-test-dependencies-50150770f831b638-deps] Finished `ci-optim` profile [optimized] target(s) in 21.42s
1022.55 s
[gammaloop-crate-test-dependencies-50150770f831b638-deps] warning : the following packages contain code that will be rejected by a future version of Rust: proc-macro-error2 v2.0.1
1022.55 s
[gammaloop-crate-test-dependencies-50150770f831b638-deps] note : to see what the problems were, use the option `--future-incompat-report`, or run `cargo report future-incompatibilities --id 1`
1022.64 s
[gammaloop-crate-test-dependencies-50150770f831b638-deps] buildPhase completed in 41 seconds
1022.64 s
[gammaloop-crate-test-dependencies-50150770f831b638-deps] Phase: installPhase
1022.67 s
[gammaloop-crate-test-dependencies-50150770f831b638-deps] linking previous artifacts /nix/store/f2rkqh3q0lxip9bacx3qjgahcv40f7v1-gammaloop-crate-test-dependencies-50150770f831b638-inputs to /nix/store/kvgz31glz0hjbmhwp8r0iwkl7v62inwy-gammaloop-crate-test-dependencies-50150770f831b638-deps-0.1.0/target.tar.zst
1023.00 s
[gammaloop-crate-test-dependencies-50150770f831b638-deps] /*stdin*\ : 30.93% ( 66.3 MiB => 20.5 MiB, /nix/store/kvgz31glz0hjbmhwp8r0iwkl7v62inwy-gammaloop-crate-test-dependencies-50150770f831b638-deps-0.1.0/target.tar.zst)
1023.05 s
[gammaloop-crate-test-dependencies-50150770f831b638-deps] Phase: fixupPhase
1023.11 s
[gammaloop-crate-test-dependencies-50150770f831b638-deps] shrinking RPATHs of ELF executables and libraries in /nix/store/kvgz31glz0hjbmhwp8r0iwkl7v62inwy-gammaloop-crate-test-dependencies-50150770f831b638-deps-0.1.0
1023.12 s
[gammaloop-crate-test-dependencies-50150770f831b638-deps] checking for references to /build/ in /nix/store/kvgz31glz0hjbmhwp8r0iwkl7v62inwy-gammaloop-crate-test-dependencies-50150770f831b638-deps-0.1.0...
1023.15 s
[gammaloop-crate-test-dependencies-50150770f831b638-deps] patching script interpreter paths in /nix/store/kvgz31glz0hjbmhwp8r0iwkl7v62inwy-gammaloop-crate-test-dependencies-50150770f831b638-deps-0.1.0
1023.78 s
[gammaloop-crate-test-dependencies-50150770f831b638-deps:post-build] Uploading to the NixCI cache: /nix/store/kvgz31glz0hjbmhwp8r0iwkl7v62inwy-gammaloop-crate-test-dependencies-50150770f831b638-deps-0.1.0
1024.55 s
[gammaloop-crate-test-dependencies-50150770f831b638-deps:post-build] warning: 'warn-short-path-literals' is deprecated, use 'lint-short-path-literals = ignore' instead
1024.66 s
[gammaloop-crate-test-dependencies-50150770f831b638-deps:post-build] copying 1 paths...
1024.66 s
[gammaloop-crate-test-dependencies-50150770f831b638-deps:post-build] copying path '/nix/store/kvgz31glz0hjbmhwp8r0iwkl7v62inwy-gammaloop-crate-test-dependencies-50150770f831b638-deps-0.1.0' to 'https://cache.nix-ci.com'...
1039.93 s
[gammaloop-crate-test-dependencies-50150770f831b638-deps:post-build] warning: 'warn-short-path-literals' is deprecated, use 'lint-short-path-literals = ignore' instead
1040.28 s
[gammaloop-crate-test-dependencies-50150770f831b638-deps:post-build] copying 2 paths...
1040.28 s
[gammaloop-crate-test-dependencies-50150770f831b638-deps:post-build] copying path '/nix/store/w23i6db12qhinqrv98z967yzr6awmzqj-source' to 'https://cache.nix-ci.com'...
1041.17 s
[gammaloop-crate-test-dependencies-50150770f831b638-deps:post-build] copying path '/nix/store/cix37g28bf54jqs4499qhq07m0qdnw8l-gammaloop-crate-test-dependencies-50150770f831b638-deps-0.1.0.drv' to 'https://cache.nix-ci.com'...
1042.70 s
Uploaded gammaloop-crate-test-dependencies-50150770f831b638-deps in 19.0s
1042.71 s
Progress: 10 of 14 built, 3 of 3 downloaded from cache
1042.71 s
Built gammaloop-crate-test-dependencies-50150770f831b638-deps in 1m03s
1043.19 s
Building /nix/store/cbajpav159907dch3yn4yaxwgsywk6kx-gammaloop-crate-test-binaries-three-dimensional-reps-50150770f831b638-inputs.drv
1048.15 s
[gammaloop-crate-test-binaries-three-dimensional-reps-50150770f831b638-inputs:post-build] Uploading to the NixCI cache: /nix/store/1hkp51xn27aapbsqcb4apz40glk6yvlw-gammaloop-crate-test-binaries-three-dimensional-reps-50150770f831b638-inputs
1048.21 s
[gammaloop-crate-test-binaries-three-dimensional-reps-50150770f831b638-inputs:post-build] warning: 'warn-short-path-literals' is deprecated, use 'lint-short-path-literals = ignore' instead
1048.26 s
[gammaloop-crate-test-binaries-three-dimensional-reps-50150770f831b638-inputs:post-build] copying 1 paths...
1048.26 s
[gammaloop-crate-test-binaries-three-dimensional-reps-50150770f831b638-inputs:post-build] copying path '/nix/store/1hkp51xn27aapbsqcb4apz40glk6yvlw-gammaloop-crate-test-binaries-three-dimensional-reps-50150770f831b638-inputs' to 'https://cache.nix-ci.com'...
1145.17 s
[gammaloop-crate-test-binaries-three-dimensional-reps-50150770f831b638-inputs:post-build] warning: 'warn-short-path-literals' is deprecated, use 'lint-short-path-literals = ignore' instead
1145.45 s
[gammaloop-crate-test-binaries-three-dimensional-reps-50150770f831b638-inputs:post-build] copying 1 paths...
1145.45 s
[gammaloop-crate-test-binaries-three-dimensional-reps-50150770f831b638-inputs:post-build] copying path '/nix/store/cbajpav159907dch3yn4yaxwgsywk6kx-gammaloop-crate-test-binaries-three-dimensional-reps-50150770f831b638-inputs.drv' to 'https://cache.nix-ci.com'...
1145.64 s
Uploaded gammaloop-crate-test-binaries-three-dimensional-reps-50150770f831b638-inputs in 1m37s
1145.64 s
Progress: 11 of 14 built, 3 of 3 downloaded from cache
1145.64 s
Built gammaloop-crate-test-binaries-three-dimensional-reps-50150770f831b638-inputs in 1m42s
1145.73 s
Building /nix/store/7zw48naflmi73dxkqz28kzrmi51nzd6p-gammaloop-crate-test-binaries-three-dimensional-reps-50150770f831b638-deps-0.1.0.drv
1145.83 s
[gammaloop-crate-test-binaries-three-dimensional-reps-50150770f831b638-deps] Phase: unpackPhase
1145.84 s
[gammaloop-crate-test-binaries-three-dimensional-reps-50150770f831b638-deps] unpacking source archive /nix/store/w23i6db12qhinqrv98z967yzr6awmzqj-source
1145.85 s
[gammaloop-crate-test-binaries-three-dimensional-reps-50150770f831b638-deps] source root is source
1145.87 s
[gammaloop-crate-test-binaries-three-dimensional-reps-50150770f831b638-deps] Phase: patchPhase
1146.01 s
[gammaloop-crate-test-binaries-three-dimensional-reps-50150770f831b638-deps] Executing configureCargoCommonVars
1146.01 s
[gammaloop-crate-test-binaries-three-dimensional-reps-50150770f831b638-deps] copying cargo artifacts from /nix/store/1hkp51xn27aapbsqcb4apz40glk6yvlw-gammaloop-crate-test-binaries-three-dimensional-reps-50150770f831b638-inputs/target to target
1146.01 s
[gammaloop-crate-test-binaries-three-dimensional-reps-50150770f831b638-deps] will deep copy artifacts (instead of symlinking) as requested
1147.23 s
[gammaloop-crate-test-binaries-three-dimensional-reps-50150770f831b638-deps] Phase: updateAutotoolsGnuConfigScriptsPhase
1147.27 s
[gammaloop-crate-test-binaries-three-dimensional-reps-50150770f831b638-deps] Phase: configurePhase
1147.28 s
[gammaloop-crate-test-binaries-three-dimensional-reps-50150770f831b638-deps] will append /build/source/.cargo-home/config.toml with contents of /nix/store/1sigmg52bb61pfngmk9k8wq5fz9r7bf1-vendor-cargo-deps/config.toml
1147.28 s
[gammaloop-crate-test-binaries-three-dimensional-reps-50150770f831b638-deps] default configurePhase, nothing to do
1147.29 s
[gammaloop-crate-test-binaries-three-dimensional-reps-50150770f831b638-deps] Phase: buildPhase
1147.29 s
[gammaloop-crate-test-binaries-three-dimensional-reps-50150770f831b638-deps] +++ command cargo --version
1147.30 s
[gammaloop-crate-test-binaries-three-dimensional-reps-50150770f831b638-deps] cargo 1.97.0 (c980f4866 2026-06-30)
1147.30 s
[gammaloop-crate-test-binaries-three-dimensional-reps-50150770f831b638-deps] +++ command cargo test --profile ci-optim --no-run --offline -p three-dimensional-reps --features three-dimensional-reps/serde
1147.76 s
[gammaloop-crate-test-binaries-three-dimensional-reps-50150770f831b638-deps] Compiling three-dimensional-reps v0.1.0 (/build/source/crates/three-dimensional-reps)
1148.03 s
[gammaloop-crate-test-binaries-three-dimensional-reps-50150770f831b638-deps] error[E0433] : cannot find `eval` in `crate`
1148.03 s
[gammaloop-crate-test-binaries-three-dimensional-reps-50150770f831b638-deps] --> crates/three-dimensional-reps/src/generation.rs:7255:28
1148.03 s
[gammaloop-crate-test-binaries-three-dimensional-reps-50150770f831b638-deps] |
1148.03 s
[gammaloop-crate-test-binaries-three-dimensional-reps-50150770f831b638-deps] 7255 | let input = crate::eval::EvaluationInput {
1148.03 s
[gammaloop-crate-test-binaries-three-dimensional-reps-50150770f831b638-deps] | ^^^^ could not find `eval` in the crate root
1148.03 s
[gammaloop-crate-test-binaries-three-dimensional-reps-50150770f831b638-deps] |
1148.03 s
[gammaloop-crate-test-binaries-three-dimensional-reps-50150770f831b638-deps] note : found an item that was configured out
1148.03 s
[gammaloop-crate-test-binaries-three-dimensional-reps-50150770f831b638-deps] --> crates/three-dimensional-reps/src/lib.rs:7:9
1148.03 s
[gammaloop-crate-test-binaries-three-dimensional-reps-50150770f831b638-deps] |
1148.03 s
[gammaloop-crate-test-binaries-three-dimensional-reps-50150770f831b638-deps] 6 | #[cfg(feature = "eval")]
1148.03 s
[gammaloop-crate-test-binaries-three-dimensional-reps-50150770f831b638-deps] | ---------------- the item is gated behind the `eval` feature
1148.03 s
[gammaloop-crate-test-binaries-three-dimensional-reps-50150770f831b638-deps] 7 | pub mod eval;
1148.03 s
[gammaloop-crate-test-binaries-three-dimensional-reps-50150770f831b638-deps] | ^^^^
1148.03 s
[gammaloop-crate-test-binaries-three-dimensional-reps-50150770f831b638-deps]
1148.04 s
[gammaloop-crate-test-binaries-three-dimensional-reps-50150770f831b638-deps] error[E0433] : cannot find `eval` in `crate`
1148.04 s
[gammaloop-crate-test-binaries-three-dimensional-reps-50150770f831b638-deps] --> crates/three-dimensional-reps/src/generation.rs:7262:30
1148.04 s
[gammaloop-crate-test-binaries-three-dimensional-reps-50150770f831b638-deps] |
1148.04 s
[gammaloop-crate-test-binaries-three-dimensional-reps-50150770f831b638-deps] 7262 | let contact = crate::eval::evaluate_expression(
1148.04 s
[gammaloop-crate-test-binaries-three-dimensional-reps-50150770f831b638-deps] | ^^^^ could not find `eval` in the crate root
1148.04 s
[gammaloop-crate-test-binaries-three-dimensional-reps-50150770f831b638-deps] |
1148.04 s
[gammaloop-crate-test-binaries-three-dimensional-reps-50150770f831b638-deps] note : found an item that was configured out
1148.04 s
[gammaloop-crate-test-binaries-three-dimensional-reps-50150770f831b638-deps] --> crates/three-dimensional-reps/src/lib.rs:7:9
1148.04 s
[gammaloop-crate-test-binaries-three-dimensional-reps-50150770f831b638-deps] |
1148.04 s
[gammaloop-crate-test-binaries-three-dimensional-reps-50150770f831b638-deps] 6 | #[cfg(feature = "eval")]
1148.04 s
[gammaloop-crate-test-binaries-three-dimensional-reps-50150770f831b638-deps] | ---------------- the item is gated behind the `eval` feature
1148.04 s
[gammaloop-crate-test-binaries-three-dimensional-reps-50150770f831b638-deps] 7 | pub mod eval;
1148.04 s
[gammaloop-crate-test-binaries-three-dimensional-reps-50150770f831b638-deps] | ^^^^
1148.04 s
[gammaloop-crate-test-binaries-three-dimensional-reps-50150770f831b638-deps]
1148.05 s
[gammaloop-crate-test-binaries-three-dimensional-reps-50150770f831b638-deps] error[E0433] : cannot find `eval` in `crate`
1148.05 s
[gammaloop-crate-test-binaries-three-dimensional-reps-50150770f831b638-deps] --> crates/three-dimensional-reps/src/generation.rs:7270:32
1148.05 s
[gammaloop-crate-test-binaries-three-dimensional-reps-50150770f831b638-deps] |
1148.05 s
[gammaloop-crate-test-binaries-three-dimensional-reps-50150770f831b638-deps] 7270 | let remainder = crate::eval::evaluate_expression(
1148.05 s
[gammaloop-crate-test-binaries-three-dimensional-reps-50150770f831b638-deps] | ^^^^ could not find `eval` in the crate root
1148.05 s
[gammaloop-crate-test-binaries-three-dimensional-reps-50150770f831b638-deps] |
1148.05 s
[gammaloop-crate-test-binaries-three-dimensional-reps-50150770f831b638-deps] note : found an item that was configured out
1148.05 s
[gammaloop-crate-test-binaries-three-dimensional-reps-50150770f831b638-deps] --> crates/three-dimensional-reps/src/lib.rs:7:9
1148.05 s
[gammaloop-crate-test-binaries-three-dimensional-reps-50150770f831b638-deps] |
1148.05 s
[gammaloop-crate-test-binaries-three-dimensional-reps-50150770f831b638-deps] 6 | #[cfg(feature = "eval")]
1148.05 s
[gammaloop-crate-test-binaries-three-dimensional-reps-50150770f831b638-deps] | ---------------- the item is gated behind the `eval` feature
1148.05 s
[gammaloop-crate-test-binaries-three-dimensional-reps-50150770f831b638-deps] 7 | pub mod eval;
1148.05 s
[gammaloop-crate-test-binaries-three-dimensional-reps-50150770f831b638-deps] | ^^^^
1148.05 s
[gammaloop-crate-test-binaries-three-dimensional-reps-50150770f831b638-deps]
1148.06 s
[gammaloop-crate-test-binaries-three-dimensional-reps-50150770f831b638-deps] error[E0433] : cannot find `eval` in `crate`
1148.06 s
[gammaloop-crate-test-binaries-three-dimensional-reps-50150770f831b638-deps] --> crates/three-dimensional-reps/src/generation.rs:7278:28
1148.06 s
[gammaloop-crate-test-binaries-three-dimensional-reps-50150770f831b638-deps] |
1148.06 s
[gammaloop-crate-test-binaries-three-dimensional-reps-50150770f831b638-deps] 7278 | let total = crate::eval::evaluate_expression(&powered, &expression, numerator, &input)
1148.06 s
[gammaloop-crate-test-binaries-three-dimensional-reps-50150770f831b638-deps] | ^^^^ could not find `eval` in the crate root
1148.06 s
[gammaloop-crate-test-binaries-three-dimensional-reps-50150770f831b638-deps] |
1148.06 s
[gammaloop-crate-test-binaries-three-dimensional-reps-50150770f831b638-deps] note : found an item that was configured out
1148.06 s
[gammaloop-crate-test-binaries-three-dimensional-reps-50150770f831b638-deps] --> crates/three-dimensional-reps/src/lib.rs:7:9
1148.06 s
[gammaloop-crate-test-binaries-three-dimensional-reps-50150770f831b638-deps] |
1148.06 s
[gammaloop-crate-test-binaries-three-dimensional-reps-50150770f831b638-deps] 6 | #[cfg(feature = "eval")]
1148.06 s
[gammaloop-crate-test-binaries-three-dimensional-reps-50150770f831b638-deps] | ---------------- the item is gated behind the `eval` feature
1148.06 s
[gammaloop-crate-test-binaries-three-dimensional-reps-50150770f831b638-deps] 7 | pub mod eval;
1148.06 s
[gammaloop-crate-test-binaries-three-dimensional-reps-50150770f831b638-deps] | ^^^^
1148.06 s
[gammaloop-crate-test-binaries-three-dimensional-reps-50150770f831b638-deps]
1150.10 s
[gammaloop-crate-test-binaries-three-dimensional-reps-50150770f831b638-deps] For more information about this error, try `rustc --explain E0433`.
1150.13 s
[gammaloop-crate-test-binaries-three-dimensional-reps-50150770f831b638-deps] error : could not compile `three-dimensional-reps` (lib test) due to 4 previous errors
1150.50 s
Progress: 11 of 13 built (1 failed), 3 of 3 downloaded from cache
1150.50 s
Failed to build gammaloop-crate-test-binaries-three-dimensional-reps-50150770f831b638-deps after 4.7s
1150.50 s
error: Cannot build '/nix/store/7zw48naflmi73dxkqz28kzrmi51nzd6p-gammaloop-crate-test-binaries-three-dimensional-reps-50150770f831b638-deps-0.1.0.drv '.
1150.50 s
Reason: builder failed with exit code 101 .
1150.50 s
Output paths:
1150.50 s
/nix/store/rbv8894f6hcln558p7qjz75i2d2w7jsa-gammaloop-crate-test-binaries-three-dimensional-reps-50150770f831b638-deps-0.1.0
1150.50 s
Last 74 log lines:
1150.50 s
> Running phase: unpackPhase
1150.50 s
> unpacking source archive /nix/store/w23i6db12qhinqrv98z967yzr6awmzqj-source
1150.50 s
> source root is source
1150.50 s
> Running phase: patchPhase
1150.50 s
> Executing configureCargoCommonVars
1150.50 s
> copying cargo artifacts from /nix/store/1hkp51xn27aapbsqcb4apz40glk6yvlw-gammaloop-crate-test-binaries-three-dimensional-reps-50150770f831b638-inputs/target to target
1150.50 s
> will deep copy artifacts (instead of symlinking) as requested
1150.50 s
> Running phase: updateAutotoolsGnuConfigScriptsPhase
1150.50 s
> Running phase: configurePhase
1150.50 s
> will append /build/source/.cargo-home/config.toml with contents of /nix/store/1sigmg52bb61pfngmk9k8wq5fz9r7bf1-vendor-cargo-deps/config.toml
1150.50 s
> default configurePhase, nothing to do
1150.50 s
> Running phase: buildPhase
1150.50 s
> +++ command cargo --version
1150.50 s
> cargo 1.97.0 (c980f4866 2026-06-30)
1150.50 s
> +++ command cargo test --profile ci-optim --no-run --offline -p three-dimensional-reps --features three-dimensional-reps/serde
1150.50 s
> Compiling three-dimensional-reps v0.1.0 (/build/source/crates/three-dimensional-reps)
1150.50 s
> error[E0433] : cannot find `eval` in `crate`
1150.50 s
> --> crates/three-dimensional-reps/src/generation.rs:7255:28
1150.50 s
> |
1150.50 s
> 7255 | let input = crate::eval::EvaluationInput {
1150.50 s
> | ^^^^ could not find `eval` in the crate root
1150.50 s
> |
1150.50 s
> note : found an item that was configured out
1150.50 s
> --> crates/three-dimensional-reps/src/lib.rs:7:9
1150.50 s
> |
1150.50 s
> 6 | #[cfg(feature = "eval")]
1150.50 s
> | ---------------- the item is gated behind the `eval` feature
1150.50 s
> 7 | pub mod eval;
1150.50 s
> | ^^^^
1150.50 s
>
1150.50 s
> error[E0433] : cannot find `eval` in `crate`
1150.50 s
> --> crates/three-dimensional-reps/src/generation.rs:7262:30
1150.50 s
> |
1150.50 s
> 7262 | let contact = crate::eval::evaluate_expression(
1150.50 s
> | ^^^^ could not find `eval` in the crate root
1150.50 s
> |
1150.50 s
> note : found an item that was configured out
1150.50 s
> --> crates/three-dimensional-reps/src/lib.rs:7:9
1150.50 s
> |
1150.50 s
> 6 | #[cfg(feature = "eval")]
1150.50 s
> | ---------------- the item is gated behind the `eval` feature
1150.50 s
> 7 | pub mod eval;
1150.50 s
> | ^^^^
1150.50 s
>
1150.50 s
> error[E0433] : cannot find `eval` in `crate`
1150.50 s
> --> crates/three-dimensional-reps/src/generation.rs:7270:32
1150.50 s
> |
1150.50 s
> 7270 | let remainder = crate::eval::evaluate_expression(
1150.50 s
> | ^^^^ could not find `eval` in the crate root
1150.50 s
> |
1150.50 s
> note : found an item that was configured out
1150.50 s
> --> crates/three-dimensional-reps/src/lib.rs:7:9
1150.50 s
> |
1150.50 s
> 6 | #[cfg(feature = "eval")]
1150.50 s
> | ---------------- the item is gated behind the `eval` feature
1150.50 s
> 7 | pub mod eval;
1150.50 s
> | ^^^^
1150.50 s
>
1150.50 s
> error[E0433] : cannot find `eval` in `crate`
1150.50 s
> --> crates/three-dimensional-reps/src/generation.rs:7278:28
1150.50 s
> |
1150.50 s
> 7278 | let total = crate::eval::evaluate_expression(&powered, &expression, numerator, &input)
1150.50 s
> | ^^^^ could not find `eval` in the crate root
1150.50 s
> |
1150.50 s
> note : found an item that was configured out
1150.50 s
> --> crates/three-dimensional-reps/src/lib.rs:7:9
1150.50 s
> |
1150.50 s
> 6 | #[cfg(feature = "eval")]
1150.50 s
> | ---------------- the item is gated behind the `eval` feature
1150.50 s
> 7 | pub mod eval;
1150.50 s
> | ^^^^
1150.50 s
>
1150.50 s
> For more information about this error, try `rustc --explain E0433`.
1150.50 s
> error : could not compile `three-dimensional-reps` (lib test) due to 4 previous errors
1150.50 s
For full logs, run:
1150.50 s
nix log /nix/store/7zw48naflmi73dxkqz28kzrmi51nzd6p-gammaloop-crate-test-binaries-three-dimensional-reps-50150770f831b638-deps-0.1.0.drv
1150.50 s
error: Cannot build '/nix/store/0arbyg6b93dlhf744x5n77jg72p0mag5-nix-ci-artifact-barrier-crate-test-binaries-three-dimensional-reps.drv '.
1150.50 s
Reason: 1 dependency failed .
1150.50 s
Output paths:
1150.50 s
/nix/store/jnhfchcdvn4xdz45qgcm3qsqbpl0q3gz-nix-ci-artifact-barrier-crate-test-binaries-three-dimensional-reps
1150.51 s
Build failed due to failed dependency
1150.56 s
Build failed.