0.01 s
$ /nix/store/9ypz3flqsrl5xl495mm8h645gadjsxi1-coreutils-9.11/bin/timeout --kill-after=15s 7200s /nix/store/23zk8sgzamrbmj1fday15szf7f2279s8-nix-2.34.7/bin/nix --extra-experimental-features nix-command --extra-experimental-features flakes flake clone git+https://github.com/alphal00p/gammaloop --dest /tmp/nix-ci-worker/stable-pwd/repo/
0.21 s
Cloning into '/tmp/nix-ci-worker/stable-pwd/repo'...
1.11 s
remote: Enumerating objects: 81968, done.
1.22 s
remote: Counting objects: 0% (1/11443)
remote: Counting objects: 1% (115/11443)
remote: Counting objects: 2% (229/11443)
remote: Counting objects: 3% (344/11443)
remote: Counting objects: 4% (458/11443)
remote: Counting objects: 5% (573/11443)
remote: Counting objects: 6% (687/11443)
remote: Counting objects: 7% (802/11443)
remote: Counting objects: 8% (916/11443)
remote: Counting objects: 9% (1030/11443)
remote: Counting objects: 10% (1145/11443)
remote: Counting objects: 11% (1259/11443)
remote: Counting objects: 12% (1374/11443)
remote: Counting objects: 13% (1488/11443)
remote: Counting objects: 14% (1603/11443)
remote: Counting objects: 15% (1717/11443)
remote: Counting objects: 16% (1831/11443)
remote: Counting objects: 17% (1946/11443)
remote: Counting objects: 18% (2060/11443)
remote: Counting objects: 19% (2175/11443)
remote: Counting objects: 20% (2289/11443)
remote: Counting objects: 21% (2404/11443)
remote: Counting objects: 22% (2518/11443)
remote: Counting objects: 23% (2632/11443)
remote: Counting objects: 24% (2747/11443)
remote: Counting objects: 25% (2861/11443)
remote: Counting objects: 26% (2976/11443)
remote: Counting objects: 27% (3090/11443)
remote: Counting objects: 28% (3205/11443)
remote: Counting objects: 29% (3319/11443)
remote: Counting objects: 30% (3433/11443)
remote: Counting objects: 31% (3548/11443)
remote: Counting objects: 32% (3662/11443)
remote: Counting objects: 33% (3777/11443)
remote: Counting objects: 34% (3891/11443)
remote: Counting objects: 35% (4006/11443)
remote: Counting objects: 36% (4120/11443)
remote: Counting objects: 37% (4234/11443)
remote: Counting objects: 38% (4349/11443)
remote: Counting objects: 39% (4463/11443)
remote: Counting objects: 40% (4578/11443)
remote: Counting objects: 41% (4692/11443)
remote: Counting objects: 42% (4807/11443)
remote: Counting objects: 43% (4921/11443)
remote: Counting objects: 44% (5035/11443)
remote: Counting objects: 45% (5150/11443)
remote: Counting objects: 46% (5264/11443)
remote: Counting objects: 47% (5379/11443)
remote: Counting objects: 48% (5493/11443)
remote: Counting objects: 49% (5608/11443)
remote: Counting objects: 50% (5722/11443)
remote: Counting objects: 51% (5836/11443)
remote: Counting objects: 52% (5951/11443)
remote: Counting objects: 53% (6065/11443)
remote: Counting objects: 54% (6180/11443)
remote: Counting objects: 55% (6294/11443)
remote: Counting objects: 56% (6409/11443)
remote: Counting objects: 57% (6523/11443)
remote: Counting objects: 58% (6637/11443)
remote: Counting objects: 59% (6752/11443)
remote: Counting objects: 60% (6866/11443)
remote: Counting objects: 61% (6981/11443)
remote: Counting objects: 62% (7095/11443)
remote: Counting objects: 63% (7210/11443)
remote: Counting objects: 64% (7324/11443)
remote: Counting objects: 65% (7438/11443)
remote: Counting objects: 66% (7553/11443)
remote: Counting objects: 67% (7667/11443)
remote: Counting objects: 68% (7782/11443)
remote: Counting objects: 69% (7896/11443)
remote: Counting objects: 70% (8011/11443)
remote: Counting objects: 71% (8125/11443)
remote: Counting objects: 72% (8239/11443)
remote: Counting objects: 73% (8354/11443)
remote: Counting objects: 74% (8468/11443)
remote: Counting objects: 75% (8583/11443)
remote: Counting objects: 76% (8697/11443)
remote: Counting objects: 77% (8812/11443)
remote: Counting objects: 78% (8926/11443)
remote: Counting objects: 79% (9040/11443)
remote: Counting objects: 80% (9155/11443)
remote: Counting objects: 81% (9269/11443)
remote: Counting objects: 82% (9384/11443)
remote: Counting objects: 83% (9498/11443)
remote: Counting objects: 84% (9613/11443)
remote: Counting objects: 85% (9727/11443)
remote: Counting objects: 86% (9841/11443)
remote: Counting objects: 87% (9956/11443)
remote: Counting objects: 88% (10070/11443)
remote: Counting objects: 89% (10185/11443)
remote: Counting objects: 90% (10299/11443)
remote: Counting objects: 91% (10414/11443)
remote: Counting objects: 92% (10528/11443)
remote: Counting objects: 93% (10642/11443)
remote: Counting objects: 94% (10757/11443)
remote: Counting objects: 95% (10871/11443)
remote: Counting objects: 96% (10986/11443)
remote: Counting objects: 97% (11100/11443)
remote: Counting objects: 98% (11215/11443)
remote: Counting objects: 99% (11329/11443)
remote: Counting objects: 100% (11443/11443)
remote: Counting objects: 100% (11443/11443), done.
3.87 s
remote: Compressing objects: 0% (1/2688)
remote: Compressing objects: 1% (27/2688)
remote: Compressing objects: 2% (54/2688)
remote: Compressing objects: 3% (81/2688)
remote: Compressing objects: 4% (108/2688)
remote: Compressing objects: 5% (135/2688)
remote: Compressing objects: 6% (162/2688)
remote: Compressing objects: 7% (189/2688)
remote: Compressing objects: 8% (216/2688)
remote: Compressing objects: 9% (242/2688)
remote: Compressing objects: 10% (269/2688)
remote: Compressing objects: 11% (296/2688)
remote: Compressing objects: 12% (323/2688)
remote: Compressing objects: 13% (350/2688)
remote: Compressing objects: 14% (377/2688)
remote: Compressing objects: 15% (404/2688)
remote: Compressing objects: 16% (431/2688)
remote: Compressing objects: 17% (457/2688)
remote: Compressing objects: 18% (484/2688)
remote: Compressing objects: 19% (511/2688)
remote: Compressing objects: 20% (538/2688)
remote: Compressing objects: 20% (546/2688)
remote: Compressing objects: 21% (565/2688)
remote: Compressing objects: 22% (592/2688)
remote: Compressing objects: 23% (619/2688)
remote: Compressing objects: 24% (646/2688)
remote: Compressing objects: 25% (672/2688)
remote: Compressing objects: 26% (699/2688)
remote: Compressing objects: 26% (704/2688)
remote: Compressing objects: 27% (726/2688)
remote: Compressing objects: 28% (753/2688)
remote: Compressing objects: 29% (780/2688)
remote: Compressing objects: 30% (807/2688)
remote: Compressing objects: 31% (834/2688)
remote: Compressing objects: 32% (861/2688)
remote: Compressing objects: 33% (888/2688)
remote: Compressing objects: 34% (914/2688)
remote: Compressing objects: 35% (941/2688)
remote: Compressing objects: 36% (968/2688)
remote: Compressing objects: 37% (995/2688)
remote: Compressing objects: 38% (1022/2688)
remote: Compressing objects: 39% (1049/2688)
remote: Compressing objects: 40% (1076/2688)
remote: Compressing objects: 41% (1103/2688)
remote: Compressing objects: 42% (1129/2688)
remote: Compressing objects: 43% (1156/2688)
remote: Compressing objects: 44% (1183/2688)
remote: Compressing objects: 45% (1210/2688)
remote: Compressing objects: 46% (1237/2688)
remote: Compressing objects: 47% (1264/2688)
remote: Compressing objects: 48% (1291/2688)
remote: Compressing objects: 49% (1318/2688)
remote: Compressing objects: 50% (1344/2688)
remote: Compressing objects: 51% (1371/2688)
remote: Compressing objects: 52% (1398/2688)
remote: Compressing objects: 53% (1425/2688)
remote: Compressing objects: 54% (1452/2688)
remote: Compressing objects: 55% (1479/2688)
remote: Compressing objects: 56% (1506/2688)
remote: Compressing objects: 57% (1533/2688)
remote: Compressing objects: 58% (1560/2688)
remote: Compressing objects: 59% (1586/2688)
remote: Compressing objects: 60% (1613/2688)
remote: Compressing objects: 61% (1640/2688)
remote: Compressing objects: 62% (1667/2688)
remote: Compressing objects: 63% (1694/2688)
remote: Compressing objects: 64% (1721/2688)
remote: Compressing objects: 65% (1748/2688)
remote: Compressing objects: 66% (1775/2688)
remote: Compressing objects: 67% (1801/2688)
remote: Compressing objects: 68% (1828/2688)
remote: Compressing objects: 69% (1855/2688)
remote: Compressing objects: 70% (1882/2688)
remote: Compressing objects: 71% (1909/2688)
remote: Compressing objects: 72% (1936/2688)
remote: Compressing objects: 73% (1963/2688)
remote: Compressing objects: 74% (1990/2688)
remote: Compressing objects: 75% (2016/2688)
remote: Compressing objects: 76% (2043/2688)
remote: Compressing objects: 77% (2070/2688)
remote: Compressing objects: 78% (2097/2688)
remote: Compressing objects: 79% (2124/2688)
remote: Compressing objects: 80% (2151/2688)
remote: Compressing objects: 81% (2178/2688)
remote: Compressing objects: 82% (2205/2688)
remote: Compressing objects: 83% (2232/2688)
remote: Compressing objects: 84% (2258/2688)
remote: Compressing objects: 85% (2285/2688)
remote: Compressing objects: 86% (2312/2688)
remote: Compressing objects: 87% (2339/2688)
remote: Compressing objects: 88% (2366/2688)
remote: Compressing objects: 89% (2393/2688)
remote: Compressing objects: 90% (2420/2688)
remote: Compressing objects: 91% (2447/2688)
remote: Compressing objects: 92% (2473/2688)
remote: Compressing objects: 93% (2500/2688)
remote: Compressing objects: 94% (2527/2688)
remote: Compressing objects: 95% (2554/2688)
remote: Compressing objects: 96% (2581/2688)
remote: Compressing objects: 97% (2608/2688)
remote: Compressing objects: 98% (2635/2688)
remote: Compressing objects: 99% (2662/2688)
remote: Compressing objects: 100% (2688/2688)
remote: Compressing objects: 100% (2688/2688), done.
8.04 s
Receiving objects: 0% (1/81968)
Receiving objects: 1% (820/81968)
Receiving objects: 2% (1640/81968)
Receiving objects: 3% (2460/81968)
Receiving objects: 4% (3279/81968)
Receiving objects: 5% (4099/81968)
Receiving objects: 6% (4919/81968), 9.11 MiB | 18.20 MiB/s
Receiving objects: 7% (5738/81968), 9.11 MiB | 18.20 MiB/s
Receiving objects: 8% (6558/81968), 9.11 MiB | 18.20 MiB/s
Receiving objects: 9% (7378/81968), 9.11 MiB | 18.20 MiB/s
Receiving objects: 10% (8197/81968), 9.11 MiB | 18.20 MiB/s
Receiving objects: 10% (8796/81968), 9.11 MiB | 18.20 MiB/s
Receiving objects: 11% (9017/81968), 18.39 MiB | 18.38 MiB/s
Receiving objects: 12% (9837/81968), 18.39 MiB | 18.38 MiB/s
Receiving objects: 13% (10656/81968), 18.39 MiB | 18.38 MiB/s
Receiving objects: 14% (11476/81968), 18.39 MiB | 18.38 MiB/s
Receiving objects: 15% (12296/81968), 18.39 MiB | 18.38 MiB/s
Receiving objects: 16% (13115/81968), 18.39 MiB | 18.38 MiB/s
Receiving objects: 17% (13935/81968), 18.39 MiB | 18.38 MiB/s
Receiving objects: 18% (14755/81968), 18.39 MiB | 18.38 MiB/s
Receiving objects: 19% (15574/81968), 18.39 MiB | 18.38 MiB/s
Receiving objects: 20% (16394/81968), 18.39 MiB | 18.38 MiB/s
Receiving objects: 21% (17214/81968), 18.39 MiB | 18.38 MiB/s
Receiving objects: 22% (18033/81968), 18.39 MiB | 18.38 MiB/s
Receiving objects: 23% (18853/81968), 18.39 MiB | 18.38 MiB/s
Receiving objects: 24% (19673/81968), 18.39 MiB | 18.38 MiB/s
Receiving objects: 25% (20492/81968), 18.39 MiB | 18.38 MiB/s
Receiving objects: 26% (21312/81968), 18.39 MiB | 18.38 MiB/s
Receiving objects: 27% (22132/81968), 18.39 MiB | 18.38 MiB/s
Receiving objects: 28% (22952/81968), 18.39 MiB | 18.38 MiB/s
Receiving objects: 29% (23771/81968), 18.39 MiB | 18.38 MiB/s
Receiving objects: 30% (24591/81968), 18.39 MiB | 18.38 MiB/s
Receiving objects: 31% (25411/81968), 18.39 MiB | 18.38 MiB/s
Receiving objects: 32% (26230/81968), 18.39 MiB | 18.38 MiB/s
Receiving objects: 33% (27050/81968), 18.39 MiB | 18.38 MiB/s
Receiving objects: 34% (27870/81968), 18.39 MiB | 18.38 MiB/s
Receiving objects: 35% (28689/81968), 18.39 MiB | 18.38 MiB/s
Receiving objects: 36% (29509/81968), 18.39 MiB | 18.38 MiB/s
Receiving objects: 37% (30329/81968), 18.39 MiB | 18.38 MiB/s
Receiving objects: 38% (31148/81968), 18.39 MiB | 18.38 MiB/s
Receiving objects: 39% (31968/81968), 18.39 MiB | 18.38 MiB/s
Receiving objects: 40% (32788/81968), 18.39 MiB | 18.38 MiB/s
Receiving objects: 41% (33607/81968), 18.39 MiB | 18.38 MiB/s
Receiving objects: 42% (34427/81968), 18.39 MiB | 18.38 MiB/s
Receiving objects: 43% (35247/81968), 36.15 MiB | 24.10 MiB/s
Receiving objects: 44% (36066/81968), 36.15 MiB | 24.10 MiB/s
Receiving objects: 45% (36886/81968), 36.15 MiB | 24.10 MiB/s
Receiving objects: 46% (37706/81968), 36.15 MiB | 24.10 MiB/s
Receiving objects: 47% (38525/81968), 36.15 MiB | 24.10 MiB/s
Receiving objects: 48% (39345/81968), 36.15 MiB | 24.10 MiB/s
Receiving objects: 49% (40165/81968), 36.15 MiB | 24.10 MiB/s
Receiving objects: 50% (40984/81968), 36.15 MiB | 24.10 MiB/s
Receiving objects: 51% (41804/81968), 36.15 MiB | 24.10 MiB/s
Receiving objects: 52% (42624/81968), 36.15 MiB | 24.10 MiB/s
Receiving objects: 53% (43444/81968), 36.15 MiB | 24.10 MiB/s
Receiving objects: 54% (44263/81968), 36.15 MiB | 24.10 MiB/s
Receiving objects: 55% (45083/81968), 36.15 MiB | 24.10 MiB/s
Receiving objects: 56% (45903/81968), 36.15 MiB | 24.10 MiB/s
Receiving objects: 56% (46712/81968), 36.15 MiB | 24.10 MiB/s
Receiving objects: 57% (46722/81968), 36.15 MiB | 24.10 MiB/s
Receiving objects: 58% (47542/81968), 59.10 MiB | 29.55 MiB/s
Receiving objects: 59% (48362/81968), 59.10 MiB | 29.55 MiB/s
Receiving objects: 60% (49181/81968), 59.10 MiB | 29.55 MiB/s
Receiving objects: 61% (50001/81968), 59.10 MiB | 29.55 MiB/s
Receiving objects: 62% (50821/81968), 59.10 MiB | 29.55 MiB/s
Receiving objects: 63% (51640/81968), 59.10 MiB | 29.55 MiB/s
Receiving objects: 64% (52460/81968), 75.76 MiB | 30.27 MiB/s
Receiving objects: 65% (53280/81968), 75.76 MiB | 30.27 MiB/s
Receiving objects: 66% (54099/81968), 75.76 MiB | 30.27 MiB/s
Receiving objects: 67% (54919/81968), 75.76 MiB | 30.27 MiB/s
Receiving objects: 68% (55739/81968), 75.76 MiB | 30.27 MiB/s
Receiving objects: 69% (56558/81968), 75.76 MiB | 30.27 MiB/s
Receiving objects: 70% (57378/81968), 75.76 MiB | 30.27 MiB/s
Receiving objects: 71% (58198/81968), 75.76 MiB | 30.27 MiB/s
Receiving objects: 72% (59017/81968), 75.76 MiB | 30.27 MiB/s
Receiving objects: 73% (59837/81968), 75.76 MiB | 30.27 MiB/s
Receiving objects: 74% (60657/81968), 75.76 MiB | 30.27 MiB/s
Receiving objects: 74% (61291/81968), 75.76 MiB | 30.27 MiB/s
Receiving objects: 75% (61476/81968), 75.76 MiB | 30.27 MiB/s
Receiving objects: 76% (62296/81968), 92.92 MiB | 30.94 MiB/s
Receiving objects: 77% (63116/81968), 92.92 MiB | 30.94 MiB/s
Receiving objects: 78% (63936/81968), 108.72 MiB | 31.04 MiB/s
Receiving objects: 79% (64755/81968), 108.72 MiB | 31.04 MiB/s
Receiving objects: 80% (65575/81968), 108.72 MiB | 31.04 MiB/s
Receiving objects: 81% (66395/81968), 108.72 MiB | 31.04 MiB/s
Receiving objects: 82% (67214/81968), 108.72 MiB | 31.04 MiB/s
Receiving objects: 83% (68034/81968), 108.72 MiB | 31.04 MiB/s
Receiving objects: 84% (68854/81968), 108.72 MiB | 31.04 MiB/s
Receiving objects: 85% (69673/81968), 108.72 MiB | 31.04 MiB/s
Receiving objects: 86% (70493/81968), 108.72 MiB | 31.04 MiB/s
Receiving objects: 87% (71313/81968), 108.72 MiB | 31.04 MiB/s
Receiving objects: 88% (72132/81968), 108.72 MiB | 31.04 MiB/s
Receiving objects: 89% (72952/81968), 108.72 MiB | 31.04 MiB/s
Receiving objects: 90% (73772/81968), 108.72 MiB | 31.04 MiB/s
Receiving objects: 91% (74591/81968), 108.72 MiB | 31.04 MiB/s
Receiving objects: 92% (75411/81968), 108.72 MiB | 31.04 MiB/s
Receiving objects: 93% (76231/81968), 108.72 MiB | 31.04 MiB/s
Receiving objects: 94% (77050/81968), 108.72 MiB | 31.04 MiB/s
Receiving objects: 95% (77870/81968), 108.72 MiB | 31.04 MiB/s
Receiving objects: 96% (78690/81968), 108.72 MiB | 31.04 MiB/s
Receiving objects: 97% (79509/81968), 108.72 MiB | 31.04 MiB/s
Receiving objects: 97% (80282/81968), 124.40 MiB | 31.07 MiB/s
Receiving objects: 98% (80329/81968), 124.40 MiB | 31.07 MiB/s
Receiving objects: 99% (81149/81968), 124.40 MiB | 31.07 MiB/s
remote: Total 81968 (delta 8849), reused 9369 (delta 7961), pack-reused 70525 (from 2)
8.04 s
Receiving objects: 100% (81968/81968), 124.40 MiB | 31.07 MiB/s
Receiving objects: 100% (81968/81968), 127.88 MiB | 30.81 MiB/s, done.
10.74 s
Resolving deltas: 0% (0/55449)
Resolving deltas: 1% (555/55449)
Resolving deltas: 2% (1109/55449)
Resolving deltas: 3% (1664/55449)
Resolving deltas: 4% (2218/55449)
Resolving deltas: 5% (2773/55449)
Resolving deltas: 6% (3327/55449)
Resolving deltas: 7% (3882/55449)
Resolving deltas: 8% (4437/55449)
Resolving deltas: 9% (4991/55449)
Resolving deltas: 10% (5545/55449)
Resolving deltas: 11% (6100/55449)
Resolving deltas: 12% (6654/55449)
Resolving deltas: 13% (7209/55449)
Resolving deltas: 14% (7763/55449)
Resolving deltas: 15% (8318/55449)
Resolving deltas: 16% (8872/55449)
Resolving deltas: 17% (9427/55449)
Resolving deltas: 18% (9981/55449)
Resolving deltas: 19% (10536/55449)
Resolving deltas: 20% (11090/55449)
Resolving deltas: 21% (11645/55449)
Resolving deltas: 22% (12199/55449)
Resolving deltas: 23% (12755/55449)
Resolving deltas: 24% (13308/55449)
Resolving deltas: 25% (13863/55449)
Resolving deltas: 26% (14417/55449)
Resolving deltas: 27% (14973/55449)
Resolving deltas: 28% (15526/55449)
Resolving deltas: 29% (16081/55449)
Resolving deltas: 30% (16635/55449)
Resolving deltas: 31% (17190/55449)
Resolving deltas: 32% (17744/55449)
Resolving deltas: 33% (18299/55449)
Resolving deltas: 34% (18853/55449)
Resolving deltas: 35% (19408/55449)
Resolving deltas: 36% (19962/55449)
Resolving deltas: 37% (20517/55449)
Resolving deltas: 38% (21071/55449)
Resolving deltas: 39% (21626/55449)
Resolving deltas: 40% (22180/55449)
Resolving deltas: 41% (22735/55449)
Resolving deltas: 42% (23289/55449)
Resolving deltas: 43% (23844/55449)
Resolving deltas: 44% (24398/55449)
Resolving deltas: 45% (24953/55449)
Resolving deltas: 46% (25508/55449)
Resolving deltas: 47% (26062/55449)
Resolving deltas: 48% (26616/55449)
Resolving deltas: 49% (27171/55449)
Resolving deltas: 50% (27725/55449)
Resolving deltas: 51% (28279/55449)
Resolving deltas: 52% (28834/55449)
Resolving deltas: 53% (29388/55449)
Resolving deltas: 54% (29943/55449)
Resolving deltas: 54% (30037/55449)
Resolving deltas: 55% (30497/55449)
Resolving deltas: 56% (31052/55449)
Resolving deltas: 57% (31607/55449)
Resolving deltas: 58% (32161/55449)
Resolving deltas: 59% (32715/55449)
Resolving deltas: 60% (33270/55449)
Resolving deltas: 61% (33824/55449)
Resolving deltas: 62% (34379/55449)
Resolving deltas: 63% (34933/55449)
Resolving deltas: 64% (35488/55449)
Resolving deltas: 65% (36042/55449)
Resolving deltas: 66% (36597/55449)
Resolving deltas: 67% (37151/55449)
Resolving deltas: 68% (37706/55449)
Resolving deltas: 69% (38260/55449)
Resolving deltas: 70% (38815/55449)
Resolving deltas: 71% (39369/55449)
Resolving deltas: 72% (39924/55449)
Resolving deltas: 73% (40478/55449)
Resolving deltas: 74% (41033/55449)
Resolving deltas: 75% (41587/55449)
Resolving deltas: 76% (42142/55449)
Resolving deltas: 76% (42667/55449)
Resolving deltas: 77% (42698/55449)
Resolving deltas: 78% (43256/55449)
Resolving deltas: 79% (43805/55449)
Resolving deltas: 80% (44360/55449)
Resolving deltas: 81% (44914/55449)
Resolving deltas: 82% (45469/55449)
Resolving deltas: 83% (46023/55449)
Resolving deltas: 84% (46578/55449)
Resolving deltas: 85% (47132/55449)
Resolving deltas: 86% (47687/55449)
Resolving deltas: 87% (48243/55449)
Resolving deltas: 88% (48796/55449)
Resolving deltas: 89% (49350/55449)
Resolving deltas: 90% (49905/55449)
Resolving deltas: 91% (50459/55449)
Resolving deltas: 92% (51014/55449)
Resolving deltas: 93% (51568/55449)
Resolving deltas: 94% (52123/55449)
Resolving deltas: 95% (52677/55449)
Resolving deltas: 96% (53232/55449)
Resolving deltas: 97% (53786/55449)
Resolving deltas: 98% (54341/55449)
Resolving deltas: 99% (54895/55449)
Resolving deltas: 100% (55449/55449)
Resolving deltas: 100% (55449/55449), done.
11.68 s
Fetching commit fa2d9d2083fe1953b21188de3880a12b97bc6ef4 for codex/vakint-integral-dimension ...
11.68 s
$ /nix/store/bcnisk3ydfgv26v2gw3zlky24g00yww2-git-2.54.0/bin/git fetch origin fa2d9d2083fe1953b21188de3880a12b97bc6ef4
12.32 s
From https://github.com/alphal00p/gammaloop
12.32 s
* branch fa2d9d2083fe1953b21188de3880a12b97bc6ef4 -> FETCH_HEAD
12.35 s
$ /nix/store/9ypz3flqsrl5xl495mm8h645gadjsxi1-coreutils-9.11/bin/timeout --kill-after=15s 7200s /nix/store/bcnisk3ydfgv26v2gw3zlky24g00yww2-git-2.54.0/bin/git -c advice.detachedHead=false checkout fa2d9d2083fe1953b21188de3880a12b97bc6ef4
12.67 s
HEAD is now at fa2d9d208 add configurable integral dimension to vakint
12.69 s
$ /nix/store/9ypz3flqsrl5xl495mm8h645gadjsxi1-coreutils-9.11/bin/timeout --kill-after=15s 7200s /nix/store/23zk8sgzamrbmj1fday15szf7f2279s8-nix-2.34.7/bin/nix --extra-experimental-features nix-command --extra-experimental-features flakes --log-format internal-json run .#packages.x86_64-linux.nix-ci-check-gammaloop-nextest-vakint --print-build-logs
18.00 s
23.67 s
evaluating derivation 'g
copying '/nix/store/2cmy
evaluating derivation 'g
[0 /1 built]
[1 /0 /1 built]
[1 /0 /1 built] building g gammaloop-nextest-vakint> Extracting 10 binaries, 1 build script output directory, and 1 linked path to /build/nextest-archive-zZk2GF
24.85 s
gammaloop-nextest-vakint> Extracted 16 files to /build/nextest-archive-zZk2GF in 1.18s
24.92 s
gammaloop-nextest-vakint> ------------
24.92 s
gammaloop-nextest-vakint> Nextest run ID dc57a5f3-7c9b-4b60-bc1d-6d37fb780ad8 with nextest profile: ci_gammaloop
24.92 s
gammaloop-nextest-vakint> Starting 81 tests across 10 binaries
34.19 s
gammaloop-nextest-vakint> FAIL [ 0.108s] (33/81) vakint::integral_dimension_tests pysecdec_launcher_drains_stderr_and_reuses_matching_dimension
34.19 s
gammaloop-nextest-vakint> stdout ---
34.19 s
gammaloop-nextest-vakint>
34.19 s
gammaloop-nextest-vakint> running 1 test
34.19 s
gammaloop-nextest-vakint> test pysecdec_launcher_drains_stderr_and_reuses_matching_dimension ... FAILED
34.19 s
gammaloop-nextest-vakint>
34.19 s
gammaloop-nextest-vakint> failures:
34.19 s
gammaloop-nextest-vakint>
34.19 s
gammaloop-nextest-vakint> failures:
34.19 s
gammaloop-nextest-vakint> pysecdec_launcher_drains_stderr_and_reuses_matching_dimension
34.19 s
gammaloop-nextest-vakint>
34.19 s
gammaloop-nextest-vakint> test result: FAILED. 0 passed; 1 failed; 0 ignored; 0 measured; 6 filtered out; finished in 0.10s
34.19 s
gammaloop-nextest-vakint>
34.19 s
gammaloop-nextest-vakint> stderr ---
34.19 s
gammaloop-nextest-vakint> [WARN vakint] User-specified directory '/build/vakint_launcher_stderr_320_3' not found, and was instead created and pySecDec sources will be regenerated.
34.19 s
gammaloop-nextest-vakint> [INFO vakint] Running PySecDec with command: cd "/build/vakint_launcher_stderr_320_3" && "python3" "run.py"
34.19 s
gammaloop-nextest-vakint> [INFO vakint] You can follow the run live with 'tail -f follow_run.txt' in that temporary directory
34.19 s
gammaloop-nextest-vakint> [INFO vakint] Temporary run directory: /build/vakint_launcher_stderr_320_3
34.19 s
gammaloop-nextest-vakint>
34.19 s
gammaloop-nextest-vakint> thread 'pysecdec_launcher_drains_stderr_and_reuses_matching_dimension' (321) panicked at crates/vakint/tests/integral_dimension_tests.rs:290:18:
34.19 s
gammaloop-nextest-vakint> called `Result::unwrap()` on an `Err` value: IoError(Os { code: 2, kind: NotFound, message: "No such file or directory" })
34.19 s
gammaloop-nextest-vakint> stack backtrace:
34.19 s
gammaloop-nextest-vakint> 0: __rustc::rust_begin_unwind
34.19 s
gammaloop-nextest-vakint> 1: core::panicking::panic_fmt
34.19 s
gammaloop-nextest-vakint> 2: core::result::unwrap_failed
34.19 s
gammaloop-nextest-vakint> 3: <integral_dimension_tests::pysecdec_launcher_drains_stderr_and_reuses_matching_dimension::{closure#0} as core::ops::function::FnOnce<()>>::call_once
34.19 s
gammaloop-nextest-vakint> note: Some details are omitted, run with `RUST_BACKTRACE=full` for a verbose backtrace.
34.19 s
gammaloop-nextest-vakint>
44.11 s
gammaloop-nextest-vakint> ------------
44.11 s
gammaloop-nextest-vakint> Summary [ 19.194s] 81 tests run: 80 passed , 1 failed , 0 skipped
44.11 s
gammaloop-nextest-vakint> FAIL [ 0.108s] (33/81) vakint::integral_dimension_tests pysecdec_launcher_drains_stderr_and_reuses_matching_dimension
44.11 s
gammaloop-nextest-vakint> stdout ---
44.11 s
gammaloop-nextest-vakint>
44.11 s
gammaloop-nextest-vakint> running 1 test
44.11 s
gammaloop-nextest-vakint> test pysecdec_launcher_drains_stderr_and_reuses_matching_dimension ... FAILED
44.11 s
gammaloop-nextest-vakint>
44.11 s
gammaloop-nextest-vakint> failures:
44.11 s
gammaloop-nextest-vakint>
44.11 s
gammaloop-nextest-vakint> failures:
44.11 s
gammaloop-nextest-vakint> pysecdec_launcher_drains_stderr_and_reuses_matching_dimension
44.11 s
gammaloop-nextest-vakint>
44.11 s
gammaloop-nextest-vakint> test result: FAILED. 0 passed; 1 failed; 0 ignored; 0 measured; 6 filtered out; finished in 0.10s
44.11 s
gammaloop-nextest-vakint>
44.11 s
gammaloop-nextest-vakint> stderr ---
44.11 s
gammaloop-nextest-vakint> [WARN vakint] User-specified directory '/build/vakint_launcher_stderr_320_3' not found, and was instead created and pySecDec sources will be regenerated.
44.11 s
gammaloop-nextest-vakint> [INFO vakint] Running PySecDec with command: cd "/build/vakint_launcher_stderr_320_3" && "python3" "run.py"
44.11 s
gammaloop-nextest-vakint> [INFO vakint] You can follow the run live with 'tail -f follow_run.txt' in that temporary directory
44.11 s
gammaloop-nextest-vakint> [INFO vakint] Temporary run directory: /build/vakint_launcher_stderr_320_3
44.11 s
gammaloop-nextest-vakint>
44.11 s
gammaloop-nextest-vakint> thread 'pysecdec_launcher_drains_stderr_and_reuses_matching_dimension' (321) panicked at crates/vakint/tests/integral_dimension_tests.rs:290:18:
44.11 s
gammaloop-nextest-vakint> called `Result::unwrap()` on an `Err` value: IoError(Os { code: 2, kind: NotFound, message: "No such file or directory" })
44.11 s
gammaloop-nextest-vakint> stack backtrace:
44.11 s
gammaloop-nextest-vakint> 0: __rustc::rust_begin_unwind
44.11 s
gammaloop-nextest-vakint> 1: core::panicking::panic_fmt
44.11 s
gammaloop-nextest-vakint> 2: core::result::unwrap_failed
44.11 s
gammaloop-nextest-vakint> 3: <integral_dimension_tests::pysecdec_launcher_drains_stderr_and_reuses_matching_dimension::{closure#0} as core::ops::function::FnOnce<()>>::call_once
44.11 s
gammaloop-nextest-vakint> note: Some details are omitted, run with `RUST_BACKTRACE=full` for a verbose backtrace.
44.11 s
gammaloop-nextest-vakint>
44.19 s
gammaloop-nextest-vakint> error : test run failed
44.22 s
gammaloop-nextest-vakint>
44.22 s
gammaloop-nextest-vakint> ========== nextest test summary ==========
44.22 s
gammaloop-nextest-vakint> report: target/nextest/ci_gammaloop/junit.xml
44.22 s
gammaloop-nextest-vakint> tests: 81, failures: 1, errors: 0
44.22 s
gammaloop-nextest-vakint>
44.22 s
gammaloop-nextest-vakint> 1. vakint::integral_dimension_tests::pysecdec_launcher_drains_stderr_and_reuses_matching_dimension
44.22 s
gammaloop-nextest-vakint> failure: test failure with exit code 101
44.22 s
gammaloop-nextest-vakint> thread 'pysecdec_launcher_drains_stderr_and_reuses_matching_dimension' (321) panicked at crates/vakint/tests/integral_dimension_tests.rs:290:18:
44.22 s
gammaloop-nextest-vakint> called `Result::unwrap()` on an `Err` value: IoError(Os { code: 2, kind: NotFound, message: "No such file or directory" })
44.22 s
gammaloop-nextest-vakint> stack backtrace:
44.22 s
gammaloop-nextest-vakint> 0: __rustc::rust_begin_unwind
44.22 s
gammaloop-nextest-vakint> 1: core::panicking::panic_fmt
44.22 s
gammaloop-nextest-vakint> 2: core::result::unwrap_failed
44.22 s
gammaloop-nextest-vakint> 3: <integral_dimension_tests::pysecdec_launcher_drains_stderr_and_reuses_matching_dimension::{closure#0} as core::ops::function::FnOnce<()>>::call_once
44.22 s
gammaloop-nextest-vakint> note: Some details are omitted, run with `RUST_BACKTRACE=full` for a verbose backtrace.
44.22 s
gammaloop-nextest-vakint> system-out
44.22 s
gammaloop-nextest-vakint> running 1 test
44.22 s
gammaloop-nextest-vakint> test pysecdec_launcher_drains_stderr_and_reuses_matching_dimension ... FAILED
44.22 s
gammaloop-nextest-vakint>
44.22 s
gammaloop-nextest-vakint> failures:
44.22 s
gammaloop-nextest-vakint>
44.22 s
gammaloop-nextest-vakint> failures:
44.22 s
gammaloop-nextest-vakint> pysecdec_launcher_drains_stderr_and_reuses_matching_dimension
44.22 s
gammaloop-nextest-vakint>
44.22 s
gammaloop-nextest-vakint> test result: FAILED. 0 passed; 1 failed; 0 ignored; 0 measured; 6 filtered out; finished in 0.10s
44.22 s
gammaloop-nextest-vakint> system-err
44.22 s
gammaloop-nextest-vakint> [WARN vakint] User-specified directory '/build/vakint_launcher_stderr_320_3' not found, and was instead created and pySecDec sources will be regenerated.
44.22 s
gammaloop-nextest-vakint> [INFO vakint] Running PySecDec with command: cd "/build/vakint_launcher_stderr_320_3" && "python3" "run.py"
44.22 s
gammaloop-nextest-vakint> [INFO vakint] You can follow the run live with 'tail -f follow_run.txt' in that temporary directory
44.22 s
gammaloop-nextest-vakint> [INFO vakint] Temporary run directory: /build/vakint_launcher_stderr_320_3
44.22 s
gammaloop-nextest-vakint>
44.22 s
gammaloop-nextest-vakint> thread 'pysecdec_launcher_drains_stderr_and_reuses_matching_dimension' (321) panicked at crates/vakint/tests/integral_dimension_tests.rs:290:18:
44.22 s
gammaloop-nextest-vakint> called `Result::unwrap()` on an `Err` value: IoError(Os { code: 2, kind: NotFound, message: "No such file or directory" })
44.22 s
gammaloop-nextest-vakint> stack backtrace:
44.22 s
gammaloop-nextest-vakint> 0: __rustc::rust_begin_unwind
44.22 s
gammaloop-nextest-vakint> 1: core::panicking::panic_fmt
44.22 s
gammaloop-nextest-vakint> 2: core::result::unwrap_failed
44.22 s
gammaloop-nextest-vakint> 3: <integral_dimension_tests::pysecdec_launcher_drains_stderr_and_reuses_matching_dimension::{closure#0} as core::ops::function::FnOnce<()>>::call_once
44.22 s
gammaloop-nextest-vakint> note: Some details are omitted, run with `RUST_BACKTRACE=full` for a verbose backtrace.
44.22 s
gammaloop-nextest-vakint> =========================================
44.26 s
error: Cannot build '/nix/store/4nw3lywmcm5yps0pcdbklnagin353i05-gammaloop-nextest-vakint.drv '.
44.26 s
Reason: builder failed with exit code 100 .
44.26 s
Output paths:
44.26 s
/nix/store/bfjjgwyb08s8nfp92r95zpam0rfddh18-gammaloop-nextest-vakint
44.26 s
Last 104 log lines:
44.26 s
> Extracting 10 binaries, 1 build script output directory, and 1 linked path to /build/nextest-archive-zZk2GF
44.26 s
> Extracted 16 files to /build/nextest-archive-zZk2GF in 1.18s
44.26 s
> ------------
44.26 s
> Nextest run ID dc57a5f3-7c9b-4b60-bc1d-6d37fb780ad8 with nextest profile: ci_gammaloop
44.26 s
> Starting 81 tests across 10 binaries
44.26 s
> FAIL [ 0.108s] (33/81) vakint::integral_dimension_tests pysecdec_launcher_drains_stderr_and_reuses_matching_dimension
44.26 s
> stdout ---
44.26 s
>
44.26 s
> running 1 test
44.26 s
> test pysecdec_launcher_drains_stderr_and_reuses_matching_dimension ... FAILED
44.26 s
>
44.26 s
> failures:
44.26 s
>
44.26 s
> failures:
44.26 s
> pysecdec_launcher_drains_stderr_and_reuses_matching_dimension
44.26 s
>
44.26 s
> test result: FAILED. 0 passed; 1 failed; 0 ignored; 0 measured; 6 filtered out; finished in 0.10s
44.26 s
>
44.26 s
> stderr ---
44.26 s
> [WARN vakint] User-specified directory '/build/vakint_launcher_stderr_320_3' not found, and was instead created and pySecDec sources will be regenerated.
44.26 s
> [INFO vakint] Running PySecDec with command: cd "/build/vakint_launcher_stderr_320_3" && "python3" "run.py"
44.26 s
> [INFO vakint] You can follow the run live with 'tail -f follow_run.txt' in that temporary directory
44.26 s
> [INFO vakint] Temporary run directory: /build/vakint_launcher_stderr_320_3
44.26 s
>
44.26 s
> thread 'pysecdec_launcher_drains_stderr_and_reuses_matching_dimension' (321) panicked at crates/vakint/tests/integral_dimension_tests.rs:290:18:
44.26 s
> called `Result::unwrap()` on an `Err` value: IoError(Os { code: 2, kind: NotFound, message: "No such file or directory" })
44.26 s
> stack backtrace:
44.26 s
> 0: __rustc::rust_begin_unwind
44.26 s
> 1: core::panicking::panic_fmt
44.26 s
> 2: core::result::unwrap_failed
44.26 s
> 3: <integral_dimension_tests::pysecdec_launcher_drains_stderr_and_reuses_matching_dimension::{closure#0} as core::ops::function::FnOnce<()>>::call_once
44.26 s
> note: Some details are omitted, run with `RUST_BACKTRACE=full` for a verbose backtrace.
44.26 s
>
44.26 s
> ------------
44.26 s
> Summary [ 19.194s] 81 tests run: 80 passed , 1 failed , 0 skipped
44.26 s
> FAIL [ 0.108s] (33/81) vakint::integral_dimension_tests pysecdec_launcher_drains_stderr_and_reuses_matching_dimension
44.26 s
> stdout ---
44.26 s
>
44.26 s
> running 1 test
44.26 s
> test pysecdec_launcher_drains_stderr_and_reuses_matching_dimension ... FAILED
44.26 s
>
44.26 s
> failures:
44.26 s
>
44.26 s
> failures:
44.26 s
> pysecdec_launcher_drains_stderr_and_reuses_matching_dimension
44.26 s
>
44.26 s
> test result: FAILED. 0 passed; 1 failed; 0 ignored; 0 measured; 6 filtered out; finished in 0.10s
44.26 s
>
44.26 s
> stderr ---
44.26 s
> [WARN vakint] User-specified directory '/build/vakint_launcher_stderr_320_3' not found, and was instead created and pySecDec sources will be regenerated.
44.26 s
> [INFO vakint] Running PySecDec with command: cd "/build/vakint_launcher_stderr_320_3" && "python3" "run.py"
44.26 s
> [INFO vakint] You can follow the run live with 'tail -f follow_run.txt' in that temporary directory
44.26 s
> [INFO vakint] Temporary run directory: /build/vakint_launcher_stderr_320_3
44.26 s
>
44.26 s
> thread 'pysecdec_launcher_drains_stderr_and_reuses_matching_dimension' (321) panicked at crates/vakint/tests/integral_dimension_tests.rs:290:18:
44.26 s
> called `Result::unwrap()` on an `Err` value: IoError(Os { code: 2, kind: NotFound, message: "No such file or directory" })
44.26 s
> stack backtrace:
44.26 s
> 0: __rustc::rust_begin_unwind
44.26 s
> 1: core::panicking::panic_fmt
44.26 s
> 2: core::result::unwrap_failed
44.26 s
> 3: <integral_dimension_tests::pysecdec_launcher_drains_stderr_and_reuses_matching_dimension::{closure#0} as core::ops::function::FnOnce<()>>::call_once
44.26 s
> note: Some details are omitted, run with `RUST_BACKTRACE=full` for a verbose backtrace.
44.26 s
>
44.26 s
> error : test run failed
44.26 s
>
44.26 s
> ========== nextest test summary ==========
44.26 s
> report: target/nextest/ci_gammaloop/junit.xml
44.26 s
> tests: 81, failures: 1, errors: 0
44.26 s
>
44.26 s
> 1. vakint::integral_dimension_tests::pysecdec_launcher_drains_stderr_and_reuses_matching_dimension
44.26 s
> failure: test failure with exit code 101
44.26 s
> thread 'pysecdec_launcher_drains_stderr_and_reuses_matching_dimension' (321) panicked at crates/vakint/tests/integral_dimension_tests.rs:290:18:
44.26 s
> called `Result::unwrap()` on an `Err` value: IoError(Os { code: 2, kind: NotFound, message: "No such file or directory" })
44.26 s
> stack backtrace:
44.26 s
> 0: __rustc::rust_begin_unwind
44.26 s
> 1: core::panicking::panic_fmt
44.26 s
> 2: core::result::unwrap_failed
44.26 s
> 3: <integral_dimension_tests::pysecdec_launcher_drains_stderr_and_reuses_matching_dimension::{closure#0} as core::ops::function::FnOnce<()>>::call_once
44.26 s
> note: Some details are omitted, run with `RUST_BACKTRACE=full` for a verbose backtrace.
44.26 s
> system-out
44.26 s
> running 1 test
44.26 s
> test pysecdec_launcher_drains_stderr_and_reuses_matching_dimension ... FAILED
44.26 s
>
44.26 s
> failures:
44.26 s
>
44.26 s
> failures:
44.26 s
> pysecdec_launcher_drains_stderr_and_reuses_matching_dimension
44.26 s
>
44.26 s
> test result: FAILED. 0 passed; 1 failed; 0 ignored; 0 measured; 6 filtered out; finished in 0.10s
44.26 s
> system-err
44.26 s
> [WARN vakint] User-specified directory '/build/vakint_launcher_stderr_320_3' not found, and was instead created and pySecDec sources will be regenerated.
44.26 s
> [INFO vakint] Running PySecDec with command: cd "/build/vakint_launcher_stderr_320_3" && "python3" "run.py"
44.26 s
> [INFO vakint] You can follow the run live with 'tail -f follow_run.txt' in that temporary directory
44.26 s
> [INFO vakint] Temporary run directory: /build/vakint_launcher_stderr_320_3
44.26 s
>
44.26 s
> thread 'pysecdec_launcher_drains_stderr_and_reuses_matching_dimension' (321) panicked at crates/vakint/tests/integral_dimension_tests.rs:290:18:
44.26 s
> called `Result::unwrap()` on an `Err` value: IoError(Os { code: 2, kind: NotFound, message: "No such file or directory" })
44.26 s
> stack backtrace:
44.26 s
> 0: __rustc::rust_begin_unwind
44.26 s
> 1: core::panicking::panic_fmt
44.26 s
> 2: core::result::unwrap_failed
44.26 s
> 3: <integral_dimension_tests::pysecdec_launcher_drains_stderr_and_reuses_matching_dimension::{closure#0} as core::ops::function::FnOnce<()>>::call_once
44.26 s
> note: Some details are omitted, run with `RUST_BACKTRACE=full` for a verbose backtrace.
44.26 s
> =========================================
44.26 s
For full logs, run:
44.26 s
nix log /nix/store/4nw3lywmcm5yps0pcdbklnagin353i05-gammaloop-nextest-vakint.drv
44.40 s
[0 built (1 failed )]Run failed.