test packages.x86_64-linux.nix-ci-check-gammaloop-nextest-vakint

Reproduce this run
Retry Run
  1. 0.00 s $ /nix/store/9ypz3flqsrl5xl495mm8h645gadjsxi1-coreutils-9.11/bin/timeout --kill-after=15s 7200s /nix/store/23zk8sgzamrbmj1fday15szf7f2279s8-nix-2.34.7/bin/nix --extra-experimental-features nix-command --extra-experimental-features flakes flake clone git+https://github.com/alphal00p/gammaloop --dest /tmp/nix-ci-worker/stable-pwd/repo/
  2. 0.10 s Cloning into '/tmp/nix-ci-worker/stable-pwd/repo'...
  3. 0.94 s remote: Enumerating objects: 81968, done.
  4. 1.05 s remote: Counting objects: 0% (1/11485) remote: Counting objects: 1% (115/11485) remote: Counting objects: 2% (230/11485) remote: Counting objects: 3% (345/11485) remote: Counting objects: 4% (460/11485) remote: Counting objects: 5% (575/11485) remote: Counting objects: 6% (690/11485) remote: Counting objects: 7% (804/11485) remote: Counting objects: 8% (919/11485) remote: Counting objects: 9% (1034/11485) remote: Counting objects: 10% (1149/11485) remote: Counting objects: 11% (1264/11485) remote: Counting objects: 12% (1379/11485) remote: Counting objects: 13% (1494/11485) remote: Counting objects: 14% (1608/11485) remote: Counting objects: 15% (1723/11485) remote: Counting objects: 16% (1838/11485) remote: Counting objects: 17% (1953/11485) remote: Counting objects: 18% (2068/11485) remote: Counting objects: 19% (2183/11485) remote: Counting objects: 20% (2297/11485) remote: Counting objects: 21% (2412/11485) remote: Counting objects: 22% (2527/11485) remote: Counting objects: 23% (2642/11485) remote: Counting objects: 24% (2757/11485) remote: Counting objects: 25% (2872/11485) remote: Counting objects: 26% (2987/11485) remote: Counting objects: 27% (3101/11485) remote: Counting objects: 28% (3216/11485) remote: Counting objects: 29% (3331/11485) remote: Counting objects: 30% (3446/11485) remote: Counting objects: 31% (3561/11485) remote: Counting objects: 32% (3676/11485) remote: Counting objects: 33% (3791/11485) remote: Counting objects: 34% (3905/11485) remote: Counting objects: 35% (4020/11485) remote: Counting objects: 36% (4135/11485) remote: Counting objects: 37% (4250/11485) remote: Counting objects: 38% (4365/11485) remote: Counting objects: 39% (4480/11485) remote: Counting objects: 40% (4594/11485) remote: Counting objects: 41% (4709/11485) remote: Counting objects: 42% (4824/11485) remote: Counting objects: 43% (4939/11485) remote: Counting objects: 44% (5054/11485) remote: Counting objects: 45% (5169/11485) remote: Counting objects: 46% (5284/11485) remote: Counting objects: 47% (5398/11485) remote: Counting objects: 48% (5513/11485) remote: Counting objects: 49% (5628/11485) remote: Counting objects: 50% (5743/11485) remote: Counting objects: 51% (5858/11485) remote: Counting objects: 52% (5973/11485) remote: Counting objects: 53% (6088/11485) remote: Counting objects: 54% (6202/11485) remote: Counting objects: 55% (6317/11485) remote: Counting objects: 56% (6432/11485) remote: Counting objects: 57% (6547/11485) remote: Counting objects: 58% (6662/11485) remote: Counting objects: 59% (6777/11485) remote: Counting objects: 60% (6891/11485) remote: Counting objects: 61% (7006/11485) remote: Counting objects: 62% (7121/11485) remote: Counting objects: 63% (7236/11485) remote: Counting objects: 64% (7351/11485) remote: Counting objects: 65% (7466/11485) remote: Counting objects: 66% (7581/11485) remote: Counting objects: 67% (7695/11485) remote: Counting objects: 68% (7810/11485) remote: Counting objects: 69% (7925/11485) remote: Counting objects: 70% (8040/11485) remote: Counting objects: 71% (8155/11485) remote: Counting objects: 72% (8270/11485) remote: Counting objects: 73% (8385/11485) remote: Counting objects: 74% (8499/11485) remote: Counting objects: 75% (8614/11485) remote: Counting objects: 76% (8729/11485) remote: Counting objects: 77% (8844/11485) remote: Counting objects: 78% (8959/11485) remote: Counting objects: 79% (9074/11485) remote: Counting objects: 80% (9188/11485) remote: Counting objects: 81% (9303/11485) remote: Counting objects: 82% (9418/11485) remote: Counting objects: 83% (9533/11485) remote: Counting objects: 84% (9648/11485) remote: Counting objects: 85% (9763/11485) remote: Counting objects: 86% (9878/11485) remote: Counting objects: 87% (9992/11485) remote: Counting objects: 88% (10107/11485) remote: Counting objects: 89% (10222/11485) remote: Counting objects: 90% (10337/11485) remote: Counting objects: 91% (10452/11485) remote: Counting objects: 92% (10567/11485) remote: Counting objects: 93% (10682/11485) remote: Counting objects: 94% (10796/11485) remote: Counting objects: 95% (10911/11485) remote: Counting objects: 96% (11026/11485) remote: Counting objects: 97% (11141/11485) remote: Counting objects: 98% (11256/11485) remote: Counting objects: 99% (11371/11485) remote: Counting objects: 100% (11485/11485) remote: Counting objects: 100% (11485/11485), done.
  5. 3.53 s remote: Compressing objects: 0% (1/2690) remote: Compressing objects: 1% (27/2690) remote: Compressing objects: 2% (54/2690) remote: Compressing objects: 3% (81/2690) remote: Compressing objects: 4% (108/2690) remote: Compressing objects: 5% (135/2690) remote: Compressing objects: 6% (162/2690) remote: Compressing objects: 7% (189/2690) remote: Compressing objects: 8% (216/2690) remote: Compressing objects: 9% (243/2690) remote: Compressing objects: 10% (269/2690) remote: Compressing objects: 11% (296/2690) remote: Compressing objects: 12% (323/2690) remote: Compressing objects: 13% (350/2690) remote: Compressing objects: 14% (377/2690) remote: Compressing objects: 15% (404/2690) remote: Compressing objects: 16% (431/2690) remote: Compressing objects: 17% (458/2690) remote: Compressing objects: 18% (485/2690) remote: Compressing objects: 19% (512/2690) remote: Compressing objects: 20% (538/2690) remote: Compressing objects: 20% (549/2690) remote: Compressing objects: 21% (565/2690) remote: Compressing objects: 22% (592/2690) remote: Compressing objects: 23% (619/2690) remote: Compressing objects: 24% (646/2690) remote: Compressing objects: 25% (673/2690) remote: Compressing objects: 26% (700/2690) remote: Compressing objects: 26% (726/2690) remote: Compressing objects: 27% (727/2690) remote: Compressing objects: 28% (754/2690) remote: Compressing objects: 29% (781/2690) remote: Compressing objects: 30% (807/2690) remote: Compressing objects: 31% (834/2690) remote: Compressing objects: 32% (861/2690) remote: Compressing objects: 33% (888/2690) remote: Compressing objects: 34% (915/2690) remote: Compressing objects: 35% (942/2690) remote: Compressing objects: 36% (969/2690) remote: Compressing objects: 37% (996/2690) remote: Compressing objects: 38% (1023/2690) remote: Compressing objects: 39% (1050/2690) remote: Compressing objects: 40% (1076/2690) remote: Compressing objects: 41% (1103/2690) remote: Compressing objects: 42% (1130/2690) remote: Compressing objects: 43% (1157/2690) remote: Compressing objects: 44% (1184/2690) remote: Compressing objects: 45% (1211/2690) remote: Compressing objects: 46% (1238/2690) remote: Compressing objects: 47% (1265/2690) remote: Compressing objects: 48% (1292/2690) remote: Compressing objects: 49% (1319/2690) remote: Compressing objects: 50% (1345/2690) remote: Compressing objects: 51% (1372/2690) remote: Compressing objects: 52% (1399/2690) remote: Compressing objects: 53% (1426/2690) remote: Compressing objects: 54% (1453/2690) remote: Compressing objects: 55% (1480/2690) remote: Compressing objects: 56% (1507/2690) remote: Compressing objects: 57% (1534/2690) remote: Compressing objects: 58% (1561/2690) remote: Compressing objects: 59% (1588/2690) remote: Compressing objects: 60% (1614/2690) remote: Compressing objects: 61% (1641/2690) remote: Compressing objects: 62% (1668/2690) remote: Compressing objects: 63% (1695/2690) remote: Compressing objects: 64% (1722/2690) remote: Compressing objects: 65% (1749/2690) remote: Compressing objects: 66% (1776/2690) remote: Compressing objects: 67% (1803/2690) remote: Compressing objects: 68% (1830/2690) remote: Compressing objects: 69% (1857/2690) remote: Compressing objects: 70% (1883/2690) remote: Compressing objects: 71% (1910/2690) remote: Compressing objects: 72% (1937/2690) remote: Compressing objects: 73% (1964/2690) remote: Compressing objects: 74% (1991/2690) remote: Compressing objects: 75% (2018/2690) remote: Compressing objects: 76% (2045/2690) remote: Compressing objects: 77% (2072/2690) remote: Compressing objects: 78% (2099/2690) remote: Compressing objects: 79% (2126/2690) remote: Compressing objects: 80% (2152/2690) remote: Compressing objects: 81% (2179/2690) remote: Compressing objects: 82% (2206/2690) remote: Compressing objects: 83% (2233/2690) remote: Compressing objects: 84% (2260/2690) remote: Compressing objects: 85% (2287/2690) remote: Compressing objects: 86% (2314/2690) remote: Compressing objects: 87% (2341/2690) remote: Compressing objects: 88% (2368/2690) remote: Compressing objects: 89% (2395/2690) remote: Compressing objects: 90% (2421/2690) remote: Compressing objects: 91% (2448/2690) remote: Compressing objects: 92% (2475/2690) remote: Compressing objects: 93% (2502/2690) remote: Compressing objects: 94% (2529/2690) remote: Compressing objects: 95% (2556/2690) remote: Compressing objects: 96% (2583/2690) remote: Compressing objects: 97% (2610/2690) remote: Compressing objects: 98% (2637/2690) remote: Compressing objects: 99% (2664/2690) remote: Compressing objects: 100% (2690/2690) remote: Compressing objects: 100% (2690/2690), done.
  6. 8.00 s Receiving objects: 0% (1/81968) Receiving objects: 1% (820/81968) Receiving objects: 2% (1640/81968) Receiving objects: 3% (2460/81968) Receiving objects: 4% (3279/81968), 7.54 MiB | 15.07 MiB/s Receiving objects: 5% (4099/81968), 7.54 MiB | 15.07 MiB/s Receiving objects: 6% (4919/81968), 7.54 MiB | 15.07 MiB/s Receiving objects: 7% (5738/81968), 7.54 MiB | 15.07 MiB/s Receiving objects: 8% (6558/81968), 7.54 MiB | 15.07 MiB/s Receiving objects: 8% (7342/81968), 7.54 MiB | 15.07 MiB/s Receiving objects: 9% (7378/81968), 7.54 MiB | 15.07 MiB/s Receiving objects: 10% (8197/81968), 17.41 MiB | 17.40 MiB/s Receiving objects: 11% (9017/81968), 17.41 MiB | 17.40 MiB/s Receiving objects: 12% (9837/81968), 17.41 MiB | 17.40 MiB/s Receiving objects: 13% (10656/81968), 17.41 MiB | 17.40 MiB/s Receiving objects: 14% (11476/81968), 17.41 MiB | 17.40 MiB/s Receiving objects: 15% (12296/81968), 17.41 MiB | 17.40 MiB/s Receiving objects: 16% (13115/81968), 17.41 MiB | 17.40 MiB/s Receiving objects: 17% (13935/81968), 17.41 MiB | 17.40 MiB/s Receiving objects: 18% (14755/81968), 17.41 MiB | 17.40 MiB/s Receiving objects: 19% (15574/81968), 17.41 MiB | 17.40 MiB/s Receiving objects: 20% (16394/81968), 17.41 MiB | 17.40 MiB/s Receiving objects: 21% (17214/81968), 17.41 MiB | 17.40 MiB/s Receiving objects: 22% (18033/81968), 17.41 MiB | 17.40 MiB/s Receiving objects: 23% (18853/81968), 17.41 MiB | 17.40 MiB/s Receiving objects: 24% (19673/81968), 17.41 MiB | 17.40 MiB/s Receiving objects: 25% (20492/81968), 17.41 MiB | 17.40 MiB/s Receiving objects: 26% (21312/81968), 17.41 MiB | 17.40 MiB/s Receiving objects: 27% (22132/81968), 17.41 MiB | 17.40 MiB/s Receiving objects: 28% (22952/81968), 17.41 MiB | 17.40 MiB/s Receiving objects: 29% (23771/81968), 17.41 MiB | 17.40 MiB/s Receiving objects: 30% (24591/81968), 17.41 MiB | 17.40 MiB/s Receiving objects: 31% (25411/81968), 17.41 MiB | 17.40 MiB/s Receiving objects: 32% (26230/81968), 17.41 MiB | 17.40 MiB/s Receiving objects: 33% (27050/81968), 17.41 MiB | 17.40 MiB/s Receiving objects: 34% (27870/81968), 17.41 MiB | 17.40 MiB/s Receiving objects: 35% (28689/81968), 17.41 MiB | 17.40 MiB/s Receiving objects: 36% (29509/81968), 17.41 MiB | 17.40 MiB/s Receiving objects: 37% (30329/81968), 17.41 MiB | 17.40 MiB/s Receiving objects: 38% (31148/81968), 17.41 MiB | 17.40 MiB/s Receiving objects: 39% (31968/81968), 17.41 MiB | 17.40 MiB/s Receiving objects: 40% (32788/81968), 17.41 MiB | 17.40 MiB/s Receiving objects: 41% (33607/81968), 17.41 MiB | 17.40 MiB/s Receiving objects: 42% (34427/81968), 17.41 MiB | 17.40 MiB/s Receiving objects: 43% (35247/81968), 17.41 MiB | 17.40 MiB/s Receiving objects: 44% (36066/81968), 17.41 MiB | 17.40 MiB/s Receiving objects: 45% (36886/81968), 38.65 MiB | 25.76 MiB/s Receiving objects: 46% (37706/81968), 38.65 MiB | 25.76 MiB/s Receiving objects: 47% (38525/81968), 38.65 MiB | 25.76 MiB/s Receiving objects: 48% (39345/81968), 38.65 MiB | 25.76 MiB/s Receiving objects: 49% (40165/81968), 38.65 MiB | 25.76 MiB/s Receiving objects: 50% (40984/81968), 38.65 MiB | 25.76 MiB/s Receiving objects: 51% (41804/81968), 38.65 MiB | 25.76 MiB/s Receiving objects: 52% (42624/81968), 38.65 MiB | 25.76 MiB/s Receiving objects: 53% (43444/81968), 38.65 MiB | 25.76 MiB/s Receiving objects: 54% (44263/81968), 38.65 MiB | 25.76 MiB/s Receiving objects: 55% (45083/81968), 38.65 MiB | 25.76 MiB/s Receiving objects: 56% (45903/81968), 38.65 MiB | 25.76 MiB/s Receiving objects: 56% (46212/81968), 38.65 MiB | 25.76 MiB/s Receiving objects: 57% (46722/81968), 55.00 MiB | 27.50 MiB/s Receiving objects: 58% (47542/81968), 55.00 MiB | 27.50 MiB/s Receiving objects: 59% (48362/81968), 55.00 MiB | 27.50 MiB/s Receiving objects: 60% (49181/81968), 55.00 MiB | 27.50 MiB/s Receiving objects: 61% (50001/81968), 55.00 MiB | 27.50 MiB/s Receiving objects: 62% (50821/81968), 70.56 MiB | 28.22 MiB/s Receiving objects: 63% (51640/81968), 70.56 MiB | 28.22 MiB/s Receiving objects: 64% (52460/81968), 70.56 MiB | 28.22 MiB/s Receiving objects: 65% (53280/81968), 70.56 MiB | 28.22 MiB/s Receiving objects: 66% (54099/81968), 70.56 MiB | 28.22 MiB/s Receiving objects: 67% (54919/81968), 70.56 MiB | 28.22 MiB/s Receiving objects: 68% (55739/81968), 70.56 MiB | 28.22 MiB/s Receiving objects: 69% (56558/81968), 70.56 MiB | 28.22 MiB/s Receiving objects: 70% (57378/81968), 70.56 MiB | 28.22 MiB/s Receiving objects: 70% (57504/81968), 84.24 MiB | 28.08 MiB/s Receiving objects: 71% (58198/81968), 84.24 MiB | 28.08 MiB/s Receiving objects: 72% (59017/81968), 84.24 MiB | 28.08 MiB/s Receiving objects: 73% (59837/81968), 84.24 MiB | 28.08 MiB/s Receiving objects: 74% (60657/81968), 84.24 MiB | 28.08 MiB/s Receiving objects: 75% (61476/81968), 84.24 MiB | 28.08 MiB/s Receiving objects: 76% (62296/81968), 84.24 MiB | 28.08 MiB/s Receiving objects: 77% (63116/81968), 98.57 MiB | 28.16 MiB/s Receiving objects: 78% (63936/81968), 98.57 MiB | 28.16 MiB/s Receiving objects: 79% (64755/81968), 98.57 MiB | 28.16 MiB/s Receiving objects: 80% (65575/81968), 98.57 MiB | 28.16 MiB/s Receiving objects: 81% (66395/81968), 98.57 MiB | 28.16 MiB/s Receiving objects: 82% (67214/81968), 98.57 MiB | 28.16 MiB/s Receiving objects: 83% (68034/81968), 98.57 MiB | 28.16 MiB/s Receiving objects: 83% (68215/81968), 113.39 MiB | 28.34 MiB/s Receiving objects: 84% (68854/81968), 113.39 MiB | 28.34 MiB/s Receiving objects: 85% (69673/81968), 113.39 MiB | 28.34 MiB/s Receiving objects: 86% (70493/81968), 113.39 MiB | 28.34 MiB/s Receiving objects: 87% (71313/81968), 113.39 MiB | 28.34 MiB/s Receiving objects: 88% (72132/81968), 113.39 MiB | 28.34 MiB/s Receiving objects: 89% (72952/81968), 113.39 MiB | 28.34 MiB/s Receiving objects: 90% (73772/81968), 113.39 MiB | 28.34 MiB/s Receiving objects: 91% (74591/81968), 113.39 MiB | 28.34 MiB/s Receiving objects: 92% (75411/81968), 113.39 MiB | 28.34 MiB/s Receiving objects: 93% (76231/81968), 113.39 MiB | 28.34 MiB/s Receiving objects: 94% (77050/81968), 113.39 MiB | 28.34 MiB/s Receiving objects: 95% (77870/81968), 113.39 MiB | 28.34 MiB/s Receiving objects: 96% (78690/81968), 113.39 MiB | 28.34 MiB/s Receiving objects: 97% (79509/81968), 113.39 MiB | 28.34 MiB/s Receiving objects: 98% (80329/81968), 113.39 MiB | 28.34 MiB/s Receiving objects: 99% (81149/81968), 113.39 MiB | 28.34 MiB/s remote: Total 81968 (delta 8891), reused 9409 (delta 8001), pack-reused 70483 (from 2)
  7. 8.01 s Receiving objects: 100% (81968/81968), 113.39 MiB | 28.34 MiB/s Receiving objects: 100% (81968/81968), 127.88 MiB | 28.57 MiB/s, done.
  8. 9.43 s Resolving deltas: 0% (0/55449) Resolving deltas: 1% (556/55449) Resolving deltas: 2% (1109/55449) Resolving deltas: 3% (1664/55449) Resolving deltas: 4% (2218/55449) Resolving deltas: 5% (2773/55449) Resolving deltas: 6% (3327/55449) Resolving deltas: 7% (3882/55449) Resolving deltas: 8% (4441/55449) Resolving deltas: 9% (4991/55449) Resolving deltas: 10% (5545/55449) Resolving deltas: 11% (6100/55449) Resolving deltas: 12% (6654/55449) Resolving deltas: 13% (7209/55449) Resolving deltas: 14% (7763/55449) Resolving deltas: 15% (8318/55449) Resolving deltas: 16% (8872/55449) Resolving deltas: 17% (9428/55449) Resolving deltas: 18% (9981/55449) Resolving deltas: 19% (10536/55449) Resolving deltas: 20% (11090/55449) Resolving deltas: 21% (11645/55449) Resolving deltas: 22% (12199/55449) Resolving deltas: 23% (12754/55449) Resolving deltas: 24% (13308/55449) Resolving deltas: 25% (13863/55449) Resolving deltas: 26% (14417/55449) Resolving deltas: 27% (14972/55449) Resolving deltas: 28% (15526/55449) Resolving deltas: 29% (16081/55449) Resolving deltas: 30% (16635/55449) Resolving deltas: 31% (17190/55449) Resolving deltas: 32% (17744/55449) Resolving deltas: 33% (18299/55449) Resolving deltas: 34% (18853/55449) Resolving deltas: 35% (19408/55449) Resolving deltas: 36% (19962/55449) Resolving deltas: 37% (20517/55449) Resolving deltas: 38% (21071/55449) Resolving deltas: 39% (21627/55449) Resolving deltas: 40% (22180/55449) Resolving deltas: 41% (22736/55449) Resolving deltas: 42% (23289/55449) Resolving deltas: 43% (23844/55449) Resolving deltas: 44% (24398/55449) Resolving deltas: 45% (24953/55449) Resolving deltas: 46% (25508/55449) Resolving deltas: 47% (26062/55449) Resolving deltas: 48% (26616/55449) Resolving deltas: 49% (27172/55449) Resolving deltas: 50% (27725/55449) Resolving deltas: 51% (28279/55449) Resolving deltas: 52% (28835/55449) Resolving deltas: 53% (29388/55449) Resolving deltas: 54% (29943/55449) Resolving deltas: 55% (30497/55449) Resolving deltas: 56% (31052/55449) Resolving deltas: 57% (31606/55449) Resolving deltas: 58% (32163/55449) Resolving deltas: 59% (32715/55449) Resolving deltas: 60% (33270/55449) Resolving deltas: 61% (33825/55449) Resolving deltas: 62% (34379/55449) Resolving deltas: 63% (34933/55449) Resolving deltas: 64% (35488/55449) Resolving deltas: 65% (36042/55449) Resolving deltas: 66% (36597/55449) Resolving deltas: 67% (37152/55449) Resolving deltas: 68% (37706/55449) Resolving deltas: 69% (38264/55449) Resolving deltas: 70% (38817/55449) Resolving deltas: 71% (39369/55449) Resolving deltas: 72% (39924/55449) Resolving deltas: 73% (40478/55449) Resolving deltas: 74% (41033/55449) Resolving deltas: 74% (41084/55449) Resolving deltas: 75% (41587/55449) Resolving deltas: 76% (42142/55449) Resolving deltas: 77% (42698/55449) Resolving deltas: 78% (43251/55449) Resolving deltas: 79% (43805/55449) Resolving deltas: 80% (44360/55449) Resolving deltas: 81% (44914/55449) Resolving deltas: 82% (45469/55449) Resolving deltas: 83% (46023/55449) Resolving deltas: 84% (46578/55449) Resolving deltas: 85% (47132/55449) Resolving deltas: 86% (47688/55449) Resolving deltas: 87% (48241/55449) Resolving deltas: 88% (48796/55449) Resolving deltas: 89% (49350/55449) Resolving deltas: 90% (49905/55449) Resolving deltas: 91% (50459/55449) Resolving deltas: 92% (51014/55449) Resolving deltas: 93% (51570/55449) Resolving deltas: 94% (52126/55449) Resolving deltas: 95% (52677/55449) Resolving deltas: 96% (53233/55449) Resolving deltas: 97% (53786/55449) Resolving deltas: 98% (54341/55449) Resolving deltas: 99% (54895/55449) Resolving deltas: 100% (55449/55449) Resolving deltas: 100% (55449/55449), done.
  9. 10.08 s Fetching commit fa2d9d2083fe1953b21188de3880a12b97bc6ef4 for codex/vakint-integral-dimension ...
  10. 10.08 s $ /nix/store/bcnisk3ydfgv26v2gw3zlky24g00yww2-git-2.54.0/bin/git fetch origin fa2d9d2083fe1953b21188de3880a12b97bc6ef4
  11. 10.61 s From https://github.com/alphal00p/gammaloop
  12. 10.61 s * branch fa2d9d2083fe1953b21188de3880a12b97bc6ef4 -> FETCH_HEAD
  13. 10.63 s $ /nix/store/9ypz3flqsrl5xl495mm8h645gadjsxi1-coreutils-9.11/bin/timeout --kill-after=15s 7200s /nix/store/bcnisk3ydfgv26v2gw3zlky24g00yww2-git-2.54.0/bin/git -c advice.detachedHead=false checkout fa2d9d2083fe1953b21188de3880a12b97bc6ef4
  14. 10.89 s HEAD is now at fa2d9d208 add configurable integral dimension to vakint
  15. 10.89 s $ /nix/store/9ypz3flqsrl5xl495mm8h645gadjsxi1-coreutils-9.11/bin/timeout --kill-after=15s 7200s /nix/store/23zk8sgzamrbmj1fday15szf7f2279s8-nix-2.34.7/bin/nix --extra-experimental-features nix-command --extra-experimental-features flakes --log-format internal-json run .#packages.x86_64-linux.nix-ci-check-gammaloop-nextest-vakint --print-build-logs
  16. 11.32 s
  17. 11.32 s Downloading cached source from https://cache.nix-ci.com
  18. 17.13 s Downloaded cached source (199.4 MiB) in 5.8s
  19. 17.14 s Progress: 1 of 1 downloaded from cache
  20. 27.13 s
  21. 27.14 s Downloading cached gammaloop-nextest-binaries-vakint-vakint from https://cache.nix-ci.com
  22. 27.15 s Downloading cached xgcc-15.2.0-libgcc from https://cache.nix-ci.com
  23. 27.15 s Downloading cached busybox from https://cache.nix-ci.com
  24. 27.15 s Downloading cached gcc-15.2.0-libgcc from https://cache.nix-ci.com
  25. 27.15 s Downloading cached libunistring from https://cache.nix-ci.com
  26. 27.15 s Downloading cached publicsuffix-list-0-unstable-2026-05 from https://cache.nix-ci.com
  27. 27.23 s Downloaded cached xgcc-15.2.0-libgcc (193 KiB) in 87ms
  28. 27.23 s Progress: 0 of 1 built, 1 of 68 downloaded from cache (5 downloading)
  29. 27.24 s Downloaded cached busybox (230 KiB) in 93ms
  30. 27.24 s Progress: 0 of 1 built, 2 of 68 downloaded from cache (4 downloading)
  31. 27.24 s Downloaded cached gcc-15.2.0-libgcc (193 KiB) in 93ms
  32. 27.24 s Progress: 0 of 1 built, 3 of 68 downloaded from cache (3 downloading)
  33. 27.24 s Downloaded cached publicsuffix-list-0-unstable-2026-05 (329 KiB) in 92ms
  34. 27.24 s Progress: 0 of 1 built, 4 of 68 downloaded from cache (2 downloading)
  35. 27.39 s Downloaded cached libunistring (2 MiB) in 242ms
  36. 27.39 s Progress: 0 of 1 built, 5 of 68 downloaded from cache (1 downloading)
  37. 27.39 s Downloading cached libidn2 from https://cache.nix-ci.com
  38. 27.39 s Downloaded cached libidn2 in 0ms
  39. 27.39 s Progress: 0 of 1 built, 6 of 68 downloaded from cache (1 downloading)
  40. 27.39 s Downloading cached glibc-2.42 from https://cache.nix-ci.com
  41. 28.46 s Downloaded cached glibc-2.42 (33.5 MiB) in 1.0s
  42. 28.46 s Progress: 0 of 1 built, 7 of 68 downloaded from cache (1 downloading)
  43. 28.47 s Downloading cached attr from https://cache.nix-ci.com
  44. 28.47 s Downloading cached aws-c-common from https://cache.nix-ci.com
  45. 28.47 s Downloaded cached attr in 0ms
  46. 28.47 s Downloading cached bash from https://cache.nix-ci.com
  47. 28.47 s Downloaded cached aws-c-common in 0ms
  48. 28.47 s Downloaded cached bash in 0ms
  49. 28.47 s Downloading cached brotli-1.2.0-lib from https://cache.nix-ci.com
  50. 28.47 s Downloading cached bzip2 from https://cache.nix-ci.com
  51. 28.47 s Downloaded cached brotli-1.2.0-lib in 0ms
  52. 28.47 s Downloaded cached bzip2 in 0ms
  53. 28.47 s Downloading cached editline-1.17.1-unstable-2025-05 from https://cache.nix-ci.com
  54. 28.47 s Downloading cached gcc-15.2.0-lib from https://cache.nix-ci.com
  55. 28.47 s Downloaded cached editline-1.17.1-unstable-2025-05 in 0ms
  56. 28.47 s Downloading cached hwloc-2.14.0-lib from https://cache.nix-ci.com
  57. 28.47 s Downloading cached keyutils-1.6.3-lib from https://cache.nix-ci.com
  58. 28.47 s Downloaded cached keyutils-1.6.3-lib in 0ms
  59. 28.47 s Downloading cached libcpuid from https://cache.nix-ci.com
  60. 28.47 s Downloaded cached libcpuid in 0ms
  61. 28.47 s Downloading cached libpsl from https://cache.nix-ci.com
  62. 28.47 s Downloaded cached libpsl in 0ms
  63. 28.47 s Downloading cached libseccomp-2.6.0-lib from https://cache.nix-ci.com
  64. 28.47 s Downloaded cached hwloc-2.14.0-lib in 0ms
  65. 28.47 s Downloaded cached libseccomp-2.6.0-lib in 0ms
  66. 28.47 s Downloading cached libsodium-1.0.22-unstable-2026-04 from https://cache.nix-ci.com
  67. 28.47 s Downloaded cached libsodium-1.0.22-unstable-2026-04 in 0ms
  68. 28.47 s Downloading cached libxml2 from https://cache.nix-ci.com
  69. 28.47 s Downloaded cached libxml2 in 0ms
  70. 28.47 s Downloading cached llhttp from https://cache.nix-ci.com
  71. 28.47 s Downloaded cached llhttp in 0ms
  72. 28.47 s Progress: 0 of 1 built, 8 of 68 downloaded from cache (15 downloading)
  73. 28.47 s Progress: 0 of 1 built, 9 of 68 downloaded from cache (14 downloading)
  74. 28.47 s Progress: 0 of 1 built, 10 of 68 downloaded from cache (13 downloading)
  75. 28.47 s Progress: 0 of 1 built, 11 of 68 downloaded from cache (12 downloading)
  76. 28.47 s Progress: 0 of 1 built, 12 of 68 downloaded from cache (11 downloading)
  77. 28.47 s Progress: 0 of 1 built, 13 of 68 downloaded from cache (10 downloading)
  78. 28.47 s Progress: 0 of 1 built, 14 of 68 downloaded from cache (9 downloading)
  79. 28.47 s Progress: 0 of 1 built, 15 of 68 downloaded from cache (8 downloading)
  80. 28.47 s Progress: 0 of 1 built, 16 of 68 downloaded from cache (7 downloading)
  81. 28.47 s Progress: 0 of 1 built, 17 of 68 downloaded from cache (6 downloading)
  82. 28.47 s Progress: 0 of 1 built, 18 of 68 downloaded from cache (5 downloading)
  83. 28.47 s Progress: 0 of 1 built, 19 of 68 downloaded from cache (4 downloading)
  84. 28.47 s Progress: 0 of 1 built, 20 of 68 downloaded from cache (3 downloading)
  85. 28.47 s Downloading cached lowdown-3.0.1-lib from https://cache.nix-ci.com
  86. 28.47 s Downloaded cached lowdown-3.0.1-lib in 0ms
  87. 28.47 s Downloading cached nghttp2-1.69.0-lib from https://cache.nix-ci.com
  88. 28.47 s Downloading cached nghttp3 from https://cache.nix-ci.com
  89. 28.47 s Downloaded cached nghttp2-1.69.0-lib in 0ms
  90. 28.47 s Downloaded cached nghttp3 in 0ms
  91. 28.47 s Downloading cached openssl from https://cache.nix-ci.com
  92. 28.47 s Downloading cached pcre2 from https://cache.nix-ci.com
  93. 28.47 s Downloaded cached pcre2 in 0ms
  94. 28.47 s Downloading cached xz from https://cache.nix-ci.com
  95. 28.47 s Downloaded cached xz in 0ms
  96. 28.47 s Downloading cached zlib from https://cache.nix-ci.com
  97. 28.47 s Downloaded cached zlib in 0ms
  98. 28.47 s Downloading cached acl from https://cache.nix-ci.com
  99. 28.47 s Downloaded cached acl in 0ms
  100. 28.47 s Downloading cached aws-c-compression from https://cache.nix-ci.com
  101. 28.47 s Downloaded cached aws-c-compression in 0ms
  102. 28.47 s Downloading cached aws-c-sdkutils from https://cache.nix-ci.com
  103. 28.47 s Downloaded cached aws-c-sdkutils in 0ms
  104. 28.47 s Downloading cached aws-checksums from https://cache.nix-ci.com
  105. 28.47 s Downloaded cached aws-checksums in 0ms
  106. 28.47 s Progress: 0 of 1 built, 21 of 68 downloaded from cache (13 downloading)
  107. 28.47 s Progress: 0 of 1 built, 22 of 68 downloaded from cache (12 downloading)
  108. 28.47 s Progress: 0 of 1 built, 23 of 68 downloaded from cache (11 downloading)
  109. 28.47 s Progress: 0 of 1 built, 24 of 68 downloaded from cache (10 downloading)
  110. 28.47 s Progress: 0 of 1 built, 25 of 68 downloaded from cache (9 downloading)
  111. 28.47 s Progress: 0 of 1 built, 26 of 68 downloaded from cache (8 downloading)
  112. 28.47 s Progress: 0 of 1 built, 27 of 68 downloaded from cache (7 downloading)
  113. 28.47 s Progress: 0 of 1 built, 28 of 68 downloaded from cache (6 downloading)
  114. 28.47 s Progress: 0 of 1 built, 29 of 68 downloaded from cache (5 downloading)
  115. 28.47 s Progress: 0 of 1 built, 30 of 68 downloaded from cache (4 downloading)
  116. 28.47 s Progress: 0 of 1 built, 31 of 68 downloaded from cache (4 downloading)
  117. 28.47 s Downloading cached sqlite from https://cache.nix-ci.com
  118. 29.16 s Downloaded cached gcc-15.2.0-lib (9.8 MiB) in 698ms
  119. 29.16 s Progress: 0 of 1 built, 32 of 68 downloaded from cache (3 downloading)
  120. 29.17 s Downloading cached icu4c from https://cache.nix-ci.com
  121. 29.17 s Downloading cached boehm-gc from https://cache.nix-ci.com
  122. 29.17 s Downloading cached onetbb from https://cache.nix-ci.com
  123. 29.17 s Downloaded cached boehm-gc in 0ms
  124. 29.17 s Downloaded cached onetbb in 0ms
  125. 29.17 s Progress: 0 of 1 built, 33 of 68 downloaded from cache (6 downloading)
  126. 29.17 s Downloading cached zstd from https://cache.nix-ci.com
  127. 29.17 s Downloaded cached zstd in 0ms
  128. 29.17 s Progress: 0 of 1 built, 34 of 68 downloaded from cache (5 downloading)
  129. 29.17 s Progress: 0 of 1 built, 35 of 68 downloaded from cache (5 downloading)
  130. 29.17 s Downloading cached libblake3 from https://cache.nix-ci.com
  131. 29.38 s Downloaded cached sqlite (5.7 MiB) in 909ms
  132. 29.38 s Progress: 0 of 1 built, 36 of 68 downloaded from cache (4 downloading)
  133. 29.38 s Downloaded cached libblake3 (117 KiB) in 213ms
  134. 29.38 s Progress: 0 of 1 built, 37 of 68 downloaded from cache (3 downloading)
  135. 29.61 s Downloaded cached openssl (8.9 MiB) in 1.1s
  136. 29.61 s Progress: 0 of 1 built, 38 of 68 downloaded from cache (2 downloading)
  137. 29.61 s Downloading cached aws-c-cal from https://cache.nix-ci.com
  138. 29.61 s Downloading cached krb5-1.22.2-lib from https://cache.nix-ci.com
  139. 29.61 s Downloading cached libarchive-3.8.8-lib from https://cache.nix-ci.com
  140. 29.61 s Downloaded cached aws-c-cal in 0ms
  141. 29.61 s Downloaded cached libarchive-3.8.8-lib in 0ms
  142. 29.61 s Downloading cached libssh2 from https://cache.nix-ci.com
  143. 29.61 s Downloaded cached libssh2 in 0ms
  144. 29.61 s Progress: 0 of 1 built, 39 of 68 downloaded from cache (7 downloading)
  145. 29.61 s Downloading cached s2n-tls from https://cache.nix-ci.com
  146. 29.61 s Downloaded cached s2n-tls in 0ms
  147. 29.61 s Progress: 0 of 1 built, 40 of 68 downloaded from cache (6 downloading)
  148. 29.61 s Downloading cached ngtcp2 from https://cache.nix-ci.com
  149. 29.61 s Downloaded cached ngtcp2 in 0ms
  150. 29.61 s Progress: 0 of 1 built, 41 of 68 downloaded from cache (5 downloading)
  151. 29.61 s Progress: 0 of 1 built, 42 of 68 downloaded from cache (5 downloading)
  152. 29.61 s Downloading cached libgit2-1.9.4-lib from https://cache.nix-ci.com
  153. 29.61 s Progress: 0 of 1 built, 43 of 68 downloaded from cache (4 downloading)
  154. 29.61 s Downloading cached aws-c-io from https://cache.nix-ci.com
  155. 29.78 s Downloaded cached aws-c-io (648 KiB) in 169ms
  156. 29.78 s Progress: 0 of 1 built, 44 of 68 downloaded from cache (4 downloading)
  157. 29.78 s Downloading cached aws-c-event-stream from https://cache.nix-ci.com
  158. 29.78 s Downloaded cached aws-c-event-stream in 0ms
  159. 29.78 s Downloading cached aws-c-http from https://cache.nix-ci.com
  160. 29.78 s Progress: 0 of 1 built, 45 of 68 downloaded from cache (5 downloading)
  161. 29.84 s Downloaded cached krb5-1.22.2-lib (2.7 MiB) in 233ms
  162. 29.84 s Progress: 0 of 1 built, 46 of 68 downloaded from cache (4 downloading)
  163. 29.84 s Downloading cached curl from https://cache.nix-ci.com
  164. 29.84 s Downloaded cached curl in 0ms
  165. 29.84 s Progress: 0 of 1 built, 47 of 68 downloaded from cache (4 downloading)
  166. 29.89 s Downloaded cached libgit2-1.9.4-lib (1.6 MiB) in 278ms
  167. 29.89 s Progress: 0 of 1 built, 48 of 68 downloaded from cache (3 downloading)
  168. 29.90 s Downloaded cached aws-c-http (641 KiB) in 124ms
  169. 29.90 s Progress: 0 of 1 built, 49 of 68 downloaded from cache (2 downloading)
  170. 29.91 s Downloading cached aws-c-auth from https://cache.nix-ci.com
  171. 29.91 s Downloading cached aws-c-mqtt from https://cache.nix-ci.com
  172. 30.04 s Downloaded cached aws-c-auth (387 KiB) in 136ms
  173. 30.04 s Progress: 0 of 1 built, 50 of 68 downloaded from cache (3 downloading)
  174. 30.04 s Downloading cached aws-c-s3 from https://cache.nix-ci.com
  175. 30.04 s Downloaded cached aws-c-s3 in 0ms
  176. 30.04 s Progress: 0 of 1 built, 51 of 68 downloaded from cache (3 downloading)
  177. 30.07 s Downloaded cached gammaloop-nextest-binaries-vakint-vakint (118.9 MiB) in 2.9s
  178. 30.07 s Progress: 0 of 1 built, 52 of 68 downloaded from cache (2 downloading)
  179. 30.07 s Downloading cached gammaloop-nextest-binaries-vakint from https://cache.nix-ci.com
  180. 30.09 s Downloaded cached aws-c-mqtt (557 KiB) in 184ms
  181. 30.09 s Progress: 0 of 1 built, 53 of 68 downloaded from cache (2 downloading)
  182. 30.09 s Downloading cached aws-crt-cpp from https://cache.nix-ci.com
  183. 30.20 s Downloaded cached gammaloop-nextest-binaries-vakint (448 B) in 123ms
  184. 30.20 s Progress: 0 of 1 built, 54 of 68 downloaded from cache (2 downloading)
  185. 30.22 s Downloaded cached aws-crt-cpp (979 KiB) in 131ms
  186. 30.22 s Progress: 0 of 1 built, 55 of 68 downloaded from cache (1 downloading)
  187. 30.96 s Downloaded cached icu4c (38.2 MiB) in 1.7s
  188. 30.96 s Progress: 0 of 1 built, 56 of 68 downloaded from cache
  189. 30.96 s Downloading cached boost from https://cache.nix-ci.com
  190. 30.96 s Downloaded cached boost in 0ms
  191. 30.96 s Progress: 0 of 1 built, 57 of 68 downloaded from cache
  192. 30.96 s Downloading cached nix-util from https://cache.nix-ci.com
  193. 30.96 s Downloaded cached nix-util in 0ms
  194. 30.96 s Progress: 0 of 1 built, 58 of 68 downloaded from cache
  195. 30.96 s Downloading cached nix-nswrapper from https://cache.nix-ci.com
  196. 30.96 s Downloaded cached nix-nswrapper in 0ms
  197. 30.96 s Downloading cached nix-store from https://cache.nix-ci.com
  198. 30.96 s Progress: 0 of 1 built, 59 of 68 downloaded from cache (1 downloading)
  199. 30.96 s Downloaded cached nix-store in 0ms
  200. 30.96 s Progress: 0 of 1 built, 60 of 68 downloaded from cache
  201. 30.96 s Downloading cached nix-fetchers from https://cache.nix-ci.com
  202. 30.96 s Downloading cached nix-main from https://cache.nix-ci.com
  203. 30.96 s Downloaded cached nix-fetchers in 0ms
  204. 30.96 s Downloaded cached nix-main in 0ms
  205. 30.96 s Progress: 0 of 1 built, 61 of 68 downloaded from cache (1 downloading)
  206. 30.97 s Progress: 0 of 1 built, 62 of 68 downloaded from cache (1 downloading)
  207. 30.97 s Downloading cached nix-expr from https://cache.nix-ci.com
  208. 30.97 s Downloaded cached nix-expr in 0ms
  209. 30.97 s Progress: 0 of 1 built, 63 of 68 downloaded from cache
  210. 30.97 s Downloading cached nix-flake from https://cache.nix-ci.com
  211. 31.09 s Downloaded cached nix-flake (956 KiB) in 128ms
  212. 31.09 s Progress: 0 of 1 built, 64 of 68 downloaded from cache
  213. 31.09 s Downloading cached nix-cmd from https://cache.nix-ci.com
  214. 31.19 s Downloaded cached nix-cmd (1 MiB) in 92ms
  215. 31.19 s Progress: 0 of 1 built, 65 of 68 downloaded from cache
  216. 31.19 s Downloading cached nix from https://cache.nix-ci.com
  217. 31.33 s Downloaded cached nix (3.9 MiB) in 142ms
  218. 31.33 s Progress: 0 of 1 built, 66 of 68 downloaded from cache
  219. 31.33 s Downloading cached nix from https://cache.nix-ci.com
  220. 31.33 s Downloaded cached nix in 0ms
  221. 31.33 s Progress: 0 of 1 built, 67 of 68 downloaded from cache
  222. 31.33 s Downloading cached nix-ci-check-gammaloop-nextest-vakint from https://cache.nix-ci.com
  223. 31.38 s Downloaded cached nix-ci-check-gammaloop-nextest-vakint (1016 B) in 48ms
  224. 31.38 s Progress: 0 of 1 built, 68 of 68 downloaded from cache
  225. 43.77 s evaluating derivation 'g copying '/nix/store/2cmy evaluating derivation 'g querying gammaloop-nexte [0.0 KiB DL] querying in [1.4 KiB DL] querying in [2.0 KiB DL] [0/12 built, 8/0/16 copi [0/10 built, 5/4/16 copi [0/10 built, 5/6/16 copi [0/10 built, 4/7/16 copi [0/10 built, 4/8/16 copi [0/9 built, 3/9/16 copie [0/9 built, 3/10/16 copi [0/9 built, 3/11/16 copi [0/8 built, 2/12/16 copi [0/6 built, 1/14/16 copi [0/5 built, 1/15/16 copi [1/0/5 built, 1/15/16 coclippy-stable-with-std (post)> Uploading to the NixCI cache: /nix/store/r4bjy93lvnfma1awpi480n2mz3af0adx-clippy-stable-with-std-2026-07-09
  226. 43.83 s clippy-stable-with-std (post)> warning: 'warn-short-path-literals' is deprecated, use 'lint-short-path-literals = ignore' instead
  227. 44.08 s clippy-stable-with-std (post)> copying 0 paths...
  228. 44.17 s clippy-stable-with-std (post)> warning: 'warn-short-path-literals' is deprecated, use 'lint-short-path-literals = ignore' instead
  229. 44.24 s clippy-stable-with-std (post)> copying 0 paths...
  230. 44.27 s [1/4 built, 16 copied (6
  231. 55.33 s [1/3 built, 16 copied (6 [1/1/2 built, 16 copied gammaloop-nextest-vakint> Extracting 10 binaries, 1 build script output directory, and 1 linked path to /build/nextest-archive-E8CjDn
  232. 56.23 s gammaloop-nextest-vakint> Extracted 16 files to /build/nextest-archive-E8CjDn in 0.91s
  233. 56.30 s gammaloop-nextest-vakint> ------------
  234. 56.30 s gammaloop-nextest-vakint> Nextest run ID 03bc6678-9cd7-433a-b1d6-74626df97cb7 with nextest profile: ci_gammaloop
  235. 56.30 s gammaloop-nextest-vakint> Starting 81 tests across 10 binaries
  236. 64.90 s gammaloop-nextest-vakint> FAIL [ 0.071s] (33/81) vakint::integral_dimension_tests pysecdec_launcher_drains_stderr_and_reuses_matching_dimension
  237. 64.90 s gammaloop-nextest-vakint> stdout ---
  238. 64.90 s gammaloop-nextest-vakint>
  239. 64.90 s gammaloop-nextest-vakint> running 1 test
  240. 64.90 s gammaloop-nextest-vakint> test pysecdec_launcher_drains_stderr_and_reuses_matching_dimension ... FAILED
  241. 64.90 s gammaloop-nextest-vakint>
  242. 64.90 s gammaloop-nextest-vakint> failures:
  243. 64.90 s gammaloop-nextest-vakint>
  244. 64.90 s gammaloop-nextest-vakint> failures:
  245. 64.90 s gammaloop-nextest-vakint> pysecdec_launcher_drains_stderr_and_reuses_matching_dimension
  246. 64.90 s gammaloop-nextest-vakint>
  247. 64.90 s gammaloop-nextest-vakint> test result: FAILED. 0 passed; 1 failed; 0 ignored; 0 measured; 6 filtered out; finished in 0.06s
  248. 64.90 s gammaloop-nextest-vakint>
  249. 64.90 s gammaloop-nextest-vakint> stderr ---
  250. 64.90 s gammaloop-nextest-vakint> [WARN vakint] User-specified directory '/build/vakint_launcher_stderr_320_3' not found, and was instead created and pySecDec sources will be regenerated.
  251. 64.90 s gammaloop-nextest-vakint> [INFO vakint] Running PySecDec with command: cd "/build/vakint_launcher_stderr_320_3" && "python3" "run.py"
  252. 64.90 s gammaloop-nextest-vakint> [INFO vakint] You can follow the run live with 'tail -f follow_run.txt' in that temporary directory
  253. 64.90 s gammaloop-nextest-vakint> [INFO vakint] Temporary run directory: /build/vakint_launcher_stderr_320_3
  254. 64.90 s gammaloop-nextest-vakint>
  255. 64.90 s gammaloop-nextest-vakint> thread 'pysecdec_launcher_drains_stderr_and_reuses_matching_dimension' (321) panicked at crates/vakint/tests/integral_dimension_tests.rs:290:18:
  256. 64.90 s gammaloop-nextest-vakint> called `Result::unwrap()` on an `Err` value: IoError(Os { code: 2, kind: NotFound, message: "No such file or directory" })
  257. 64.90 s gammaloop-nextest-vakint> stack backtrace:
  258. 64.90 s gammaloop-nextest-vakint> 0: __rustc::rust_begin_unwind
  259. 64.90 s gammaloop-nextest-vakint> 1: core::panicking::panic_fmt
  260. 64.90 s gammaloop-nextest-vakint> 2: core::result::unwrap_failed
  261. 64.90 s gammaloop-nextest-vakint> 3: <integral_dimension_tests::pysecdec_launcher_drains_stderr_and_reuses_matching_dimension::{closure#0} as core::ops::function::FnOnce<()>>::call_once
  262. 64.90 s gammaloop-nextest-vakint> note: Some details are omitted, run with `RUST_BACKTRACE=full` for a verbose backtrace.
  263. 64.90 s gammaloop-nextest-vakint>
  264. 79.68 s gammaloop-nextest-vakint> ------------
  265. 79.68 s gammaloop-nextest-vakint> Summary [ 23.378s] 81 tests run: 80 passed, 1 failed, 0 skipped
  266. 79.68 s gammaloop-nextest-vakint> FAIL [ 0.071s] (33/81) vakint::integral_dimension_tests pysecdec_launcher_drains_stderr_and_reuses_matching_dimension
  267. 79.68 s gammaloop-nextest-vakint> stdout ---
  268. 79.68 s gammaloop-nextest-vakint>
  269. 79.68 s gammaloop-nextest-vakint> running 1 test
  270. 79.68 s gammaloop-nextest-vakint> test pysecdec_launcher_drains_stderr_and_reuses_matching_dimension ... FAILED
  271. 79.68 s gammaloop-nextest-vakint>
  272. 79.68 s gammaloop-nextest-vakint> failures:
  273. 79.68 s gammaloop-nextest-vakint>
  274. 79.68 s gammaloop-nextest-vakint> failures:
  275. 79.68 s gammaloop-nextest-vakint> pysecdec_launcher_drains_stderr_and_reuses_matching_dimension
  276. 79.68 s gammaloop-nextest-vakint>
  277. 79.68 s gammaloop-nextest-vakint> test result: FAILED. 0 passed; 1 failed; 0 ignored; 0 measured; 6 filtered out; finished in 0.06s
  278. 79.68 s gammaloop-nextest-vakint>
  279. 79.68 s gammaloop-nextest-vakint> stderr ---
  280. 79.68 s gammaloop-nextest-vakint> [WARN vakint] User-specified directory '/build/vakint_launcher_stderr_320_3' not found, and was instead created and pySecDec sources will be regenerated.
  281. 79.68 s gammaloop-nextest-vakint> [INFO vakint] Running PySecDec with command: cd "/build/vakint_launcher_stderr_320_3" && "python3" "run.py"
  282. 79.68 s gammaloop-nextest-vakint> [INFO vakint] You can follow the run live with 'tail -f follow_run.txt' in that temporary directory
  283. 79.68 s gammaloop-nextest-vakint> [INFO vakint] Temporary run directory: /build/vakint_launcher_stderr_320_3
  284. 79.68 s gammaloop-nextest-vakint>
  285. 79.68 s gammaloop-nextest-vakint> thread 'pysecdec_launcher_drains_stderr_and_reuses_matching_dimension' (321) panicked at crates/vakint/tests/integral_dimension_tests.rs:290:18:
  286. 79.68 s gammaloop-nextest-vakint> called `Result::unwrap()` on an `Err` value: IoError(Os { code: 2, kind: NotFound, message: "No such file or directory" })
  287. 79.68 s gammaloop-nextest-vakint> stack backtrace:
  288. 79.68 s gammaloop-nextest-vakint> 0: __rustc::rust_begin_unwind
  289. 79.68 s gammaloop-nextest-vakint> 1: core::panicking::panic_fmt
  290. 79.68 s gammaloop-nextest-vakint> 2: core::result::unwrap_failed
  291. 79.68 s gammaloop-nextest-vakint> 3: <integral_dimension_tests::pysecdec_launcher_drains_stderr_and_reuses_matching_dimension::{closure#0} as core::ops::function::FnOnce<()>>::call_once
  292. 79.68 s gammaloop-nextest-vakint> note: Some details are omitted, run with `RUST_BACKTRACE=full` for a verbose backtrace.
  293. 79.68 s gammaloop-nextest-vakint>
  294. 79.80 s gammaloop-nextest-vakint> error: test run failed
  295. 79.84 s gammaloop-nextest-vakint>
  296. 79.84 s gammaloop-nextest-vakint> ========== nextest test summary ==========
  297. 79.84 s gammaloop-nextest-vakint> report: target/nextest/ci_gammaloop/junit.xml
  298. 79.84 s gammaloop-nextest-vakint> tests: 81, failures: 1, errors: 0
  299. 79.84 s gammaloop-nextest-vakint>
  300. 79.84 s gammaloop-nextest-vakint> 1. vakint::integral_dimension_tests::pysecdec_launcher_drains_stderr_and_reuses_matching_dimension
  301. 79.84 s gammaloop-nextest-vakint> failure: test failure with exit code 101
  302. 79.84 s gammaloop-nextest-vakint> thread 'pysecdec_launcher_drains_stderr_and_reuses_matching_dimension' (321) panicked at crates/vakint/tests/integral_dimension_tests.rs:290:18:
  303. 79.84 s gammaloop-nextest-vakint> called `Result::unwrap()` on an `Err` value: IoError(Os { code: 2, kind: NotFound, message: "No such file or directory" })
  304. 79.84 s gammaloop-nextest-vakint> stack backtrace:
  305. 79.84 s gammaloop-nextest-vakint> 0: __rustc::rust_begin_unwind
  306. 79.84 s gammaloop-nextest-vakint> 1: core::panicking::panic_fmt
  307. 79.84 s gammaloop-nextest-vakint> 2: core::result::unwrap_failed
  308. 79.84 s gammaloop-nextest-vakint> 3: <integral_dimension_tests::pysecdec_launcher_drains_stderr_and_reuses_matching_dimension::{closure#0} as core::ops::function::FnOnce<()>>::call_once
  309. 79.84 s gammaloop-nextest-vakint> note: Some details are omitted, run with `RUST_BACKTRACE=full` for a verbose backtrace.
  310. 79.84 s gammaloop-nextest-vakint> system-out
  311. 79.84 s gammaloop-nextest-vakint> running 1 test
  312. 79.84 s gammaloop-nextest-vakint> test pysecdec_launcher_drains_stderr_and_reuses_matching_dimension ... FAILED
  313. 79.84 s gammaloop-nextest-vakint>
  314. 79.84 s gammaloop-nextest-vakint> failures:
  315. 79.84 s gammaloop-nextest-vakint>
  316. 79.84 s gammaloop-nextest-vakint> failures:
  317. 79.84 s gammaloop-nextest-vakint> pysecdec_launcher_drains_stderr_and_reuses_matching_dimension
  318. 79.84 s gammaloop-nextest-vakint>
  319. 79.84 s gammaloop-nextest-vakint> test result: FAILED. 0 passed; 1 failed; 0 ignored; 0 measured; 6 filtered out; finished in 0.06s
  320. 79.84 s gammaloop-nextest-vakint> system-err
  321. 79.84 s gammaloop-nextest-vakint> [WARN vakint] User-specified directory '/build/vakint_launcher_stderr_320_3' not found, and was instead created and pySecDec sources will be regenerated.
  322. 79.84 s gammaloop-nextest-vakint> [INFO vakint] Running PySecDec with command: cd "/build/vakint_launcher_stderr_320_3" && "python3" "run.py"
  323. 79.84 s gammaloop-nextest-vakint> [INFO vakint] You can follow the run live with 'tail -f follow_run.txt' in that temporary directory
  324. 79.84 s gammaloop-nextest-vakint> [INFO vakint] Temporary run directory: /build/vakint_launcher_stderr_320_3
  325. 79.84 s gammaloop-nextest-vakint>
  326. 79.84 s gammaloop-nextest-vakint> thread 'pysecdec_launcher_drains_stderr_and_reuses_matching_dimension' (321) panicked at crates/vakint/tests/integral_dimension_tests.rs:290:18:
  327. 79.84 s gammaloop-nextest-vakint> called `Result::unwrap()` on an `Err` value: IoError(Os { code: 2, kind: NotFound, message: "No such file or directory" })
  328. 79.84 s gammaloop-nextest-vakint> stack backtrace:
  329. 79.84 s gammaloop-nextest-vakint> 0: __rustc::rust_begin_unwind
  330. 79.84 s gammaloop-nextest-vakint> 1: core::panicking::panic_fmt
  331. 79.84 s gammaloop-nextest-vakint> 2: core::result::unwrap_failed
  332. 79.84 s gammaloop-nextest-vakint> 3: <integral_dimension_tests::pysecdec_launcher_drains_stderr_and_reuses_matching_dimension::{closure#0} as core::ops::function::FnOnce<()>>::call_once
  333. 79.84 s gammaloop-nextest-vakint> note: Some details are omitted, run with `RUST_BACKTRACE=full` for a verbose backtrace.
  334. 79.84 s gammaloop-nextest-vakint> =========================================
  335. 79.91 s error: Cannot build '/nix/store/4nw3lywmcm5yps0pcdbklnagin353i05-gammaloop-nextest-vakint.drv'.
  336. 79.91 s Reason: builder failed with exit code 100.
  337. 79.91 s Output paths:
  338. 79.91 s /nix/store/bfjjgwyb08s8nfp92r95zpam0rfddh18-gammaloop-nextest-vakint
  339. 79.91 s Last 104 log lines:
  340. 79.91 s > Extracting 10 binaries, 1 build script output directory, and 1 linked path to /build/nextest-archive-E8CjDn
  341. 79.91 s > Extracted 16 files to /build/nextest-archive-E8CjDn in 0.91s
  342. 79.91 s > ------------
  343. 79.91 s > Nextest run ID 03bc6678-9cd7-433a-b1d6-74626df97cb7 with nextest profile: ci_gammaloop
  344. 79.91 s > Starting 81 tests across 10 binaries
  345. 79.91 s > FAIL [ 0.071s] (33/81) vakint::integral_dimension_tests pysecdec_launcher_drains_stderr_and_reuses_matching_dimension
  346. 79.91 s > stdout ---
  347. 79.91 s >
  348. 79.91 s > running 1 test
  349. 79.91 s > test pysecdec_launcher_drains_stderr_and_reuses_matching_dimension ... FAILED
  350. 79.91 s >
  351. 79.91 s > failures:
  352. 79.91 s >
  353. 79.91 s > failures:
  354. 79.91 s > pysecdec_launcher_drains_stderr_and_reuses_matching_dimension
  355. 79.91 s >
  356. 79.91 s > test result: FAILED. 0 passed; 1 failed; 0 ignored; 0 measured; 6 filtered out; finished in 0.06s
  357. 79.91 s >
  358. 79.91 s > stderr ---
  359. 79.91 s > [WARN vakint] User-specified directory '/build/vakint_launcher_stderr_320_3' not found, and was instead created and pySecDec sources will be regenerated.
  360. 79.91 s > [INFO vakint] Running PySecDec with command: cd "/build/vakint_launcher_stderr_320_3" && "python3" "run.py"
  361. 79.91 s > [INFO vakint] You can follow the run live with 'tail -f follow_run.txt' in that temporary directory
  362. 79.91 s > [INFO vakint] Temporary run directory: /build/vakint_launcher_stderr_320_3
  363. 79.91 s >
  364. 79.91 s > thread 'pysecdec_launcher_drains_stderr_and_reuses_matching_dimension' (321) panicked at crates/vakint/tests/integral_dimension_tests.rs:290:18:
  365. 79.91 s > called `Result::unwrap()` on an `Err` value: IoError(Os { code: 2, kind: NotFound, message: "No such file or directory" })
  366. 79.91 s > stack backtrace:
  367. 79.91 s > 0: __rustc::rust_begin_unwind
  368. 79.91 s > 1: core::panicking::panic_fmt
  369. 79.91 s > 2: core::result::unwrap_failed
  370. 79.91 s > 3: <integral_dimension_tests::pysecdec_launcher_drains_stderr_and_reuses_matching_dimension::{closure#0} as core::ops::function::FnOnce<()>>::call_once
  371. 79.91 s > note: Some details are omitted, run with `RUST_BACKTRACE=full` for a verbose backtrace.
  372. 79.91 s >
  373. 79.91 s > ------------
  374. 79.91 s > Summary [ 23.378s] 81 tests run: 80 passed, 1 failed, 0 skipped
  375. 79.91 s > FAIL [ 0.071s] (33/81) vakint::integral_dimension_tests pysecdec_launcher_drains_stderr_and_reuses_matching_dimension
  376. 79.91 s > stdout ---
  377. 79.91 s >
  378. 79.91 s > running 1 test
  379. 79.91 s > test pysecdec_launcher_drains_stderr_and_reuses_matching_dimension ... FAILED
  380. 79.91 s >
  381. 79.91 s > failures:
  382. 79.91 s >
  383. 79.91 s > failures:
  384. 79.91 s > pysecdec_launcher_drains_stderr_and_reuses_matching_dimension
  385. 79.91 s >
  386. 79.91 s > test result: FAILED. 0 passed; 1 failed; 0 ignored; 0 measured; 6 filtered out; finished in 0.06s
  387. 79.91 s >
  388. 79.91 s > stderr ---
  389. 79.91 s > [WARN vakint] User-specified directory '/build/vakint_launcher_stderr_320_3' not found, and was instead created and pySecDec sources will be regenerated.
  390. 79.91 s > [INFO vakint] Running PySecDec with command: cd "/build/vakint_launcher_stderr_320_3" && "python3" "run.py"
  391. 79.91 s > [INFO vakint] You can follow the run live with 'tail -f follow_run.txt' in that temporary directory
  392. 79.91 s > [INFO vakint] Temporary run directory: /build/vakint_launcher_stderr_320_3
  393. 79.91 s >
  394. 79.91 s > thread 'pysecdec_launcher_drains_stderr_and_reuses_matching_dimension' (321) panicked at crates/vakint/tests/integral_dimension_tests.rs:290:18:
  395. 79.91 s > called `Result::unwrap()` on an `Err` value: IoError(Os { code: 2, kind: NotFound, message: "No such file or directory" })
  396. 79.91 s > stack backtrace:
  397. 79.91 s > 0: __rustc::rust_begin_unwind
  398. 79.91 s > 1: core::panicking::panic_fmt
  399. 79.91 s > 2: core::result::unwrap_failed
  400. 79.91 s > 3: <integral_dimension_tests::pysecdec_launcher_drains_stderr_and_reuses_matching_dimension::{closure#0} as core::ops::function::FnOnce<()>>::call_once
  401. 79.91 s > note: Some details are omitted, run with `RUST_BACKTRACE=full` for a verbose backtrace.
  402. 79.91 s >
  403. 79.91 s > error: test run failed
  404. 79.91 s >
  405. 79.91 s > ========== nextest test summary ==========
  406. 79.92 s > report: target/nextest/ci_gammaloop/junit.xml
  407. 79.92 s > tests: 81, failures: 1, errors: 0
  408. 79.92 s >
  409. 79.92 s > 1. vakint::integral_dimension_tests::pysecdec_launcher_drains_stderr_and_reuses_matching_dimension
  410. 79.92 s > failure: test failure with exit code 101
  411. 79.92 s > thread 'pysecdec_launcher_drains_stderr_and_reuses_matching_dimension' (321) panicked at crates/vakint/tests/integral_dimension_tests.rs:290:18:
  412. 79.92 s > called `Result::unwrap()` on an `Err` value: IoError(Os { code: 2, kind: NotFound, message: "No such file or directory" })
  413. 79.92 s > stack backtrace:
  414. 79.92 s > 0: __rustc::rust_begin_unwind
  415. 79.92 s > 1: core::panicking::panic_fmt
  416. 79.92 s > 2: core::result::unwrap_failed
  417. 79.92 s > 3: <integral_dimension_tests::pysecdec_launcher_drains_stderr_and_reuses_matching_dimension::{closure#0} as core::ops::function::FnOnce<()>>::call_once
  418. 79.92 s > note: Some details are omitted, run with `RUST_BACKTRACE=full` for a verbose backtrace.
  419. 79.92 s > system-out
  420. 79.92 s > running 1 test
  421. 79.92 s > test pysecdec_launcher_drains_stderr_and_reuses_matching_dimension ... FAILED
  422. 79.92 s >
  423. 79.92 s > failures:
  424. 79.92 s >
  425. 79.92 s > failures:
  426. 79.92 s > pysecdec_launcher_drains_stderr_and_reuses_matching_dimension
  427. 79.92 s >
  428. 79.92 s > test result: FAILED. 0 passed; 1 failed; 0 ignored; 0 measured; 6 filtered out; finished in 0.06s
  429. 79.92 s > system-err
  430. 79.92 s > [WARN vakint] User-specified directory '/build/vakint_launcher_stderr_320_3' not found, and was instead created and pySecDec sources will be regenerated.
  431. 79.92 s > [INFO vakint] Running PySecDec with command: cd "/build/vakint_launcher_stderr_320_3" && "python3" "run.py"
  432. 79.92 s > [INFO vakint] You can follow the run live with 'tail -f follow_run.txt' in that temporary directory
  433. 79.92 s > [INFO vakint] Temporary run directory: /build/vakint_launcher_stderr_320_3
  434. 79.92 s >
  435. 79.92 s > thread 'pysecdec_launcher_drains_stderr_and_reuses_matching_dimension' (321) panicked at crates/vakint/tests/integral_dimension_tests.rs:290:18:
  436. 79.92 s > called `Result::unwrap()` on an `Err` value: IoError(Os { code: 2, kind: NotFound, message: "No such file or directory" })
  437. 79.92 s > stack backtrace:
  438. 79.92 s > 0: __rustc::rust_begin_unwind
  439. 79.92 s > 1: core::panicking::panic_fmt
  440. 79.92 s > 2: core::result::unwrap_failed
  441. 79.92 s > 3: <integral_dimension_tests::pysecdec_launcher_drains_stderr_and_reuses_matching_dimension::{closure#0} as core::ops::function::FnOnce<()>>::call_once
  442. 79.92 s > note: Some details are omitted, run with `RUST_BACKTRACE=full` for a verbose backtrace.
  443. 79.92 s > =========================================
  444. 79.92 s For full logs, run:
  445. 79.92 s nix log /nix/store/4nw3lywmcm5yps0pcdbklnagin353i05-gammaloop-nextest-vakint.drv
  446. 80.10 s [1 built (1 failed), 16 Run failed.