0.00 s
$ /nix/store/bhv6xyvqw6gjs3j488gi1z6wdv18bdpa-coreutils-9.11/bin/timeout --kill-after=15s 7200s /nix/store/bxgja2ppiqi6w2bgn0r07d7mgnl1k6k2-nix-2.34.8/bin/nix --extra-experimental-features nix-command --extra-experimental-features flakes flake clone git+https://github.com/alphal00p/gammaloop --dest /tmp/nix-ci-worker/stable-pwd/repo/
0.08 s
Cloning into '/tmp/nix-ci-worker/stable-pwd/repo'...
2.16 s
remote: Enumerating objects: 158424
remote: Enumerating objects: 162134, done.
2.27 s
remote: Counting objects: 0% (1/3710)
remote: Counting objects: 1% (38/3710)
remote: Counting objects: 2% (75/3710)
remote: Counting objects: 3% (112/3710)
remote: Counting objects: 4% (149/3710)
remote: Counting objects: 5% (186/3710)
remote: Counting objects: 6% (223/3710)
remote: Counting objects: 7% (260/3710)
remote: Counting objects: 8% (297/3710)
remote: Counting objects: 9% (334/3710)
remote: Counting objects: 10% (371/3710)
remote: Counting objects: 11% (409/3710)
remote: Counting objects: 12% (446/3710)
remote: Counting objects: 13% (483/3710)
remote: Counting objects: 14% (520/3710)
remote: Counting objects: 15% (557/3710)
remote: Counting objects: 16% (594/3710)
remote: Counting objects: 17% (631/3710)
remote: Counting objects: 18% (668/3710)
remote: Counting objects: 19% (705/3710)
remote: Counting objects: 20% (742/3710)
remote: Counting objects: 21% (780/3710)
remote: Counting objects: 22% (817/3710)
remote: Counting objects: 23% (854/3710)
remote: Counting objects: 24% (891/3710)
remote: Counting objects: 25% (928/3710)
remote: Counting objects: 26% (965/3710)
remote: Counting objects: 27% (1002/3710)
remote: Counting objects: 28% (1039/3710)
remote: Counting objects: 29% (1076/3710)
remote: Counting objects: 30% (1113/3710)
remote: Counting objects: 31% (1151/3710)
remote: Counting objects: 32% (1188/3710)
remote: Counting objects: 33% (1225/3710)
remote: Counting objects: 34% (1262/3710)
remote: Counting objects: 35% (1299/3710)
remote: Counting objects: 36% (1336/3710)
remote: Counting objects: 37% (1373/3710)
remote: Counting objects: 38% (1410/3710)
remote: Counting objects: 39% (1447/3710)
remote: Counting objects: 40% (1484/3710)
remote: Counting objects: 41% (1522/3710)
remote: Counting objects: 42% (1559/3710)
remote: Counting objects: 43% (1596/3710)
remote: Counting objects: 44% (1633/3710)
remote: Counting objects: 45% (1670/3710)
remote: Counting objects: 46% (1707/3710)
remote: Counting objects: 47% (1744/3710)
remote: Counting objects: 48% (1781/3710)
remote: Counting objects: 49% (1818/3710)
remote: Counting objects: 50% (1855/3710)
remote: Counting objects: 51% (1893/3710)
remote: Counting objects: 52% (1930/3710)
remote: Counting objects: 53% (1967/3710)
remote: Counting objects: 54% (2004/3710)
remote: Counting objects: 55% (2041/3710)
remote: Counting objects: 56% (2078/3710)
remote: Counting objects: 57% (2115/3710)
remote: Counting objects: 58% (2152/3710)
remote: Counting objects: 59% (2189/3710)
remote: Counting objects: 60% (2226/3710)
remote: Counting objects: 61% (2264/3710)
remote: Counting objects: 62% (2301/3710)
remote: Counting objects: 63% (2338/3710)
remote: Counting objects: 64% (2375/3710)
remote: Counting objects: 65% (2412/3710)
remote: Counting objects: 66% (2449/3710)
remote: Counting objects: 67% (2486/3710)
remote: Counting objects: 68% (2523/3710)
remote: Counting objects: 69% (2560/3710)
remote: Counting objects: 70% (2597/3710)
remote: Counting objects: 71% (2635/3710)
remote: Counting objects: 72% (2672/3710)
remote: Counting objects: 73% (2709/3710)
remote: Counting objects: 74% (2746/3710)
remote: Counting objects: 75% (2783/3710)
remote: Counting objects: 76% (2820/3710)
remote: Counting objects: 77% (2857/3710)
remote: Counting objects: 78% (2894/3710)
remote: Counting objects: 79% (2931/3710)
remote: Counting objects: 80% (2968/3710)
remote: Counting objects: 81% (3006/3710)
remote: Counting objects: 82% (3043/3710)
remote: Counting objects: 83% (3080/3710)
remote: Counting objects: 84% (3117/3710)
remote: Counting objects: 85% (3154/3710)
remote: Counting objects: 86% (3191/3710)
remote: Counting objects: 87% (3228/3710)
remote: Counting objects: 88% (3265/3710)
remote: Counting objects: 89% (3302/3710)
remote: Counting objects: 90% (3339/3710)
remote: Counting objects: 91% (3377/3710)
remote: Counting objects: 92% (3414/3710)
remote: Counting objects: 93% (3451/3710)
remote: Counting objects: 94% (3488/3710)
remote: Counting objects: 95% (3525/3710)
remote: Counting objects: 96% (3562/3710)
remote: Counting objects: 97% (3599/3710)
remote: Counting objects: 98% (3636/3710)
remote: Counting objects: 99% (3673/3710)
remote: Counting objects: 100% (3710/3710)
remote: Counting objects: 100% (3710/3710), done.
4.22 s
remote: Compressing objects: 0% (1/1481)
remote: Compressing objects: 1% (15/1481)
remote: Compressing objects: 2% (30/1481)
remote: Compressing objects: 3% (45/1481)
remote: Compressing objects: 4% (60/1481)
remote: Compressing objects: 5% (75/1481)
remote: Compressing objects: 6% (89/1481)
remote: Compressing objects: 7% (104/1481)
remote: Compressing objects: 8% (119/1481)
remote: Compressing objects: 9% (134/1481)
remote: Compressing objects: 10% (149/1481)
remote: Compressing objects: 11% (163/1481)
remote: Compressing objects: 12% (178/1481)
remote: Compressing objects: 13% (193/1481)
remote: Compressing objects: 14% (208/1481)
remote: Compressing objects: 15% (223/1481)
remote: Compressing objects: 16% (237/1481)
remote: Compressing objects: 17% (252/1481)
remote: Compressing objects: 18% (267/1481)
remote: Compressing objects: 19% (282/1481)
remote: Compressing objects: 20% (297/1481)
remote: Compressing objects: 21% (312/1481)
remote: Compressing objects: 22% (326/1481)
remote: Compressing objects: 23% (341/1481)
remote: Compressing objects: 24% (356/1481)
remote: Compressing objects: 25% (371/1481)
remote: Compressing objects: 26% (386/1481)
remote: Compressing objects: 27% (400/1481)
remote: Compressing objects: 28% (415/1481)
remote: Compressing objects: 28% (423/1481)
remote: Compressing objects: 29% (430/1481)
remote: Compressing objects: 30% (445/1481)
remote: Compressing objects: 31% (460/1481)
remote: Compressing objects: 32% (474/1481)
remote: Compressing objects: 33% (489/1481)
remote: Compressing objects: 34% (504/1481)
remote: Compressing objects: 35% (519/1481)
remote: Compressing objects: 36% (534/1481)
remote: Compressing objects: 37% (548/1481)
remote: Compressing objects: 38% (563/1481)
remote: Compressing objects: 39% (578/1481)
remote: Compressing objects: 40% (593/1481)
remote: Compressing objects: 40% (607/1481)
remote: Compressing objects: 41% (608/1481)
remote: Compressing objects: 42% (623/1481)
remote: Compressing objects: 43% (637/1481)
remote: Compressing objects: 44% (652/1481)
remote: Compressing objects: 45% (667/1481)
remote: Compressing objects: 46% (682/1481)
remote: Compressing objects: 47% (697/1481)
remote: Compressing objects: 48% (711/1481)
remote: Compressing objects: 49% (726/1481)
remote: Compressing objects: 50% (741/1481)
remote: Compressing objects: 51% (756/1481)
remote: Compressing objects: 52% (771/1481)
remote: Compressing objects: 53% (785/1481)
remote: Compressing objects: 54% (800/1481)
remote: Compressing objects: 55% (815/1481)
remote: Compressing objects: 56% (830/1481)
remote: Compressing objects: 57% (845/1481)
remote: Compressing objects: 58% (859/1481)
remote: Compressing objects: 59% (874/1481)
remote: Compressing objects: 60% (889/1481)
remote: Compressing objects: 61% (904/1481)
remote: Compressing objects: 62% (919/1481)
remote: Compressing objects: 63% (934/1481)
remote: Compressing objects: 64% (948/1481)
remote: Compressing objects: 65% (963/1481)
remote: Compressing objects: 66% (978/1481)
remote: Compressing objects: 67% (993/1481)
remote: Compressing objects: 68% (1008/1481)
remote: Compressing objects: 69% (1022/1481)
remote: Compressing objects: 70% (1037/1481)
remote: Compressing objects: 71% (1052/1481)
remote: Compressing objects: 72% (1067/1481)
remote: Compressing objects: 73% (1082/1481)
remote: Compressing objects: 74% (1096/1481)
remote: Compressing objects: 75% (1111/1481)
remote: Compressing objects: 76% (1126/1481)
remote: Compressing objects: 77% (1141/1481)
remote: Compressing objects: 78% (1156/1481)
remote: Compressing objects: 79% (1170/1481)
remote: Compressing objects: 80% (1185/1481)
remote: Compressing objects: 81% (1200/1481)
remote: Compressing objects: 82% (1215/1481)
remote: Compressing objects: 83% (1230/1481)
remote: Compressing objects: 84% (1245/1481)
remote: Compressing objects: 85% (1259/1481)
remote: Compressing objects: 86% (1274/1481)
remote: Compressing objects: 87% (1289/1481)
remote: Compressing objects: 88% (1304/1481)
remote: Compressing objects: 89% (1319/1481)
remote: Compressing objects: 90% (1333/1481)
remote: Compressing objects: 91% (1348/1481)
remote: Compressing objects: 92% (1363/1481)
remote: Compressing objects: 93% (1378/1481)
remote: Compressing objects: 94% (1393/1481)
remote: Compressing objects: 95% (1407/1481)
remote: Compressing objects: 96% (1422/1481)
remote: Compressing objects: 97% (1437/1481)
remote: Compressing objects: 98% (1452/1481)
remote: Compressing objects: 99% (1467/1481)
remote: Compressing objects: 100% (1481/1481)
remote: Compressing objects: 100% (1481/1481), done.
19.05 s
Receiving objects: 0% (1/162134)
Receiving objects: 1% (1622/162134)
Receiving objects: 2% (3243/162134)
Receiving objects: 3% (4865/162134)
Receiving objects: 4% (6486/162134), 9.67 MiB | 19.25 MiB/s
Receiving objects: 5% (8107/162134), 9.67 MiB | 19.25 MiB/s
Receiving objects: 5% (9238/162134), 28.02 MiB | 27.55 MiB/s
Receiving objects: 6% (9729/162134), 28.02 MiB | 27.55 MiB/s
Receiving objects: 7% (11350/162134), 28.02 MiB | 27.55 MiB/s
Receiving objects: 8% (12971/162134), 28.02 MiB | 27.55 MiB/s
Receiving objects: 9% (14593/162134), 28.02 MiB | 27.55 MiB/s
Receiving objects: 10% (16214/162134), 28.02 MiB | 27.55 MiB/s
Receiving objects: 11% (17835/162134), 45.91 MiB | 30.26 MiB/s
Receiving objects: 12% (19457/162134), 45.91 MiB | 30.26 MiB/s
Receiving objects: 13% (21078/162134), 45.91 MiB | 30.26 MiB/s
Receiving objects: 13% (21505/162134), 45.91 MiB | 30.26 MiB/s
Receiving objects: 14% (22699/162134), 63.38 MiB | 31.02 MiB/s
Receiving objects: 15% (24321/162134), 63.38 MiB | 31.02 MiB/s
Receiving objects: 16% (25942/162134), 63.38 MiB | 31.02 MiB/s
Receiving objects: 16% (27546/162134), 78.84 MiB | 31.00 MiB/s
Receiving objects: 17% (27563/162134), 78.84 MiB | 31.00 MiB/s
Receiving objects: 18% (29185/162134), 95.66 MiB | 31.15 MiB/s
Receiving objects: 19% (30806/162134), 95.66 MiB | 31.15 MiB/s
Receiving objects: 20% (32427/162134), 95.66 MiB | 31.15 MiB/s
Receiving objects: 21% (34049/162134), 112.31 MiB | 31.45 MiB/s
Receiving objects: 22% (35670/162134), 112.31 MiB | 31.45 MiB/s
Receiving objects: 22% (37096/162134), 112.31 MiB | 31.45 MiB/s
Receiving objects: 23% (37291/162134), 130.59 MiB | 32.08 MiB/s
Receiving objects: 24% (38913/162134), 130.59 MiB | 32.08 MiB/s
Receiving objects: 25% (40534/162134), 130.59 MiB | 32.08 MiB/s
Receiving objects: 26% (42155/162134), 147.32 MiB | 32.07 MiB/s
Receiving objects: 27% (43777/162134), 147.32 MiB | 32.07 MiB/s
Receiving objects: 28% (45398/162134), 147.32 MiB | 32.07 MiB/s
Receiving objects: 28% (46620/162134), 147.32 MiB | 32.07 MiB/s
Receiving objects: 29% (47019/162134), 147.32 MiB | 32.07 MiB/s
Receiving objects: 30% (48641/162134), 147.32 MiB | 32.07 MiB/s
Receiving objects: 31% (50262/162134), 147.32 MiB | 32.07 MiB/s
Receiving objects: 32% (51883/162134), 165.70 MiB | 33.77 MiB/s
Receiving objects: 33% (53505/162134), 165.70 MiB | 33.77 MiB/s
Receiving objects: 34% (55126/162134), 165.70 MiB | 33.77 MiB/s
Receiving objects: 35% (56747/162134), 165.70 MiB | 33.77 MiB/s
Receiving objects: 36% (58369/162134), 165.70 MiB | 33.77 MiB/s
Receiving objects: 37% (59990/162134), 165.70 MiB | 33.77 MiB/s
Receiving objects: 38% (61611/162134), 165.70 MiB | 33.77 MiB/s
Receiving objects: 39% (63233/162134), 165.70 MiB | 33.77 MiB/s
Receiving objects: 40% (64854/162134), 182.82 MiB | 33.61 MiB/s
Receiving objects: 41% (66475/162134), 182.82 MiB | 33.61 MiB/s
Receiving objects: 42% (68097/162134), 182.82 MiB | 33.61 MiB/s
Receiving objects: 43% (69718/162134), 182.82 MiB | 33.61 MiB/s
Receiving objects: 43% (71330/162134), 182.82 MiB | 33.61 MiB/s
Receiving objects: 44% (71339/162134), 182.82 MiB | 33.61 MiB/s
Receiving objects: 45% (72961/162134), 200.83 MiB | 33.46 MiB/s
Receiving objects: 46% (74582/162134), 200.83 MiB | 33.46 MiB/s
Receiving objects: 47% (76203/162134), 200.83 MiB | 33.46 MiB/s
Receiving objects: 48% (77825/162134), 200.83 MiB | 33.46 MiB/s
Receiving objects: 48% (78081/162134), 218.10 MiB | 33.60 MiB/s
Receiving objects: 48% (78213/162134), 271.87 MiB | 34.48 MiB/s
Receiving objects: 49% (79446/162134), 271.87 MiB | 34.48 MiB/s
Receiving objects: 50% (81067/162134), 271.87 MiB | 34.48 MiB/s
Receiving objects: 51% (82689/162134), 289.05 MiB | 34.24 MiB/s
Receiving objects: 51% (83684/162134), 289.05 MiB | 34.24 MiB/s
Receiving objects: 52% (84310/162134), 307.47 MiB | 34.55 MiB/s
Receiving objects: 53% (85932/162134), 307.47 MiB | 34.55 MiB/s
Receiving objects: 54% (87553/162134), 307.47 MiB | 34.55 MiB/s
Receiving objects: 55% (89174/162134), 324.50 MiB | 34.44 MiB/s
Receiving objects: 55% (90085/162134), 324.50 MiB | 34.44 MiB/s
Receiving objects: 56% (90796/162134), 324.50 MiB | 34.44 MiB/s
Receiving objects: 57% (92417/162134), 324.50 MiB | 34.44 MiB/s
Receiving objects: 58% (94038/162134), 324.50 MiB | 34.44 MiB/s
Receiving objects: 59% (95660/162134), 324.50 MiB | 34.44 MiB/s
Receiving objects: 60% (97281/162134), 324.50 MiB | 34.44 MiB/s
Receiving objects: 61% (98902/162134), 324.50 MiB | 34.44 MiB/s
Receiving objects: 62% (100524/162134), 324.50 MiB | 34.44 MiB/s
Receiving objects: 63% (102145/162134), 324.50 MiB | 34.44 MiB/s
Receiving objects: 64% (103766/162134), 324.50 MiB | 34.44 MiB/s
Receiving objects: 65% (105388/162134), 324.50 MiB | 34.44 MiB/s
Receiving objects: 66% (107009/162134), 324.50 MiB | 34.44 MiB/s
Receiving objects: 67% (108630/162134), 324.50 MiB | 34.44 MiB/s
Receiving objects: 68% (110252/162134), 324.50 MiB | 34.44 MiB/s
Receiving objects: 69% (111873/162134), 324.50 MiB | 34.44 MiB/s
Receiving objects: 70% (113494/162134), 324.50 MiB | 34.44 MiB/s
Receiving objects: 71% (115116/162134), 324.50 MiB | 34.44 MiB/s
Receiving objects: 72% (116737/162134), 324.50 MiB | 34.44 MiB/s
Receiving objects: 73% (118358/162134), 324.50 MiB | 34.44 MiB/s
Receiving objects: 74% (119980/162134), 324.50 MiB | 34.44 MiB/s
Receiving objects: 75% (121601/162134), 324.50 MiB | 34.44 MiB/s
Receiving objects: 76% (123222/162134), 342.57 MiB | 34.64 MiB/s
Receiving objects: 77% (124844/162134), 359.87 MiB | 34.68 MiB/s
Receiving objects: 77% (125419/162134), 359.87 MiB | 34.68 MiB/s
Receiving objects: 78% (126465/162134), 359.87 MiB | 34.68 MiB/s
Receiving objects: 79% (128086/162134), 359.87 MiB | 34.68 MiB/s
Receiving objects: 80% (129708/162134), 359.87 MiB | 34.68 MiB/s
Receiving objects: 81% (131329/162134), 359.87 MiB | 34.68 MiB/s
Receiving objects: 82% (132950/162134), 359.87 MiB | 34.68 MiB/s
Receiving objects: 83% (134572/162134), 394.35 MiB | 34.62 MiB/s
Receiving objects: 83% (134652/162134), 394.35 MiB | 34.62 MiB/s
Receiving objects: 84% (136193/162134), 394.35 MiB | 34.62 MiB/s
Receiving objects: 85% (137814/162134), 394.35 MiB | 34.62 MiB/s
Receiving objects: 86% (139436/162134), 411.53 MiB | 34.58 MiB/s
Receiving objects: 87% (141057/162134), 411.53 MiB | 34.58 MiB/s
Receiving objects: 88% (142678/162134), 411.53 MiB | 34.58 MiB/s
Receiving objects: 89% (144300/162134), 429.66 MiB | 34.73 MiB/s
Receiving objects: 89% (145256/162134), 429.66 MiB | 34.73 MiB/s
Receiving objects: 90% (145921/162134), 429.66 MiB | 34.73 MiB/s
Receiving objects: 91% (147542/162134), 446.82 MiB | 34.74 MiB/s
Receiving objects: 92% (149164/162134), 446.82 MiB | 34.74 MiB/s
Receiving objects: 93% (150785/162134), 446.82 MiB | 34.74 MiB/s
Receiving objects: 94% (152406/162134), 463.67 MiB | 34.63 MiB/s
Receiving objects: 94% (152857/162134), 463.67 MiB | 34.63 MiB/s
Receiving objects: 95% (154028/162134), 481.04 MiB | 34.71 MiB/s
Receiving objects: 96% (155649/162134), 481.04 MiB | 34.71 MiB/s
Receiving objects: 97% (157270/162134), 481.04 MiB | 34.71 MiB/s
Receiving objects: 98% (158892/162134), 481.04 MiB | 34.71 MiB/s
Receiving objects: 99% (160513/162134), 481.04 MiB | 34.71 MiB/s
remote: Total 162134 (delta 2584), reused 2717 (delta 2211), pack-reused 158424 (from 3)
19.05 s
Receiving objects: 100% (162134/162134), 498.32 MiB | 34.50 MiB/s
Receiving objects: 100% (162134/162134), 500.56 MiB | 33.77 MiB/s, done.
21.65 s
Resolving deltas: 0% (0/105592)
Resolving deltas: 1% (1057/105592)
Resolving deltas: 2% (2112/105592)
Resolving deltas: 3% (3169/105592)
Resolving deltas: 4% (4224/105592)
Resolving deltas: 5% (5280/105592)
Resolving deltas: 6% (6336/105592)
Resolving deltas: 7% (7392/105592)
Resolving deltas: 8% (8448/105592)
Resolving deltas: 9% (9504/105592)
Resolving deltas: 10% (10560/105592)
Resolving deltas: 11% (11616/105592)
Resolving deltas: 12% (12672/105592)
Resolving deltas: 13% (13727/105592)
Resolving deltas: 14% (14783/105592)
Resolving deltas: 15% (15839/105592)
Resolving deltas: 16% (16895/105592)
Resolving deltas: 17% (17952/105592)
Resolving deltas: 18% (19007/105592)
Resolving deltas: 19% (20063/105592)
Resolving deltas: 20% (21120/105592)
Resolving deltas: 21% (22176/105592)
Resolving deltas: 22% (23232/105592)
Resolving deltas: 23% (24289/105592)
Resolving deltas: 24% (25343/105592)
Resolving deltas: 25% (26398/105592)
Resolving deltas: 26% (27455/105592)
Resolving deltas: 27% (28510/105592)
Resolving deltas: 28% (29566/105592)
Resolving deltas: 29% (30624/105592)
Resolving deltas: 30% (31678/105592)
Resolving deltas: 31% (32734/105592)
Resolving deltas: 32% (33790/105592)
Resolving deltas: 33% (34846/105592)
Resolving deltas: 34% (35902/105592)
Resolving deltas: 35% (36962/105592)
Resolving deltas: 36% (38014/105592)
Resolving deltas: 37% (39070/105592)
Resolving deltas: 38% (40125/105592)
Resolving deltas: 39% (41181/105592)
Resolving deltas: 40% (42237/105592)
Resolving deltas: 41% (43293/105592)
Resolving deltas: 42% (44349/105592)
Resolving deltas: 43% (45406/105592)
Resolving deltas: 43% (46179/105592)
Resolving deltas: 44% (46461/105592)
Resolving deltas: 45% (47517/105592)
Resolving deltas: 46% (48573/105592)
Resolving deltas: 47% (49629/105592)
Resolving deltas: 48% (50685/105592)
Resolving deltas: 49% (51742/105592)
Resolving deltas: 50% (52796/105592)
Resolving deltas: 51% (53852/105592)
Resolving deltas: 52% (54908/105592)
Resolving deltas: 53% (55964/105592)
Resolving deltas: 54% (57020/105592)
Resolving deltas: 55% (58076/105592)
Resolving deltas: 56% (59132/105592)
Resolving deltas: 57% (60188/105592)
Resolving deltas: 58% (61244/105592)
Resolving deltas: 59% (62301/105592)
Resolving deltas: 60% (63356/105592)
Resolving deltas: 61% (64412/105592)
Resolving deltas: 62% (65470/105592)
Resolving deltas: 63% (66524/105592)
Resolving deltas: 64% (67579/105592)
Resolving deltas: 65% (68635/105592)
Resolving deltas: 66% (69691/105592)
Resolving deltas: 67% (70747/105592)
Resolving deltas: 68% (71803/105592)
Resolving deltas: 69% (72859/105592)
Resolving deltas: 70% (73915/105592)
Resolving deltas: 71% (74972/105592)
Resolving deltas: 72% (76027/105592)
Resolving deltas: 73% (77084/105592)
Resolving deltas: 74% (78139/105592)
Resolving deltas: 75% (79194/105592)
Resolving deltas: 76% (80250/105592)
Resolving deltas: 77% (81306/105592)
Resolving deltas: 78% (82362/105592)
Resolving deltas: 79% (83418/105592)
Resolving deltas: 80% (84474/105592)
Resolving deltas: 81% (85530/105592)
Resolving deltas: 82% (86586/105592)
Resolving deltas: 83% (87642/105592)
Resolving deltas: 84% (88698/105592)
Resolving deltas: 85% (89754/105592)
Resolving deltas: 86% (90811/105592)
Resolving deltas: 86% (91413/105592)
Resolving deltas: 87% (91866/105592)
Resolving deltas: 88% (92921/105592)
Resolving deltas: 89% (93977/105592)
Resolving deltas: 90% (95033/105592)
Resolving deltas: 91% (96089/105592)
Resolving deltas: 92% (97145/105592)
Resolving deltas: 93% (98201/105592)
Resolving deltas: 94% (99257/105592)
Resolving deltas: 95% (100313/105592)
Resolving deltas: 96% (101369/105592)
Resolving deltas: 97% (102425/105592)
Resolving deltas: 98% (103481/105592)
Resolving deltas: 99% (104537/105592)
Resolving deltas: 100% (105592/105592)
Resolving deltas: 100% (105592/105592), done.
22.46 s
Fetching commit 5927040624680bb00873a7e3587358a185c92900 for complex-null-spinors ...
22.46 s
$ /nix/store/b1wn5clix1mz4vpfih7x9cnj9qfh7c6h-git-2.54.0/bin/git fetch origin 5927040624680bb00873a7e3587358a185c92900
22.89 s
From https://github.com/alphal00p/gammaloop
22.89 s
* branch 5927040624680bb00873a7e3587358a185c92900 -> FETCH_HEAD
22.90 s
$ /nix/store/bhv6xyvqw6gjs3j488gi1z6wdv18bdpa-coreutils-9.11/bin/timeout --kill-after=15s 7200s /nix/store/b1wn5clix1mz4vpfih7x9cnj9qfh7c6h-git-2.54.0/bin/git -c advice.detachedHead=false checkout 5927040624680bb00873a7e3587358a185c92900
23.32 s
HEAD is now at 592704062 Merge branch 'codex/ninja-shared-types' into complex-null-spinors
23.32 s
$ /nix/store/bhv6xyvqw6gjs3j488gi1z6wdv18bdpa-coreutils-9.11/bin/timeout --kill-after=15s 7200s /nix/store/bxgja2ppiqi6w2bgn0r07d7mgnl1k6k2-nix-2.34.8/bin/nix --extra-experimental-features nix-command --extra-experimental-features flakes --log-format internal-json run .#packages.x86_64-linux.nix-ci-check-gammaloop-nextest-clinnet --print-build-logs
23.51 s
warning: ignoring untrusted flake configuration setting 'extra-substituters'.
23.51 s
Pass '--accept-flake-config' to trust it
23.51 s
warning: ignoring untrusted flake configuration setting 'extra-trusted-public-keys'.
23.51 s
Pass '--accept-flake-config' to trust it
28.52 s
28.71 s
Building /nix/store/wjmi88614qakla0g6gk0571gsbmbh933-nix-ci-check-gammaloop-nextest-clinnet.drv
28.71 s
[nix-ci-check-gammaloop-nextest-clinnet] structuredAttrs is enabled
28.77 s
[nix-ci-check-gammaloop-nextest-clinnet:post-build] Uploading to the NixCI cache: /nix/store/s5p2nyff7f1snijpvjf5jb9jls2rmky5-nix-ci-check-gammaloop-nextest-clinnet
28.81 s
[nix-ci-check-gammaloop-nextest-clinnet:post-build] warning: 'warn-short-path-literals' is deprecated, use 'lint-short-path-literals = ignore' instead
28.82 s
[nix-ci-check-gammaloop-nextest-clinnet:post-build] copying 1 paths...
28.82 s
[nix-ci-check-gammaloop-nextest-clinnet:post-build] copying path '/nix/store/s5p2nyff7f1snijpvjf5jb9jls2rmky5-nix-ci-check-gammaloop-nextest-clinnet' to 'https://cache.nix-ci.com'...
29.11 s
[nix-ci-check-gammaloop-nextest-clinnet:post-build] warning: 'warn-short-path-literals' is deprecated, use 'lint-short-path-literals = ignore' instead
29.37 s
[nix-ci-check-gammaloop-nextest-clinnet:post-build] copying 1 paths...
29.37 s
[nix-ci-check-gammaloop-nextest-clinnet:post-build] copying path '/nix/store/wjmi88614qakla0g6gk0571gsbmbh933-nix-ci-check-gammaloop-nextest-clinnet.drv' to 'https://cache.nix-ci.com'...
29.53 s
Uploaded nix-ci-check-gammaloop-nextest-clinnet in 775ms
29.53 s
Progress: 1 of 2 built
29.53 s
Built nix-ci-check-gammaloop-nextest-clinnet in 817ms
29.53 s
Progress: 2 of 2 built
29.65 s
evaluating derivation 'gdo you want to allow configuration setting 'extra-substituters' to be set to 'https://cache.nix-ci.com ' (y/N)? do you want to permanently mark this value as untrusted (y/N)? warning: ignoring untrusted flake configuration setting 'extra-substituters'.
29.65 s
Pass '--accept-flake-config' to trust it
29.65 s
do you want to allow configuration setting 'extra-trusted-public-keys' to be set to 'nix-ci:g3xV5BDTLtIBZr/A00IU1x0EtKKlb7YLgBN2SgYgM6A= ' (y/N)? do you want to permanently mark this value as untrusted (y/N)? warning: ignoring untrusted flake configuration setting 'extra-trusted-public-keys'.
29.65 s
Pass '--accept-flake-config' to trust it
36.02 s
copying '/nix/store/jhld
evaluating derivation 'g
copying '/nix/store/jhld
evaluating derivation 'g
copying '/nix/store/jhld
evaluating derivation 'g
copying '/nix/store/jhld
evaluating derivation 'g
copying '/nix/store/jhld
evaluating derivation 'g
querying gammaloop-nexte
querying info about miss
querying gammaloop-nexte
[33.4 /31.3 KiB DL] query
[52.2 KiB DL] querying g
[52.8 KiB DL] querying g
[0 /23 built, 15 /0 /73 cop
[0 /27 built, 16 /0 /76 copgammaloop-ci-test-binary-dependencies> structuredAttrs is enabled
36.06 s
[1 /0 /22 built, 12 /14 /76
[1 /0 /18 built, 9 /19 /76 cgammaloop-ci-test-binary-dependencies (post)> Uploading to the NixCI cache: /nix/store/k7bs4krpiqcjqmfjmw64nvz9icr0i3ri-gammaloop-ci-test-binary-dependencies-81656ab15e4a8254-clinnet-dev-dependency.toml
36.12 s
gammaloop-ci-test-binary-dependencies (post)> warning: 'warn-short-path-literals' is deprecated, use 'lint-short-path-literals = ignore' instead
36.15 s
gammaloop-ci-test-binary-dependencies (post)> copying 0 paths...
36.19 s
gammaloop-ci-test-binary-dependencies (post)> warning: 'warn-short-path-literals' is deprecated, use 'lint-short-path-literals = ignore' instead
36.25 s
gammaloop-ci-test-binary-dependencies (post)> copying 0 paths...
37.12 s
[1 /14 built, 3 /28 /76 cop
[1 /14 built, 3 /29 /76 cop
[1 /14 built, 3 /30 /76 cop
[1 /13 built, 2 /31 /76 cop
[1 /12 built, 15 /39 /76 co
[1 /12 built, 9 /49 /76 cop
[1 /12 built, 5 /57 /76 cop
[1 /12 built, 2 /60 /76 cop
[1 /12 built, 5 /62 /76 cop
[1 /12 built, 5 /63 /76 cop
[1 /12 built, 7 /64 /76 cop
[1 /12 built, 6 /66 /76 cop
[1 /11 built, 5 /67 /76 cop
[1 /1 /11 built, 5 /67 /76 cbuilder.pl> Running phase: patchPhase
37.13 s
builder.pl> Running phase: updateAutotoolsGnuConfigScriptsPhase
37.13 s
builder.pl> Running phase: configurePhase
37.14 s
builder.pl> no configure script, doing nothing
37.14 s
[1 /1 /11 built, 5 /68 /76 cbuilder.pl> Running phase: buildPhase
37.15 s
builder.pl> Running phase: checkPhase
37.16 s
builder.pl> Running phase: installPhase
37.16 s
builder.pl> no Makefile or custom installPhase, doing nothing
37.16 s
builder.pl> Running phase: fixupPhase
37.17 s
builder.pl> shrinking RPATHs of ELF executables and libraries in /nix/store/zzmspl8wdn2a3ancrz8dg3kci887nw6d-builder.pl
37.17 s
builder.pl> checking for references to /build/ in /nix/store/zzmspl8wdn2a3ancrz8dg3kci887nw6d-builder.pl...
37.18 s
builder.pl> patching script interpreter paths in /nix/store/zzmspl8wdn2a3ancrz8dg3kci887nw6d-builder.pl
37.21 s
[1 /1 /11 built, 4 /69 /76 cbuilder.pl (post)> Uploading to the NixCI cache: /nix/store/zzmspl8wdn2a3ancrz8dg3kci887nw6d-builder.pl
37.27 s
builder.pl (post)> warning: 'warn-short-path-literals' is deprecated, use 'lint-short-path-literals = ignore' instead
37.30 s
builder.pl (post)> copying 0 paths...
37.38 s
builder.pl (post)> warning: 'warn-short-path-literals' is deprecated, use 'lint-short-path-literals = ignore' instead
37.58 s
builder.pl (post)> copying 0 paths...
38.15 s
[2 /10 built, 3 /70 /76 cop
[2 /9 built, 2 /71 /76 copi
[2 /8 built, 1 /74 /76 copitypst> structuredAttrs is enabled
38.21 s
[1 /2 /8 built, 1 /74 /76 cotypst> created 10 symlinks in user environment
38.31 s
typst (post)> Uploading to the NixCI cache: /nix/store/5f1a3n27fy3y8pf6snxr2sbzwhk9brr2-typst-0.15.1-env
38.36 s
typst (post)> warning: 'warn-short-path-literals' is deprecated, use 'lint-short-path-literals = ignore' instead
38.39 s
typst (post)> copying 0 paths...
38.45 s
typst (post)> warning: 'warn-short-path-literals' is deprecated, use 'lint-short-path-literals = ignore' instead
38.69 s
typst (post)> copying 0 paths...
38.72 s
[3 /9 built, 1 /74 /76 copi
44.87 s
[3 /8 built, 1 /75 /76 copi
[3 /7 built, 76 copied (1
[1 /3 /7 built, 76 copied gammaloop-crate-test-binaries-clinnet> Running phase: unpackPhase
45.11 s
gammaloop-crate-test-binaries-clinnet> unpacking source archive /nix/store/7rr78dvp0bcyk2m5zk2hlaaw6lf4baiw-source
45.17 s
gammaloop-crate-test-binaries-clinnet> source root is source
45.19 s
gammaloop-crate-test-binaries-clinnet> Running phase: patchPhase
45.48 s
gammaloop-crate-test-binaries-clinnet> Executing configureCargoCommonVars
45.49 s
gammaloop-crate-test-binaries-clinnet> decompressing cargo artifacts from /nix/store/325hvsqjhpakgykjxrfqppb24klnhq3p-gammaloop-crate-test-dependencies-81656ab15e4a8254-inputs/target.tar.zst to target
49.44 s
gammaloop-crate-test-binaries-clinnet> decompressing cargo artifacts from /nix/store/dnrr1lhqyzzcbfr715kn89szz16a4vnk-gammaloop-crate-test-dependencies-81656ab15e4a8254-deps-0.1.0/target.tar.zst to target
49.53 s
gammaloop-crate-test-binaries-clinnet> Running phase: updateAutotoolsGnuConfigScriptsPhase
49.60 s
gammaloop-crate-test-binaries-clinnet> Running phase: configurePhase
49.61 s
gammaloop-crate-test-binaries-clinnet> will append /build/source/.cargo-home/config.toml with contents of /nix/store/w72xdqk1lvxyqjazv52iqg1ir83d7798-vendor-cargo-deps/config.toml
49.61 s
gammaloop-crate-test-binaries-clinnet> default configurePhase, nothing to do
49.62 s
gammaloop-crate-test-binaries-clinnet> Running phase: buildPhase
49.66 s
gammaloop-crate-test-binaries-clinnet> +++ command cargo --version
49.66 s
gammaloop-crate-test-binaries-clinnet> cargo 1.98.1 (797e8a9bc 2026-08-05)
49.66 s
gammaloop-crate-test-binaries-clinnet> +++ command cargo test --profile ci-optim --no-run --offline -p clinnet
50.52 s
gammaloop-crate-test-binaries-clinnet> Compiling clinnet v0.1.8 (/build/source/crates/clinnet)
55.33 s
gammaloop-crate-test-binaries-clinnet> Finished `ci-optim` profile [optimized] target(s) in 5.66s
55.49 s
gammaloop-crate-test-binaries-clinnet> Executable unittests src/lib.rs (target/ci-optim/deps/clinnet-70d8dd0e4d047b2b)
55.49 s
gammaloop-crate-test-binaries-clinnet> Executable unittests src/main.rs (target/ci-optim/deps/linnet-c4e53ea91b2fc5ab)
55.49 s
gammaloop-crate-test-binaries-clinnet> Executable tests/public_typst_behavior.rs (target/ci-optim/deps/public_typst_behavior-d0881dde1b54c68b)
55.52 s
gammaloop-crate-test-binaries-clinnet> compressing and installing full archive of ci-incremental-target to /nix/store/51625wmyqrnwi7z1klckgfmp6ix9wbjm-gammaloop-crate-test-binaries-clinnet-81656ab15e4a8254-deps-0.1.0-incremental/target.tar.zst as requested
55.74 s
gammaloop-crate-test-binaries-clinnet> /*stdin*\ : 35.04% ( 72.5 MiB => 25.4 MiB, /nix/store/51625wmyqrnwi7z1klckgfmp6ix9wbjm-gammaloop-crate-test-binaries-clinnet-81656ab15e4a8254-deps-0.1.0-incremental/target.tar.zst)
55.76 s
gammaloop-crate-test-binaries-clinnet> Running phase: installPhase
55.78 s
gammaloop-crate-test-binaries-clinnet> linking previous artifacts /nix/store/dnrr1lhqyzzcbfr715kn89szz16a4vnk-gammaloop-crate-test-dependencies-81656ab15e4a8254-deps-0.1.0/target.tar.zst to /nix/store/q6hm4pnbmz3ncnnzhx7q1vrxky0vbfw1-gammaloop-crate-test-binaries-clinnet-81656ab15e4a8254-deps-0.1.0/target.tar.zst
55.95 s
gammaloop-crate-test-binaries-clinnet> /*stdin*\ : 28.23% ( 28.1 MiB => 7.94 MiB, /nix/store/q6hm4pnbmz3ncnnzhx7q1vrxky0vbfw1-gammaloop-crate-test-binaries-clinnet-81656ab15e4a8254-deps-0.1.0/target.tar.zst)
55.97 s
gammaloop-crate-test-binaries-clinnet> Running phase: fixupPhase
56.07 s
gammaloop-crate-test-binaries-clinnet> shrinking RPATHs of ELF executables and libraries in /nix/store/q6hm4pnbmz3ncnnzhx7q1vrxky0vbfw1-gammaloop-crate-test-binaries-clinnet-81656ab15e4a8254-deps-0.1.0
56.07 s
gammaloop-crate-test-binaries-clinnet> checking for references to /build/ in /nix/store/q6hm4pnbmz3ncnnzhx7q1vrxky0vbfw1-gammaloop-crate-test-binaries-clinnet-81656ab15e4a8254-deps-0.1.0...
56.10 s
gammaloop-crate-test-binaries-clinnet> patching script interpreter paths in /nix/store/q6hm4pnbmz3ncnnzhx7q1vrxky0vbfw1-gammaloop-crate-test-binaries-clinnet-81656ab15e4a8254-deps-0.1.0
56.11 s
gammaloop-crate-test-binaries-clinnet> shrinking RPATHs of ELF executables and libraries in /nix/store/51625wmyqrnwi7z1klckgfmp6ix9wbjm-gammaloop-crate-test-binaries-clinnet-81656ab15e4a8254-deps-0.1.0-incremental
56.11 s
gammaloop-crate-test-binaries-clinnet> checking for references to /build/ in /nix/store/51625wmyqrnwi7z1klckgfmp6ix9wbjm-gammaloop-crate-test-binaries-clinnet-81656ab15e4a8254-deps-0.1.0-incremental...
56.14 s
gammaloop-crate-test-binaries-clinnet> patching script interpreter paths in /nix/store/51625wmyqrnwi7z1klckgfmp6ix9wbjm-gammaloop-crate-test-binaries-clinnet-81656ab15e4a8254-deps-0.1.0-incremental
57.23 s
gammaloop-crate-test-binaries-clinnet (post)> Uploading to the NixCI cache: /nix/store/51625wmyqrnwi7z1klckgfmp6ix9wbjm-gammaloop-crate-test-binaries-clinnet-81656ab15e4a8254-deps-0.1.0-incremental /nix/store/q6hm4pnbmz3ncnnzhx7q1vrxky0vbfw1-gammaloop-crate-test-binaries-clinnet-81656ab15e4a8254-deps-0.1.0
57.83 s
gammaloop-crate-test-binaries-clinnet (post)> warning: 'warn-short-path-literals' is deprecated, use 'lint-short-path-literals = ignore' instead
58.17 s
gammaloop-crate-test-binaries-clinnet (post)> copying 2 paths...
58.17 s
gammaloop-crate-test-binaries-clinnet (post)> copying path '/nix/store/51625wmyqrnwi7z1klckgfmp6ix9wbjm-gammaloop-crate-test-binaries-clinnet-81656ab15e4a8254-deps-0.1.0-incremental' to 'https://cache.nix-ci.com'...
58.17 s
gammaloop-crate-test-binaries-clinnet (post)> copying path '/nix/store/q6hm4pnbmz3ncnnzhx7q1vrxky0vbfw1-gammaloop-crate-test-binaries-clinnet-81656ab15e4a8254-deps-0.1.0' to 'https://cache.nix-ci.com'...
72.69 s
gammaloop-crate-test-binaries-clinnet (post)> warning: 'warn-short-path-literals' is deprecated, use 'lint-short-path-literals = ignore' instead
73.10 s
gammaloop-crate-test-binaries-clinnet (post)> copying 0 paths...
73.60 s
[4 /8 built, 76 copied (1
[1 /4 /7 built, 76 copied gammaloop-nextest-binaries-clinnet-clinnet> Running phase: unpackPhase
73.61 s
gammaloop-nextest-binaries-clinnet-clinnet> unpacking source archive /nix/store/5szi20w3pi7873pkz6s6xhiwb7h3zn8a-source
73.66 s
gammaloop-nextest-binaries-clinnet-clinnet> source root is source
73.69 s
gammaloop-nextest-binaries-clinnet-clinnet> Running phase: patchPhase
74.06 s
gammaloop-nextest-binaries-clinnet-clinnet> Executing configureCargoCommonVars
74.07 s
gammaloop-nextest-binaries-clinnet-clinnet> decompressing cargo artifacts from /nix/store/325hvsqjhpakgykjxrfqppb24klnhq3p-gammaloop-crate-test-dependencies-81656ab15e4a8254-inputs/target.tar.zst to target
79.24 s
gammaloop-nextest-binaries-clinnet-clinnet> decompressing cargo artifacts from /nix/store/dnrr1lhqyzzcbfr715kn89szz16a4vnk-gammaloop-crate-test-dependencies-81656ab15e4a8254-deps-0.1.0/target.tar.zst to target
79.42 s
gammaloop-nextest-binaries-clinnet-clinnet> decompressing cargo artifacts from /nix/store/q6hm4pnbmz3ncnnzhx7q1vrxky0vbfw1-gammaloop-crate-test-binaries-clinnet-81656ab15e4a8254-deps-0.1.0/target.tar.zst to target
79.57 s
gammaloop-nextest-binaries-clinnet-clinnet> Running phase: updateAutotoolsGnuConfigScriptsPhase
79.62 s
gammaloop-nextest-binaries-clinnet-clinnet> Running phase: configurePhase
79.62 s
gammaloop-nextest-binaries-clinnet-clinnet> will append /build/source/.cargo-home/config.toml with contents of /nix/store/w72xdqk1lvxyqjazv52iqg1ir83d7798-vendor-cargo-deps/config.toml
79.63 s
gammaloop-nextest-binaries-clinnet-clinnet> default configurePhase, nothing to do
79.63 s
gammaloop-nextest-binaries-clinnet-clinnet> Running phase: buildPhase
79.63 s
gammaloop-nextest-binaries-clinnet-clinnet> +++ command cargo --version
79.64 s
gammaloop-nextest-binaries-clinnet-clinnet> cargo 1.98.1 (797e8a9bc 2026-08-05)
79.71 s
gammaloop-nextest-binaries-clinnet-clinnet> +++ command cargo nextest --version
79.72 s
gammaloop-nextest-binaries-clinnet-clinnet> cargo-nextest 0.9.143
79.72 s
gammaloop-nextest-binaries-clinnet-clinnet> release: 0.9.143
79.72 s
gammaloop-nextest-binaries-clinnet-clinnet> host: x86_64-unknown-linux-gnu
79.73 s
gammaloop-nextest-binaries-clinnet-clinnet> +++ command cargo nextest archive --cargo-profile ci-optim --offline -p clinnet -E 'package(clinnet)' --profile ci_gammaloop --archive-file /nix/store/i67h69n51qpqmxazmhq1rz4783fpgdi8-gammaloop-nextest-binaries-clinnet-clinnet-0.1.0/gammaloop-nextest-clinnet-clinnet.tar.zst
80.78 s
gammaloop-nextest-binaries-clinnet-clinnet> Finished `ci-optim` profile [optimized] target(s) in 0.32s
80.82 s
gammaloop-nextest-binaries-clinnet-clinnet> Archiving 4 binaries (including 1 non-test binary), 1 build script output directory, 1 linked path, and 1 standard library to /nix/store/i67h69n51qpqmxazmhq1rz4783fpgdi8-gammaloop-nextest-binaries-clinnet-clinnet-0.1.0/gammaloop-nextest-clinnet-clinnet.tar.zst
81.01 s
gammaloop-nextest-binaries-clinnet-clinnet> Archived 16 files to /nix/store/i67h69n51qpqmxazmhq1rz4783fpgdi8-gammaloop-nextest-binaries-clinnet-clinnet-0.1.0/gammaloop-nextest-clinnet-clinnet.tar.zst in 0.19s
81.03 s
gammaloop-nextest-binaries-clinnet-clinnet> Running phase: installPhase
81.03 s
gammaloop-nextest-binaries-clinnet-clinnet> Running phase: fixupPhase
81.05 s
gammaloop-nextest-binaries-clinnet-clinnet> shrinking RPATHs of ELF executables and libraries in /nix/store/i67h69n51qpqmxazmhq1rz4783fpgdi8-gammaloop-nextest-binaries-clinnet-clinnet-0.1.0
81.05 s
gammaloop-nextest-binaries-clinnet-clinnet> checking for references to /build/ in /nix/store/i67h69n51qpqmxazmhq1rz4783fpgdi8-gammaloop-nextest-binaries-clinnet-clinnet-0.1.0...
81.06 s
gammaloop-nextest-binaries-clinnet-clinnet> patching script interpreter paths in /nix/store/i67h69n51qpqmxazmhq1rz4783fpgdi8-gammaloop-nextest-binaries-clinnet-clinnet-0.1.0
81.93 s
gammaloop-nextest-binaries-clinnet-clinnet (post)> Uploading to the NixCI cache: /nix/store/i67h69n51qpqmxazmhq1rz4783fpgdi8-gammaloop-nextest-binaries-clinnet-clinnet-0.1.0
82.21 s
gammaloop-nextest-binaries-clinnet-clinnet (post)> warning: 'warn-short-path-literals' is deprecated, use 'lint-short-path-literals = ignore' instead
82.23 s
gammaloop-nextest-binaries-clinnet-clinnet (post)> copying 1 paths...
82.23 s
gammaloop-nextest-binaries-clinnet-clinnet (post)> copying path '/nix/store/i67h69n51qpqmxazmhq1rz4783fpgdi8-gammaloop-nextest-binaries-clinnet-clinnet-0.1.0' to 'https://cache.nix-ci.com'...
87.46 s
gammaloop-nextest-binaries-clinnet-clinnet (post)> warning: 'warn-short-path-literals' is deprecated, use 'lint-short-path-literals = ignore' instead
87.75 s
gammaloop-nextest-binaries-clinnet-clinnet (post)> copying 0 paths...
88.34 s
[5 /8 built, 76 copied (1
[1 /5 /7 built, 76 copied gammaloop-nextest-binaries-clinnet (post)> Uploading to the NixCI cache: /nix/store/r6d9ks0lpr631mrcy43137c895a0w5ns-gammaloop-nextest-binaries-clinnet
88.58 s
gammaloop-nextest-binaries-clinnet (post)> warning: 'warn-short-path-literals' is deprecated, use 'lint-short-path-literals = ignore' instead
88.62 s
gammaloop-nextest-binaries-clinnet (post)> copying 1 paths...
88.62 s
gammaloop-nextest-binaries-clinnet (post)> copying path '/nix/store/r6d9ks0lpr631mrcy43137c895a0w5ns-gammaloop-nextest-binaries-clinnet' to 'https://cache.nix-ci.com'...
89.37 s
gammaloop-nextest-binaries-clinnet (post)> warning: 'warn-short-path-literals' is deprecated, use 'lint-short-path-literals = ignore' instead
89.54 s
gammaloop-nextest-binaries-clinnet (post)> copying 0 paths...
90.07 s
[6 /8 built, 76 copied (1
[1 /6 /7 built, 76 copied gammaloop-nextest-clinnet> Nextest worker budget: 16
90.09 s
gammaloop-nextest-clinnet> Extracting 4 binaries (including 1 non-test binary), 1 build script output directory, and 1 linked path to /build/source
90.18 s
gammaloop-nextest-clinnet> Extracted 16 files to /build/source in 0.10s
90.23 s
gammaloop-nextest-clinnet> ------------
90.23 s
gammaloop-nextest-clinnet> Nextest run ID 79d01ed4-7032-4f24-a6e1-ddee5f9988b9 with nextest profile: ci_gammaloop
90.23 s
gammaloop-nextest-clinnet> Starting 38 tests across 3 binaries
201.12 s
gammaloop-nextest-clinnet> FAIL [ 110.786s] (32/38) clinnet::public_typst_behavior public_linnest_labels_follow_their_carriers
201.12 s
gammaloop-nextest-clinnet> stdout ---
201.12 s
gammaloop-nextest-clinnet>
201.12 s
gammaloop-nextest-clinnet> running 1 test
201.12 s
gammaloop-nextest-clinnet> test public_linnest_labels_follow_their_carriers has been running for over 60 seconds
201.12 s
gammaloop-nextest-clinnet> test public_linnest_labels_follow_their_carriers ... FAILED
201.12 s
gammaloop-nextest-clinnet>
201.12 s
gammaloop-nextest-clinnet> failures:
201.12 s
gammaloop-nextest-clinnet>
201.12 s
gammaloop-nextest-clinnet> failures:
201.12 s
gammaloop-nextest-clinnet> public_linnest_labels_follow_their_carriers
201.12 s
gammaloop-nextest-clinnet>
201.12 s
gammaloop-nextest-clinnet> test result: FAILED. 0 passed; 1 failed; 0 ignored; 0 measured; 17 filtered out; finished in 110.77s
201.12 s
gammaloop-nextest-clinnet>
201.12 s
gammaloop-nextest-clinnet> stderr ---
201.12 s
gammaloop-nextest-clinnet>
201.12 s
gammaloop-nextest-clinnet> thread 'public_linnest_labels_follow_their_carriers' (277) panicked at crates/clinnet/tests/public_typst_behavior.rs:81:55:
201.12 s
gammaloop-nextest-clinnet> called `Result::unwrap()` on an `Err` value: typst failed while compiling template /build/.tmpnhpX4R/.clinnet/templates/linnest-public-behavior.svg
201.12 s
gammaloop-nextest-clinnet>
201.12 s
gammaloop-nextest-clinnet> Command executed:
201.12 s
gammaloop-nextest-clinnet> "typst" "c" "/build/.tmpnhpX4R/.clinnet/templates/linnest-public-behavior.typ" "/build/.tmpnhpX4R/.clinnet/templates/linnest-public-behavior.svg" "--root" "/build/.tmpnhpX4R/.clinnet/templates"
201.12 s
gammaloop-nextest-clinnet>
201.12 s
gammaloop-nextest-clinnet> Typst stdout:
201.12 s
gammaloop-nextest-clinnet>
201.12 s
gammaloop-nextest-clinnet>
201.12 s
gammaloop-nextest-clinnet> Typst stderr:
201.12 s
gammaloop-nextest-clinnet>
201.12 s
gammaloop-nextest-clinnet>
201.12 s
gammaloop-nextest-clinnet> Location:
201.12 s
gammaloop-nextest-clinnet> crates/clinnet/src/lib.rs:741:13
201.12 s
gammaloop-nextest-clinnet> stack backtrace:
201.12 s
gammaloop-nextest-clinnet> 0: __rustc::rust_begin_unwind
201.12 s
gammaloop-nextest-clinnet> 1: core::panicking::panic_fmt
201.12 s
gammaloop-nextest-clinnet> 2: core::result::unwrap_failed
201.12 s
gammaloop-nextest-clinnet> 3: public_typst_behavior::render
201.12 s
gammaloop-nextest-clinnet> 4: <std::sync::once::Once>::call_once_force::<<std::sync::once_lock::OnceLock<alloc::string::String>>::initialize<<std::sync::once_lock::OnceLock<alloc::string::String>>::get_or_init<public_typst_behavior::linnest_public_svg::{closure#0}>::{closure#0}, !>::{closure#0}>::{closure#0}
201.12 s
gammaloop-nextest-clinnet> 5: <std::sys::sync::once::futex::Once>::call
201.12 s
gammaloop-nextest-clinnet> 6: <std::sync::once_lock::OnceLock<alloc::string::String>>::initialize::<<std::sync::once_lock::OnceLock<alloc::string::String>>::get_or_init<public_typst_behavior::linnest_public_svg::{closure#0}>::{closure#0}, !>
201.12 s
gammaloop-nextest-clinnet> 7: <public_typst_behavior::public_linnest_labels_follow_their_carriers::{closure#0} as core::ops::function::FnOnce<()>>::call_once
201.12 s
gammaloop-nextest-clinnet> note: Some details are omitted, run with `RUST_BACKTRACE=full` for a verbose backtrace.
201.12 s
gammaloop-nextest-clinnet>
206.34 s
gammaloop-nextest-clinnet> FAIL [ 116.007s] (33/38) clinnet::public_typst_behavior public_linnest_edge_styles_skip_fallbacks
206.34 s
gammaloop-nextest-clinnet> stdout ---
206.34 s
gammaloop-nextest-clinnet>
206.34 s
gammaloop-nextest-clinnet> running 1 test
206.34 s
gammaloop-nextest-clinnet> test public_linnest_edge_styles_skip_fallbacks has been running for over 60 seconds
206.34 s
gammaloop-nextest-clinnet> test public_linnest_edge_styles_skip_fallbacks ... FAILED
206.34 s
gammaloop-nextest-clinnet>
206.34 s
gammaloop-nextest-clinnet> failures:
206.34 s
gammaloop-nextest-clinnet>
206.34 s
gammaloop-nextest-clinnet> failures:
206.34 s
gammaloop-nextest-clinnet> public_linnest_edge_styles_skip_fallbacks
206.34 s
gammaloop-nextest-clinnet>
206.34 s
gammaloop-nextest-clinnet> test result: FAILED. 0 passed; 1 failed; 0 ignored; 0 measured; 17 filtered out; finished in 115.99s
206.34 s
gammaloop-nextest-clinnet>
206.34 s
gammaloop-nextest-clinnet> stderr ---
206.34 s
gammaloop-nextest-clinnet>
206.34 s
gammaloop-nextest-clinnet> thread 'public_linnest_edge_styles_skip_fallbacks' (280) panicked at crates/clinnet/tests/public_typst_behavior.rs:81:55:
206.34 s
gammaloop-nextest-clinnet> called `Result::unwrap()` on an `Err` value: typst failed while compiling template /build/.tmp8UiuE8/.clinnet/templates/linnest-public-behavior.svg
206.34 s
gammaloop-nextest-clinnet>
206.34 s
gammaloop-nextest-clinnet> Command executed:
206.34 s
gammaloop-nextest-clinnet> "typst" "c" "/build/.tmp8UiuE8/.clinnet/templates/linnest-public-behavior.typ" "/build/.tmp8UiuE8/.clinnet/templates/linnest-public-behavior.svg" "--root" "/build/.tmp8UiuE8/.clinnet/templates"
206.34 s
gammaloop-nextest-clinnet>
206.34 s
gammaloop-nextest-clinnet> Typst stdout:
206.34 s
gammaloop-nextest-clinnet>
206.34 s
gammaloop-nextest-clinnet>
206.34 s
gammaloop-nextest-clinnet> Typst stderr:
206.34 s
gammaloop-nextest-clinnet>
206.34 s
gammaloop-nextest-clinnet>
206.34 s
gammaloop-nextest-clinnet> Location:
206.34 s
gammaloop-nextest-clinnet> crates/clinnet/src/lib.rs:741:13
206.34 s
gammaloop-nextest-clinnet> stack backtrace:
206.34 s
gammaloop-nextest-clinnet> 0: __rustc::rust_begin_unwind
206.34 s
gammaloop-nextest-clinnet> 1: core::panicking::panic_fmt
206.34 s
gammaloop-nextest-clinnet> 2: core::result::unwrap_failed
206.34 s
gammaloop-nextest-clinnet> 3: public_typst_behavior::render
206.34 s
gammaloop-nextest-clinnet> 4: <std::sync::once::Once>::call_once_force::<<std::sync::once_lock::OnceLock<alloc::string::String>>::initialize<<std::sync::once_lock::OnceLock<alloc::string::String>>::get_or_init<public_typst_behavior::linnest_public_svg::{closure#0}>::{closure#0}, !>::{closure#0}>::{closure#0}
206.34 s
gammaloop-nextest-clinnet> 5: <std::sys::sync::once::futex::Once>::call
206.34 s
gammaloop-nextest-clinnet> 6: <std::sync::once_lock::OnceLock<alloc::string::String>>::initialize::<<std::sync::once_lock::OnceLock<alloc::string::String>>::get_or_init<public_typst_behavior::linnest_public_svg::{closure#0}>::{closure#0}, !>
206.34 s
gammaloop-nextest-clinnet> 7: <public_typst_behavior::public_linnest_edge_styles_skip_fallbacks::{closure#0} as core::ops::function::FnOnce<()>>::call_once
206.34 s
gammaloop-nextest-clinnet> note: Some details are omitted, run with `RUST_BACKTRACE=full` for a verbose backtrace.
206.34 s
gammaloop-nextest-clinnet>
216.77 s
gammaloop-nextest-clinnet> FAIL [ 126.436s] (34/38) clinnet::public_typst_behavior public_linnest_endpoint_anchor_distances_stay_local
216.77 s
gammaloop-nextest-clinnet> stdout ---
216.77 s
gammaloop-nextest-clinnet>
216.77 s
gammaloop-nextest-clinnet> running 1 test
216.77 s
gammaloop-nextest-clinnet> test public_linnest_endpoint_anchor_distances_stay_local has been running for over 60 seconds
216.77 s
gammaloop-nextest-clinnet> test public_linnest_endpoint_anchor_distances_stay_local ... FAILED
216.77 s
gammaloop-nextest-clinnet>
216.77 s
gammaloop-nextest-clinnet> failures:
216.77 s
gammaloop-nextest-clinnet>
216.77 s
gammaloop-nextest-clinnet> failures:
216.77 s
gammaloop-nextest-clinnet> public_linnest_endpoint_anchor_distances_stay_local
216.77 s
gammaloop-nextest-clinnet>
216.77 s
gammaloop-nextest-clinnet> test result: FAILED. 0 passed; 1 failed; 0 ignored; 0 measured; 17 filtered out; finished in 126.43s
216.77 s
gammaloop-nextest-clinnet>
216.77 s
gammaloop-nextest-clinnet> stderr ---
216.77 s
gammaloop-nextest-clinnet>
216.77 s
gammaloop-nextest-clinnet> thread 'public_linnest_endpoint_anchor_distances_stay_local' (273) panicked at crates/clinnet/tests/public_typst_behavior.rs:81:55:
216.77 s
gammaloop-nextest-clinnet> called `Result::unwrap()` on an `Err` value: typst failed while compiling template /build/.tmp6IvFIA/.clinnet/templates/linnest-public-behavior.svg
216.77 s
gammaloop-nextest-clinnet>
216.77 s
gammaloop-nextest-clinnet> Command executed:
216.77 s
gammaloop-nextest-clinnet> "typst" "c" "/build/.tmp6IvFIA/.clinnet/templates/linnest-public-behavior.typ" "/build/.tmp6IvFIA/.clinnet/templates/linnest-public-behavior.svg" "--root" "/build/.tmp6IvFIA/.clinnet/templates"
216.77 s
gammaloop-nextest-clinnet>
216.77 s
gammaloop-nextest-clinnet> Typst stdout:
216.77 s
gammaloop-nextest-clinnet>
216.77 s
gammaloop-nextest-clinnet>
216.77 s
gammaloop-nextest-clinnet> Typst stderr:
216.77 s
gammaloop-nextest-clinnet>
216.77 s
gammaloop-nextest-clinnet>
216.77 s
gammaloop-nextest-clinnet> Location:
216.77 s
gammaloop-nextest-clinnet> crates/clinnet/src/lib.rs:741:13
216.77 s
gammaloop-nextest-clinnet> stack backtrace:
216.77 s
gammaloop-nextest-clinnet> 0: __rustc::rust_begin_unwind
216.77 s
gammaloop-nextest-clinnet> 1: core::panicking::panic_fmt
216.77 s
gammaloop-nextest-clinnet> 2: core::result::unwrap_failed
216.77 s
gammaloop-nextest-clinnet> 3: public_typst_behavior::render
216.77 s
gammaloop-nextest-clinnet> 4: <std::sync::once::Once>::call_once_force::<<std::sync::once_lock::OnceLock<alloc::string::String>>::initialize<<std::sync::once_lock::OnceLock<alloc::string::String>>::get_or_init<public_typst_behavior::linnest_public_svg::{closure#0}>::{closure#0}, !>::{closure#0}>::{closure#0}
216.77 s
gammaloop-nextest-clinnet> 5: <std::sys::sync::once::futex::Once>::call
216.77 s
gammaloop-nextest-clinnet> 6: <std::sync::once_lock::OnceLock<alloc::string::String>>::initialize::<<std::sync::once_lock::OnceLock<alloc::string::String>>::get_or_init<public_typst_behavior::linnest_public_svg::{closure#0}>::{closure#0}, !>
216.77 s
gammaloop-nextest-clinnet> 7: <public_typst_behavior::public_linnest_endpoint_anchor_distances_stay_local::{closure#0} as core::ops::function::FnOnce<()>>::call_once
216.77 s
gammaloop-nextest-clinnet> note: Some details are omitted, run with `RUST_BACKTRACE=full` for a verbose backtrace.
216.77 s
gammaloop-nextest-clinnet>
232.28 s
gammaloop-nextest-clinnet> ------------
232.28 s
gammaloop-nextest-clinnet> Summary [ 142.045s] 38 tests run: 35 passed (4 slow ), 3 failed , 0 skipped
232.28 s
gammaloop-nextest-clinnet> FAIL [ 110.786s] (32/38) clinnet::public_typst_behavior public_linnest_labels_follow_their_carriers
232.28 s
gammaloop-nextest-clinnet> stdout ---
232.28 s
gammaloop-nextest-clinnet>
232.28 s
gammaloop-nextest-clinnet> running 1 test
232.28 s
gammaloop-nextest-clinnet> test public_linnest_labels_follow_their_carriers has been running for over 60 seconds
232.28 s
gammaloop-nextest-clinnet> test public_linnest_labels_follow_their_carriers ... FAILED
232.28 s
gammaloop-nextest-clinnet>
232.28 s
gammaloop-nextest-clinnet> failures:
232.28 s
gammaloop-nextest-clinnet>
232.28 s
gammaloop-nextest-clinnet> failures:
232.28 s
gammaloop-nextest-clinnet> public_linnest_labels_follow_their_carriers
232.28 s
gammaloop-nextest-clinnet>
232.28 s
gammaloop-nextest-clinnet> test result: FAILED. 0 passed; 1 failed; 0 ignored; 0 measured; 17 filtered out; finished in 110.77s
232.28 s
gammaloop-nextest-clinnet>
232.28 s
gammaloop-nextest-clinnet> stderr ---
232.28 s
gammaloop-nextest-clinnet>
232.28 s
gammaloop-nextest-clinnet> thread 'public_linnest_labels_follow_their_carriers' (277) panicked at crates/clinnet/tests/public_typst_behavior.rs:81:55:
232.28 s
gammaloop-nextest-clinnet> called `Result::unwrap()` on an `Err` value: typst failed while compiling template /build/.tmpnhpX4R/.clinnet/templates/linnest-public-behavior.svg
232.28 s
gammaloop-nextest-clinnet>
232.28 s
gammaloop-nextest-clinnet> Command executed:
232.28 s
gammaloop-nextest-clinnet> "typst" "c" "/build/.tmpnhpX4R/.clinnet/templates/linnest-public-behavior.typ" "/build/.tmpnhpX4R/.clinnet/templates/linnest-public-behavior.svg" "--root" "/build/.tmpnhpX4R/.clinnet/templates"
232.28 s
gammaloop-nextest-clinnet>
232.28 s
gammaloop-nextest-clinnet> Typst stdout:
232.28 s
gammaloop-nextest-clinnet>
232.28 s
gammaloop-nextest-clinnet>
232.28 s
gammaloop-nextest-clinnet> Typst stderr:
232.28 s
gammaloop-nextest-clinnet>
232.28 s
gammaloop-nextest-clinnet>
232.28 s
gammaloop-nextest-clinnet> Location:
232.28 s
gammaloop-nextest-clinnet> crates/clinnet/src/lib.rs:741:13
232.28 s
gammaloop-nextest-clinnet> stack backtrace:
232.28 s
gammaloop-nextest-clinnet> 0: __rustc::rust_begin_unwind
232.28 s
gammaloop-nextest-clinnet> 1: core::panicking::panic_fmt
232.28 s
gammaloop-nextest-clinnet> 2: core::result::unwrap_failed
232.28 s
gammaloop-nextest-clinnet> 3: public_typst_behavior::render
232.28 s
gammaloop-nextest-clinnet> 4: <std::sync::once::Once>::call_once_force::<<std::sync::once_lock::OnceLock<alloc::string::String>>::initialize<<std::sync::once_lock::OnceLock<alloc::string::String>>::get_or_init<public_typst_behavior::linnest_public_svg::{closure#0}>::{closure#0}, !>::{closure#0}>::{closure#0}
232.28 s
gammaloop-nextest-clinnet> 5: <std::sys::sync::once::futex::Once>::call
232.28 s
gammaloop-nextest-clinnet> 6: <std::sync::once_lock::OnceLock<alloc::string::String>>::initialize::<<std::sync::once_lock::OnceLock<alloc::string::String>>::get_or_init<public_typst_behavior::linnest_public_svg::{closure#0}>::{closure#0}, !>
232.28 s
gammaloop-nextest-clinnet> 7: <public_typst_behavior::public_linnest_labels_follow_their_carriers::{closure#0} as core::ops::function::FnOnce<()>>::call_once
232.28 s
gammaloop-nextest-clinnet> note: Some details are omitted, run with `RUST_BACKTRACE=full` for a verbose backtrace.
232.28 s
gammaloop-nextest-clinnet>
232.28 s
gammaloop-nextest-clinnet> FAIL [ 116.007s] (33/38) clinnet::public_typst_behavior public_linnest_edge_styles_skip_fallbacks
232.28 s
gammaloop-nextest-clinnet> stdout ---
232.28 s
gammaloop-nextest-clinnet>
232.28 s
gammaloop-nextest-clinnet> running 1 test
232.28 s
gammaloop-nextest-clinnet> test public_linnest_edge_styles_skip_fallbacks has been running for over 60 seconds
232.28 s
gammaloop-nextest-clinnet> test public_linnest_edge_styles_skip_fallbacks ... FAILED
232.28 s
gammaloop-nextest-clinnet>
232.28 s
gammaloop-nextest-clinnet> failures:
232.28 s
gammaloop-nextest-clinnet>
232.28 s
gammaloop-nextest-clinnet> failures:
232.28 s
gammaloop-nextest-clinnet> public_linnest_edge_styles_skip_fallbacks
232.28 s
gammaloop-nextest-clinnet>
232.28 s
gammaloop-nextest-clinnet> test result: FAILED. 0 passed; 1 failed; 0 ignored; 0 measured; 17 filtered out; finished in 115.99s
232.28 s
gammaloop-nextest-clinnet>
232.28 s
gammaloop-nextest-clinnet> stderr ---
232.28 s
gammaloop-nextest-clinnet>
232.28 s
gammaloop-nextest-clinnet> thread 'public_linnest_edge_styles_skip_fallbacks' (280) panicked at crates/clinnet/tests/public_typst_behavior.rs:81:55:
232.28 s
gammaloop-nextest-clinnet> called `Result::unwrap()` on an `Err` value: typst failed while compiling template /build/.tmp8UiuE8/.clinnet/templates/linnest-public-behavior.svg
232.28 s
gammaloop-nextest-clinnet>
232.28 s
gammaloop-nextest-clinnet> Command executed:
232.28 s
gammaloop-nextest-clinnet> "typst" "c" "/build/.tmp8UiuE8/.clinnet/templates/linnest-public-behavior.typ" "/build/.tmp8UiuE8/.clinnet/templates/linnest-public-behavior.svg" "--root" "/build/.tmp8UiuE8/.clinnet/templates"
232.28 s
gammaloop-nextest-clinnet>
232.28 s
gammaloop-nextest-clinnet> Typst stdout:
232.28 s
gammaloop-nextest-clinnet>
232.28 s
gammaloop-nextest-clinnet>
232.28 s
gammaloop-nextest-clinnet> Typst stderr:
232.28 s
gammaloop-nextest-clinnet>
232.28 s
gammaloop-nextest-clinnet>
232.28 s
gammaloop-nextest-clinnet> Location:
232.28 s
gammaloop-nextest-clinnet> crates/clinnet/src/lib.rs:741:13
232.28 s
gammaloop-nextest-clinnet> stack backtrace:
232.28 s
gammaloop-nextest-clinnet> 0: __rustc::rust_begin_unwind
232.28 s
gammaloop-nextest-clinnet> 1: core::panicking::panic_fmt
232.28 s
gammaloop-nextest-clinnet> 2: core::result::unwrap_failed
232.28 s
gammaloop-nextest-clinnet> 3: public_typst_behavior::render
232.28 s
gammaloop-nextest-clinnet> 4: <std::sync::once::Once>::call_once_force::<<std::sync::once_lock::OnceLock<alloc::string::String>>::initialize<<std::sync::once_lock::OnceLock<alloc::string::String>>::get_or_init<public_typst_behavior::linnest_public_svg::{closure#0}>::{closure#0}, !>::{closure#0}>::{closure#0}
232.28 s
gammaloop-nextest-clinnet> 5: <std::sys::sync::once::futex::Once>::call
232.28 s
gammaloop-nextest-clinnet> 6: <std::sync::once_lock::OnceLock<alloc::string::String>>::initialize::<<std::sync::once_lock::OnceLock<alloc::string::String>>::get_or_init<public_typst_behavior::linnest_public_svg::{closure#0}>::{closure#0}, !>
232.28 s
gammaloop-nextest-clinnet> 7: <public_typst_behavior::public_linnest_edge_styles_skip_fallbacks::{closure#0} as core::ops::function::FnOnce<()>>::call_once
232.28 s
gammaloop-nextest-clinnet> note: Some details are omitted, run with `RUST_BACKTRACE=full` for a verbose backtrace.
232.28 s
gammaloop-nextest-clinnet>
232.28 s
gammaloop-nextest-clinnet> FAIL [ 126.436s] (34/38) clinnet::public_typst_behavior public_linnest_endpoint_anchor_distances_stay_local
232.28 s
gammaloop-nextest-clinnet> stdout ---
232.28 s
gammaloop-nextest-clinnet>
232.28 s
gammaloop-nextest-clinnet> running 1 test
232.28 s
gammaloop-nextest-clinnet> test public_linnest_endpoint_anchor_distances_stay_local has been running for over 60 seconds
232.28 s
gammaloop-nextest-clinnet> test public_linnest_endpoint_anchor_distances_stay_local ... FAILED
232.28 s
gammaloop-nextest-clinnet>
232.28 s
gammaloop-nextest-clinnet> failures:
232.28 s
gammaloop-nextest-clinnet>
232.28 s
gammaloop-nextest-clinnet> failures:
232.28 s
gammaloop-nextest-clinnet> public_linnest_endpoint_anchor_distances_stay_local
232.28 s
gammaloop-nextest-clinnet>
232.28 s
gammaloop-nextest-clinnet> test result: FAILED. 0 passed; 1 failed; 0 ignored; 0 measured; 17 filtered out; finished in 126.43s
232.28 s
gammaloop-nextest-clinnet>
232.28 s
gammaloop-nextest-clinnet> stderr ---
232.28 s
gammaloop-nextest-clinnet>
232.28 s
gammaloop-nextest-clinnet> thread 'public_linnest_endpoint_anchor_distances_stay_local' (273) panicked at crates/clinnet/tests/public_typst_behavior.rs:81:55:
232.28 s
gammaloop-nextest-clinnet> called `Result::unwrap()` on an `Err` value: typst failed while compiling template /build/.tmp6IvFIA/.clinnet/templates/linnest-public-behavior.svg
232.28 s
gammaloop-nextest-clinnet>
232.28 s
gammaloop-nextest-clinnet> Command executed:
232.28 s
gammaloop-nextest-clinnet> "typst" "c" "/build/.tmp6IvFIA/.clinnet/templates/linnest-public-behavior.typ" "/build/.tmp6IvFIA/.clinnet/templates/linnest-public-behavior.svg" "--root" "/build/.tmp6IvFIA/.clinnet/templates"
232.28 s
gammaloop-nextest-clinnet>
232.28 s
gammaloop-nextest-clinnet> Typst stdout:
232.28 s
gammaloop-nextest-clinnet>
232.28 s
gammaloop-nextest-clinnet>
232.28 s
gammaloop-nextest-clinnet> Typst stderr:
232.28 s
gammaloop-nextest-clinnet>
232.28 s
gammaloop-nextest-clinnet>
232.28 s
gammaloop-nextest-clinnet> Location:
232.28 s
gammaloop-nextest-clinnet> crates/clinnet/src/lib.rs:741:13
232.28 s
gammaloop-nextest-clinnet> stack backtrace:
232.28 s
gammaloop-nextest-clinnet> 0: __rustc::rust_begin_unwind
232.28 s
gammaloop-nextest-clinnet> 1: core::panicking::panic_fmt
232.28 s
gammaloop-nextest-clinnet> 2: core::result::unwrap_failed
232.28 s
gammaloop-nextest-clinnet> 3: public_typst_behavior::render
232.28 s
gammaloop-nextest-clinnet> 4: <std::sync::once::Once>::call_once_force::<<std::sync::once_lock::OnceLock<alloc::string::String>>::initialize<<std::sync::once_lock::OnceLock<alloc::string::String>>::get_or_init<public_typst_behavior::linnest_public_svg::{closure#0}>::{closure#0}, !>::{closure#0}>::{closure#0}
232.28 s
gammaloop-nextest-clinnet> 5: <std::sys::sync::once::futex::Once>::call
232.28 s
gammaloop-nextest-clinnet> 6: <std::sync::once_lock::OnceLock<alloc::string::String>>::initialize::<<std::sync::once_lock::OnceLock<alloc::string::String>>::get_or_init<public_typst_behavior::linnest_public_svg::{closure#0}>::{closure#0}, !>
232.28 s
gammaloop-nextest-clinnet> 7: <public_typst_behavior::public_linnest_endpoint_anchor_distances_stay_local::{closure#0} as core::ops::function::FnOnce<()>>::call_once
232.28 s
gammaloop-nextest-clinnet> note: Some details are omitted, run with `RUST_BACKTRACE=full` for a verbose backtrace.
232.29 s
gammaloop-nextest-clinnet>
232.29 s
gammaloop-nextest-clinnet> error : test run failed
232.53 s
gammaloop-nextest-clinnet>
232.53 s
gammaloop-nextest-clinnet> ========== nextest test summary ==========
232.53 s
gammaloop-nextest-clinnet> report: target/nextest/ci_gammaloop/junit.xml
232.53 s
gammaloop-nextest-clinnet> tests: 38, failures: 3, errors: 0
232.53 s
gammaloop-nextest-clinnet>
232.53 s
gammaloop-nextest-clinnet> 1. clinnet::public_typst_behavior::public_linnest_labels_follow_their_carriers
232.53 s
gammaloop-nextest-clinnet> failure: test failure with exit code 101
232.53 s
gammaloop-nextest-clinnet> thread 'public_linnest_labels_follow_their_carriers' (277) panicked at crates/clinnet/tests/public_typst_behavior.rs:81:55:
232.53 s
gammaloop-nextest-clinnet> called `Result::unwrap()` on an `Err` value: typst failed while compiling template /build/.tmpnhpX4R/.clinnet/templates/linnest-public-behavior.svg
232.53 s
gammaloop-nextest-clinnet>
232.53 s
gammaloop-nextest-clinnet> Command executed:
232.53 s
gammaloop-nextest-clinnet> "typst" "c" "/build/.tmpnhpX4R/.clinnet/templates/linnest-public-behavior.typ" "/build/.tmpnhpX4R/.clinnet/templates/linnest-public-behavior.svg" "--root" "/build/.tmpnhpX4R/.clinnet/templates"
232.53 s
gammaloop-nextest-clinnet>
232.53 s
gammaloop-nextest-clinnet> Typst stdout:
232.53 s
gammaloop-nextest-clinnet>
232.53 s
gammaloop-nextest-clinnet>
232.53 s
gammaloop-nextest-clinnet> Typst stderr:
232.53 s
gammaloop-nextest-clinnet>
232.53 s
gammaloop-nextest-clinnet>
232.53 s
gammaloop-nextest-clinnet> Location:
232.53 s
gammaloop-nextest-clinnet> crates/clinnet/src/lib.rs:741:13
232.53 s
gammaloop-nextest-clinnet> stack backtrace:
232.53 s
gammaloop-nextest-clinnet> 0: __rustc::rust_begin_unwind
232.53 s
gammaloop-nextest-clinnet> 1: core::panicking::panic_fmt
232.53 s
gammaloop-nextest-clinnet> 2: core::result::unwrap_failed
232.53 s
gammaloop-nextest-clinnet> 3: public_typst_behavior::render
232.53 s
gammaloop-nextest-clinnet> 4: <std::sync::once::Once>::call_once_force::<<std::sync::once_lock::OnceLock<alloc::string::String>>::initialize<<std::sync::once_lock::OnceLock<alloc::string::String>>::get_or_init<public_typst_behavior::linnest_public_svg::{closure#0}>::{closure#0}, !>::{closure#0}>::{closure#0}
232.53 s
gammaloop-nextest-clinnet> 5: <std::sys::sync::once::futex::Once>::call
232.53 s
gammaloop-nextest-clinnet> 6: <std::sync::once_lock::OnceLock<alloc::string::String>>::initialize::<<std::sync::once_lock::OnceLock<alloc::string::String>>::get_or_init<public_typst_behavior::linnest_public_svg::{closure#0}>::{closure#0}, !>
232.53 s
gammaloop-nextest-clinnet> 7: <public_typst_behavior::public_linnest_labels_follow_their_carriers::{closure#0} as core::ops::function::FnOnce<()>>::call_once
232.53 s
gammaloop-nextest-clinnet> note: Some details are omitted, run with `RUST_BACKTRACE=full` for a verbose backtrace.
232.53 s
gammaloop-nextest-clinnet> system-out
232.53 s
gammaloop-nextest-clinnet> running 1 test
232.53 s
gammaloop-nextest-clinnet> test public_linnest_labels_follow_their_carriers has been running for over 60 seconds
232.53 s
gammaloop-nextest-clinnet> test public_linnest_labels_follow_their_carriers ... FAILED
232.53 s
gammaloop-nextest-clinnet>
232.53 s
gammaloop-nextest-clinnet> failures:
232.53 s
gammaloop-nextest-clinnet>
232.53 s
gammaloop-nextest-clinnet> failures:
232.53 s
gammaloop-nextest-clinnet> public_linnest_labels_follow_their_carriers
232.53 s
gammaloop-nextest-clinnet>
232.53 s
gammaloop-nextest-clinnet> test result: FAILED. 0 passed; 1 failed; 0 ignored; 0 measured; 17 filtered out; finished in 110.77s
232.53 s
gammaloop-nextest-clinnet> system-err
232.53 s
gammaloop-nextest-clinnet> thread 'public_linnest_labels_follow_their_carriers' (277) panicked at crates/clinnet/tests/public_typst_behavior.rs:81:55:
232.53 s
gammaloop-nextest-clinnet> called `Result::unwrap()` on an `Err` value: typst failed while compiling template /build/.tmpnhpX4R/.clinnet/templates/linnest-public-behavior.svg
232.53 s
gammaloop-nextest-clinnet>
232.53 s
gammaloop-nextest-clinnet> Command executed:
232.53 s
gammaloop-nextest-clinnet> "typst" "c" "/build/.tmpnhpX4R/.clinnet/templates/linnest-public-behavior.typ" "/build/.tmpnhpX4R/.clinnet/templates/linnest-public-behavior.svg" "--root" "/build/.tmpnhpX4R/.clinnet/templates"
232.53 s
gammaloop-nextest-clinnet>
232.53 s
gammaloop-nextest-clinnet> Typst stdout:
232.53 s
gammaloop-nextest-clinnet>
232.53 s
gammaloop-nextest-clinnet>
232.53 s
gammaloop-nextest-clinnet> Typst stderr:
232.53 s
gammaloop-nextest-clinnet>
232.53 s
gammaloop-nextest-clinnet>
232.53 s
gammaloop-nextest-clinnet> Location:
232.53 s
gammaloop-nextest-clinnet> crates/clinnet/src/lib.rs:741:13
232.53 s
gammaloop-nextest-clinnet> stack backtrace:
232.53 s
gammaloop-nextest-clinnet> 0: __rustc::rust_begin_unwind
232.53 s
gammaloop-nextest-clinnet> 1: core::panicking::panic_fmt
232.53 s
gammaloop-nextest-clinnet> 2: core::result::unwrap_failed
232.53 s
gammaloop-nextest-clinnet> 3: public_typst_behavior::render
232.53 s
gammaloop-nextest-clinnet> 4: <std::sync::once::Once>::call_once_force::<<std::sync::once_lock::OnceLock<alloc::string::String>>::initialize<<std::sync::once_lock::OnceLock<alloc::string::String>>::get_or_init<public_typst_behavior::linnest_public_svg::{closure#0}>::{closure#0}, !>::{closure#0}>::{closure#0}
232.53 s
gammaloop-nextest-clinnet> 5: <std::sys::sync::once::futex::Once>::call
232.53 s
gammaloop-nextest-clinnet> 6: <std::sync::once_lock::OnceLock<alloc::string::String>>::initialize::<<std::sync::once_lock::OnceLock<alloc::string::String>>::get_or_init<public_typst_behavior::linnest_public_svg::{closure#0}>::{closure#0}, !>
232.53 s
gammaloop-nextest-clinnet> 7: <public_typst_behavior::public_linnest_labels_follow_their_carriers::{closure#0} as core::ops::function::FnOnce<()>>::call_once
232.53 s
gammaloop-nextest-clinnet> note: Some details are omitted, run with `RUST_BACKTRACE=full` for a verbose backtrace.
232.53 s
gammaloop-nextest-clinnet>
232.53 s
gammaloop-nextest-clinnet> 2. clinnet::public_typst_behavior::public_linnest_edge_styles_skip_fallbacks
232.53 s
gammaloop-nextest-clinnet> failure: test failure with exit code 101
232.53 s
gammaloop-nextest-clinnet> thread 'public_linnest_edge_styles_skip_fallbacks' (280) panicked at crates/clinnet/tests/public_typst_behavior.rs:81:55:
232.53 s
gammaloop-nextest-clinnet> called `Result::unwrap()` on an `Err` value: typst failed while compiling template /build/.tmp8UiuE8/.clinnet/templates/linnest-public-behavior.svg
232.53 s
gammaloop-nextest-clinnet>
232.53 s
gammaloop-nextest-clinnet> Command executed:
232.53 s
gammaloop-nextest-clinnet> "typst" "c" "/build/.tmp8UiuE8/.clinnet/templates/linnest-public-behavior.typ" "/build/.tmp8UiuE8/.clinnet/templates/linnest-public-behavior.svg" "--root" "/build/.tmp8UiuE8/.clinnet/templates"
232.53 s
gammaloop-nextest-clinnet>
232.53 s
gammaloop-nextest-clinnet> Typst stdout:
232.53 s
gammaloop-nextest-clinnet>
232.53 s
gammaloop-nextest-clinnet>
232.53 s
gammaloop-nextest-clinnet> Typst stderr:
232.53 s
gammaloop-nextest-clinnet>
232.53 s
gammaloop-nextest-clinnet>
232.53 s
gammaloop-nextest-clinnet> Location:
232.53 s
gammaloop-nextest-clinnet> crates/clinnet/src/lib.rs:741:13
232.53 s
gammaloop-nextest-clinnet> stack backtrace:
232.53 s
gammaloop-nextest-clinnet> 0: __rustc::rust_begin_unwind
232.53 s
gammaloop-nextest-clinnet> 1: core::panicking::panic_fmt
232.53 s
gammaloop-nextest-clinnet> 2: core::result::unwrap_failed
232.53 s
gammaloop-nextest-clinnet> 3: public_typst_behavior::render
232.53 s
gammaloop-nextest-clinnet> 4: <std::sync::once::Once>::call_once_force::<<std::sync::once_lock::OnceLock<alloc::string::String>>::initialize<<std::sync::once_lock::OnceLock<alloc::string::String>>::get_or_init<public_typst_behavior::linnest_public_svg::{closure#0}>::{closure#0}, !>::{closure#0}>::{closure#0}
232.53 s
gammaloop-nextest-clinnet> 5: <std::sys::sync::once::futex::Once>::call
232.53 s
gammaloop-nextest-clinnet> 6: <std::sync::once_lock::OnceLock<alloc::string::String>>::initialize::<<std::sync::once_lock::OnceLock<alloc::string::String>>::get_or_init<public_typst_behavior::linnest_public_svg::{closure#0}>::{closure#0}, !>
232.53 s
gammaloop-nextest-clinnet> 7: <public_typst_behavior::public_linnest_edge_styles_skip_fallbacks::{closure#0} as core::ops::function::FnOnce<()>>::call_once
232.53 s
gammaloop-nextest-clinnet> note: Some details are omitted, run with `RUST_BACKTRACE=full` for a verbose backtrace.
232.53 s
gammaloop-nextest-clinnet> system-out
232.53 s
gammaloop-nextest-clinnet> running 1 test
232.53 s
gammaloop-nextest-clinnet> test public_linnest_edge_styles_skip_fallbacks has been running for over 60 seconds
232.53 s
gammaloop-nextest-clinnet> test public_linnest_edge_styles_skip_fallbacks ... FAILED
232.53 s
gammaloop-nextest-clinnet>
232.53 s
gammaloop-nextest-clinnet> failures:
232.53 s
gammaloop-nextest-clinnet>
232.53 s
gammaloop-nextest-clinnet> failures:
232.53 s
gammaloop-nextest-clinnet> public_linnest_edge_styles_skip_fallbacks
232.53 s
gammaloop-nextest-clinnet>
232.53 s
gammaloop-nextest-clinnet> test result: FAILED. 0 passed; 1 failed; 0 ignored; 0 measured; 17 filtered out; finished in 115.99s
232.53 s
gammaloop-nextest-clinnet> system-err
232.53 s
gammaloop-nextest-clinnet> thread 'public_linnest_edge_styles_skip_fallbacks' (280) panicked at crates/clinnet/tests/public_typst_behavior.rs:81:55:
232.53 s
gammaloop-nextest-clinnet> called `Result::unwrap()` on an `Err` value: typst failed while compiling template /build/.tmp8UiuE8/.clinnet/templates/linnest-public-behavior.svg
232.53 s
gammaloop-nextest-clinnet>
232.53 s
gammaloop-nextest-clinnet> Command executed:
232.53 s
gammaloop-nextest-clinnet> "typst" "c" "/build/.tmp8UiuE8/.clinnet/templates/linnest-public-behavior.typ" "/build/.tmp8UiuE8/.clinnet/templates/linnest-public-behavior.svg" "--root" "/build/.tmp8UiuE8/.clinnet/templates"
232.53 s
gammaloop-nextest-clinnet>
232.53 s
gammaloop-nextest-clinnet> Typst stdout:
232.53 s
gammaloop-nextest-clinnet>
232.53 s
gammaloop-nextest-clinnet>
232.53 s
gammaloop-nextest-clinnet> Typst stderr:
232.53 s
gammaloop-nextest-clinnet>
232.53 s
gammaloop-nextest-clinnet>
232.53 s
gammaloop-nextest-clinnet> Location:
232.53 s
gammaloop-nextest-clinnet> crates/clinnet/src/lib.rs:741:13
232.53 s
gammaloop-nextest-clinnet> stack backtrace:
232.53 s
gammaloop-nextest-clinnet> 0: __rustc::rust_begin_unwind
232.53 s
gammaloop-nextest-clinnet> 1: core::panicking::panic_fmt
232.53 s
gammaloop-nextest-clinnet> 2: core::result::unwrap_failed
232.53 s
gammaloop-nextest-clinnet> 3: public_typst_behavior::render
232.53 s
gammaloop-nextest-clinnet> 4: <std::sync::once::Once>::call_once_force::<<std::sync::once_lock::OnceLock<alloc::string::String>>::initialize<<std::sync::once_lock::OnceLock<alloc::string::String>>::get_or_init<public_typst_behavior::linnest_public_svg::{closure#0}>::{closure#0}, !>::{closure#0}>::{closure#0}
232.53 s
gammaloop-nextest-clinnet> 5: <std::sys::sync::once::futex::Once>::call
232.53 s
gammaloop-nextest-clinnet> 6: <std::sync::once_lock::OnceLock<alloc::string::String>>::initialize::<<std::sync::once_lock::OnceLock<alloc::string::String>>::get_or_init<public_typst_behavior::linnest_public_svg::{closure#0}>::{closure#0}, !>
232.53 s
gammaloop-nextest-clinnet> 7: <public_typst_behavior::public_linnest_edge_styles_skip_fallbacks::{closure#0} as core::ops::function::FnOnce<()>>::call_once
232.53 s
gammaloop-nextest-clinnet> note: Some details are omitted, run with `RUST_BACKTRACE=full` for a verbose backtrace.
232.53 s
gammaloop-nextest-clinnet>
232.53 s
gammaloop-nextest-clinnet> 3. clinnet::public_typst_behavior::public_linnest_endpoint_anchor_distances_stay_local
232.53 s
gammaloop-nextest-clinnet> failure: test failure with exit code 101
232.53 s
gammaloop-nextest-clinnet> thread 'public_linnest_endpoint_anchor_distances_stay_local' (273) panicked at crates/clinnet/tests/public_typst_behavior.rs:81:55:
232.53 s
gammaloop-nextest-clinnet> called `Result::unwrap()` on an `Err` value: typst failed while compiling template /build/.tmp6IvFIA/.clinnet/templates/linnest-public-behavior.svg
232.53 s
gammaloop-nextest-clinnet>
232.53 s
gammaloop-nextest-clinnet> Command executed:
232.53 s
gammaloop-nextest-clinnet> "typst" "c" "/build/.tmp6IvFIA/.clinnet/templates/linnest-public-behavior.typ" "/build/.tmp6IvFIA/.clinnet/templates/linnest-public-behavior.svg" "--root" "/build/.tmp6IvFIA/.clinnet/templates"
232.53 s
gammaloop-nextest-clinnet>
232.53 s
gammaloop-nextest-clinnet> Typst stdout:
232.53 s
gammaloop-nextest-clinnet>
232.53 s
gammaloop-nextest-clinnet>
232.53 s
gammaloop-nextest-clinnet> Typst stderr:
232.53 s
gammaloop-nextest-clinnet>
232.53 s
gammaloop-nextest-clinnet>
232.53 s
gammaloop-nextest-clinnet> Location:
232.53 s
gammaloop-nextest-clinnet> crates/clinnet/src/lib.rs:741:13
232.53 s
gammaloop-nextest-clinnet> stack backtrace:
232.53 s
gammaloop-nextest-clinnet> 0: __rustc::rust_begin_unwind
232.53 s
gammaloop-nextest-clinnet> 1: core::panicking::panic_fmt
232.53 s
gammaloop-nextest-clinnet> 2: core::result::unwrap_failed
232.53 s
gammaloop-nextest-clinnet> 3: public_typst_behavior::render
232.53 s
gammaloop-nextest-clinnet> 4: <std::sync::once::Once>::call_once_force::<<std::sync::once_lock::OnceLock<alloc::string::String>>::initialize<<std::sync::once_lock::OnceLock<alloc::string::String>>::get_or_init<public_typst_behavior::linnest_public_svg::{closure#0}>::{closure#0}, !>::{closure#0}>::{closure#0}
232.53 s
gammaloop-nextest-clinnet> 5: <std::sys::sync::once::futex::Once>::call
232.53 s
gammaloop-nextest-clinnet> 6: <std::sync::once_lock::OnceLock<alloc::string::String>>::initialize::<<std::sync::once_lock::OnceLock<alloc::string::String>>::get_or_init<public_typst_behavior::linnest_public_svg::{closure#0}>::{closure#0}, !>
232.53 s
gammaloop-nextest-clinnet> 7: <public_typst_behavior::public_linnest_endpoint_anchor_distances_stay_local::{closure#0} as core::ops::function::FnOnce<()>>::call_once
232.53 s
gammaloop-nextest-clinnet> note: Some details are omitted, run with `RUST_BACKTRACE=full` for a verbose backtrace.
232.53 s
gammaloop-nextest-clinnet> system-out
232.53 s
gammaloop-nextest-clinnet> running 1 test
232.53 s
gammaloop-nextest-clinnet> test public_linnest_endpoint_anchor_distances_stay_local has been running for over 60 seconds
232.53 s
gammaloop-nextest-clinnet> test public_linnest_endpoint_anchor_distances_stay_local ... FAILED
232.53 s
gammaloop-nextest-clinnet>
232.53 s
gammaloop-nextest-clinnet> failures:
232.53 s
gammaloop-nextest-clinnet>
232.53 s
gammaloop-nextest-clinnet> failures:
232.53 s
gammaloop-nextest-clinnet> public_linnest_endpoint_anchor_distances_stay_local
232.53 s
gammaloop-nextest-clinnet>
232.53 s
gammaloop-nextest-clinnet> test result: FAILED. 0 passed; 1 failed; 0 ignored; 0 measured; 17 filtered out; finished in 126.43s
232.53 s
gammaloop-nextest-clinnet> system-err
232.53 s
gammaloop-nextest-clinnet> thread 'public_linnest_endpoint_anchor_distances_stay_local' (273) panicked at crates/clinnet/tests/public_typst_behavior.rs:81:55:
232.53 s
gammaloop-nextest-clinnet> called `Result::unwrap()` on an `Err` value: typst failed while compiling template /build/.tmp6IvFIA/.clinnet/templates/linnest-public-behavior.svg
232.53 s
gammaloop-nextest-clinnet>
232.53 s
gammaloop-nextest-clinnet> Command executed:
232.53 s
gammaloop-nextest-clinnet> "typst" "c" "/build/.tmp6IvFIA/.clinnet/templates/linnest-public-behavior.typ" "/build/.tmp6IvFIA/.clinnet/templates/linnest-public-behavior.svg" "--root" "/build/.tmp6IvFIA/.clinnet/templates"
232.53 s
gammaloop-nextest-clinnet>
232.53 s
gammaloop-nextest-clinnet> Typst stdout:
232.53 s
gammaloop-nextest-clinnet>
232.53 s
gammaloop-nextest-clinnet>
232.53 s
gammaloop-nextest-clinnet> Typst stderr:
232.53 s
gammaloop-nextest-clinnet>
232.53 s
gammaloop-nextest-clinnet>
232.53 s
gammaloop-nextest-clinnet> Location:
232.53 s
gammaloop-nextest-clinnet> crates/clinnet/src/lib.rs:741:13
232.53 s
gammaloop-nextest-clinnet> stack backtrace:
232.53 s
gammaloop-nextest-clinnet> 0: __rustc::rust_begin_unwind
232.53 s
gammaloop-nextest-clinnet> 1: core::panicking::panic_fmt
232.53 s
gammaloop-nextest-clinnet> 2: core::result::unwrap_failed
232.53 s
gammaloop-nextest-clinnet> 3: public_typst_behavior::render
232.53 s
gammaloop-nextest-clinnet> 4: <std::sync::once::Once>::call_once_force::<<std::sync::once_lock::OnceLock<alloc::string::String>>::initialize<<std::sync::once_lock::OnceLock<alloc::string::String>>::get_or_init<public_typst_behavior::linnest_public_svg::{closure#0}>::{closure#0}, !>::{closure#0}>::{closure#0}
232.53 s
gammaloop-nextest-clinnet> 5: <std::sys::sync::once::futex::Once>::call
232.53 s
gammaloop-nextest-clinnet> 6: <std::sync::once_lock::OnceLock<alloc::string::String>>::initialize::<<std::sync::once_lock::OnceLock<alloc::string::String>>::get_or_init<public_typst_behavior::linnest_public_svg::{closure#0}>::{closure#0}, !>
232.53 s
gammaloop-nextest-clinnet> 7: <public_typst_behavior::public_linnest_endpoint_anchor_distances_stay_local::{closure#0} as core::ops::function::FnOnce<()>>::call_once
232.53 s
gammaloop-nextest-clinnet> note: Some details are omitted, run with `RUST_BACKTRACE=full` for a verbose backtrace.
232.53 s
gammaloop-nextest-clinnet> =========================================
233.92 s
error: Cannot build '/nix/store/4pqspwvh8pi9s2vg9g6mfsggpl9ynwzx-gammaloop-nextest-clinnet.drv '.
233.92 s
Reason: builder failed with exit code 100 .
233.92 s
Output paths:
233.92 s
/nix/store/v9zka7gxdrym1pq03r0i4w2q43fgdwcq-gammaloop-nextest-clinnet
233.92 s
Last 449 log lines:
233.92 s
> Nextest worker budget: 16
233.92 s
> Extracting 4 binaries (including 1 non-test binary), 1 build script output directory, and 1 linked path to /build/source
233.92 s
> Extracted 16 files to /build/source in 0.10s
233.92 s
> ------------
233.92 s
> Nextest run ID 79d01ed4-7032-4f24-a6e1-ddee5f9988b9 with nextest profile: ci_gammaloop
233.92 s
> Starting 38 tests across 3 binaries
233.92 s
> FAIL [ 110.786s] (32/38) clinnet::public_typst_behavior public_linnest_labels_follow_their_carriers
233.92 s
> stdout ---
233.92 s
>
233.92 s
> running 1 test
233.92 s
> test public_linnest_labels_follow_their_carriers has been running for over 60 seconds
233.92 s
> test public_linnest_labels_follow_their_carriers ... FAILED
233.92 s
>
233.92 s
> failures:
233.92 s
>
233.92 s
> failures:
233.92 s
> public_linnest_labels_follow_their_carriers
233.92 s
>
233.92 s
> test result: FAILED. 0 passed; 1 failed; 0 ignored; 0 measured; 17 filtered out; finished in 110.77s
233.92 s
>
233.92 s
> stderr ---
233.92 s
>
233.92 s
> thread 'public_linnest_labels_follow_their_carriers' (277) panicked at crates/clinnet/tests/public_typst_behavior.rs:81:55:
233.92 s
> called `Result::unwrap()` on an `Err` value: typst failed while compiling template /build/.tmpnhpX4R/.clinnet/templates/linnest-public-behavior.svg
233.92 s
>
233.92 s
> Command executed:
233.92 s
> "typst" "c" "/build/.tmpnhpX4R/.clinnet/templates/linnest-public-behavior.typ" "/build/.tmpnhpX4R/.clinnet/templates/linnest-public-behavior.svg" "--root" "/build/.tmpnhpX4R/.clinnet/templates"
233.92 s
>
233.92 s
> Typst stdout:
233.92 s
>
233.92 s
>
233.92 s
> Typst stderr:
233.92 s
>
233.92 s
>
233.92 s
> Location:
233.92 s
> crates/clinnet/src/lib.rs:741:13
233.92 s
> stack backtrace:
233.92 s
> 0: __rustc::rust_begin_unwind
233.92 s
> 1: core::panicking::panic_fmt
233.92 s
> 2: core::result::unwrap_failed
233.92 s
> 3: public_typst_behavior::render
233.92 s
> 4: <std::sync::once::Once>::call_once_force::<<std::sync::once_lock::OnceLock<alloc::string::String>>::initialize<<std::sync::once_lock::OnceLock<alloc::string::String>>::get_or_init<public_typst_behavior::linnest_public_svg::{closure#0}>::{closure#0}, !>::{closure#0}>::{closure#0}
233.92 s
> 5: <std::sys::sync::once::futex::Once>::call
233.92 s
> 6: <std::sync::once_lock::OnceLock<alloc::string::String>>::initialize::<<std::sync::once_lock::OnceLock<alloc::string::String>>::get_or_init<public_typst_behavior::linnest_public_svg::{closure#0}>::{closure#0}, !>
233.92 s
> 7: <public_typst_behavior::public_linnest_labels_follow_their_carriers::{closure#0} as core::ops::function::FnOnce<()>>::call_once
233.92 s
> note: Some details are omitted, run with `RUST_BACKTRACE=full` for a verbose backtrace.
233.92 s
>
233.92 s
> FAIL [ 116.007s] (33/38) clinnet::public_typst_behavior public_linnest_edge_styles_skip_fallbacks
233.92 s
> stdout ---
233.92 s
>
233.92 s
> running 1 test
233.92 s
> test public_linnest_edge_styles_skip_fallbacks has been running for over 60 seconds
233.92 s
> test public_linnest_edge_styles_skip_fallbacks ... FAILED
233.92 s
>
233.92 s
> failures:
233.92 s
>
233.92 s
> failures:
233.92 s
> public_linnest_edge_styles_skip_fallbacks
233.92 s
>
233.92 s
> test result: FAILED. 0 passed; 1 failed; 0 ignored; 0 measured; 17 filtered out; finished in 115.99s
233.92 s
>
233.92 s
> stderr ---
233.92 s
>
233.92 s
> thread 'public_linnest_edge_styles_skip_fallbacks' (280) panicked at crates/clinnet/tests/public_typst_behavior.rs:81:55:
233.92 s
> called `Result::unwrap()` on an `Err` value: typst failed while compiling template /build/.tmp8UiuE8/.clinnet/templates/linnest-public-behavior.svg
233.92 s
>
233.92 s
> Command executed:
233.92 s
> "typst" "c" "/build/.tmp8UiuE8/.clinnet/templates/linnest-public-behavior.typ" "/build/.tmp8UiuE8/.clinnet/templates/linnest-public-behavior.svg" "--root" "/build/.tmp8UiuE8/.clinnet/templates"
233.92 s
>
233.92 s
> Typst stdout:
233.92 s
>
233.92 s
>
233.92 s
> Typst stderr:
233.92 s
>
233.92 s
>
233.92 s
> Location:
233.92 s
> crates/clinnet/src/lib.rs:741:13
233.92 s
> stack backtrace:
233.92 s
> 0: __rustc::rust_begin_unwind
233.92 s
> 1: core::panicking::panic_fmt
233.92 s
> 2: core::result::unwrap_failed
233.92 s
> 3: public_typst_behavior::render
233.92 s
> 4: <std::sync::once::Once>::call_once_force::<<std::sync::once_lock::OnceLock<alloc::string::String>>::initialize<<std::sync::once_lock::OnceLock<alloc::string::String>>::get_or_init<public_typst_behavior::linnest_public_svg::{closure#0}>::{closure#0}, !>::{closure#0}>::{closure#0}
233.92 s
> 5: <std::sys::sync::once::futex::Once>::call
233.92 s
> 6: <std::sync::once_lock::OnceLock<alloc::string::String>>::initialize::<<std::sync::once_lock::OnceLock<alloc::string::String>>::get_or_init<public_typst_behavior::linnest_public_svg::{closure#0}>::{closure#0}, !>
233.92 s
> 7: <public_typst_behavior::public_linnest_edge_styles_skip_fallbacks::{closure#0} as core::ops::function::FnOnce<()>>::call_once
233.92 s
> note: Some details are omitted, run with `RUST_BACKTRACE=full` for a verbose backtrace.
233.92 s
>
233.92 s
> FAIL [ 126.436s] (34/38) clinnet::public_typst_behavior public_linnest_endpoint_anchor_distances_stay_local
233.92 s
> stdout ---
233.92 s
>
233.92 s
> running 1 test
233.92 s
> test public_linnest_endpoint_anchor_distances_stay_local has been running for over 60 seconds
233.92 s
> test public_linnest_endpoint_anchor_distances_stay_local ... FAILED
233.92 s
>
233.92 s
> failures:
233.92 s
>
233.92 s
> failures:
233.92 s
> public_linnest_endpoint_anchor_distances_stay_local
233.92 s
>
233.92 s
> test result: FAILED. 0 passed; 1 failed; 0 ignored; 0 measured; 17 filtered out; finished in 126.43s
233.92 s
>
233.92 s
> stderr ---
233.92 s
>
233.92 s
> thread 'public_linnest_endpoint_anchor_distances_stay_local' (273) panicked at crates/clinnet/tests/public_typst_behavior.rs:81:55:
233.92 s
> called `Result::unwrap()` on an `Err` value: typst failed while compiling template /build/.tmp6IvFIA/.clinnet/templates/linnest-public-behavior.svg
233.92 s
>
233.92 s
> Command executed:
233.92 s
> "typst" "c" "/build/.tmp6IvFIA/.clinnet/templates/linnest-public-behavior.typ" "/build/.tmp6IvFIA/.clinnet/templates/linnest-public-behavior.svg" "--root" "/build/.tmp6IvFIA/.clinnet/templates"
233.92 s
>
233.92 s
> Typst stdout:
233.92 s
>
233.92 s
>
233.92 s
> Typst stderr:
233.92 s
>
233.92 s
>
233.92 s
> Location:
233.92 s
> crates/clinnet/src/lib.rs:741:13
233.92 s
> stack backtrace:
233.92 s
> 0: __rustc::rust_begin_unwind
233.92 s
> 1: core::panicking::panic_fmt
233.92 s
> 2: core::result::unwrap_failed
233.92 s
> 3: public_typst_behavior::render
233.92 s
> 4: <std::sync::once::Once>::call_once_force::<<std::sync::once_lock::OnceLock<alloc::string::String>>::initialize<<std::sync::once_lock::OnceLock<alloc::string::String>>::get_or_init<public_typst_behavior::linnest_public_svg::{closure#0}>::{closure#0}, !>::{closure#0}>::{closure#0}
233.92 s
> 5: <std::sys::sync::once::futex::Once>::call
233.92 s
> 6: <std::sync::once_lock::OnceLock<alloc::string::String>>::initialize::<<std::sync::once_lock::OnceLock<alloc::string::String>>::get_or_init<public_typst_behavior::linnest_public_svg::{closure#0}>::{closure#0}, !>
233.92 s
> 7: <public_typst_behavior::public_linnest_endpoint_anchor_distances_stay_local::{closure#0} as core::ops::function::FnOnce<()>>::call_once
233.92 s
> note: Some details are omitted, run with `RUST_BACKTRACE=full` for a verbose backtrace.
233.92 s
>
233.92 s
> ------------
233.92 s
> Summary [ 142.045s] 38 tests run: 35 passed (4 slow ), 3 failed , 0 skipped
233.92 s
> FAIL [ 110.786s] (32/38) clinnet::public_typst_behavior public_linnest_labels_follow_their_carriers
233.92 s
> stdout ---
233.92 s
>
233.92 s
> running 1 test
233.92 s
> test public_linnest_labels_follow_their_carriers has been running for over 60 seconds
233.92 s
> test public_linnest_labels_follow_their_carriers ... FAILED
233.92 s
>
233.92 s
> failures:
233.92 s
>
233.92 s
> failures:
233.92 s
> public_linnest_labels_follow_their_carriers
233.92 s
>
233.92 s
> test result: FAILED. 0 passed; 1 failed; 0 ignored; 0 measured; 17 filtered out; finished in 110.77s
233.92 s
>
233.92 s
> stderr ---
233.92 s
>
233.92 s
> thread 'public_linnest_labels_follow_their_carriers' (277) panicked at crates/clinnet/tests/public_typst_behavior.rs:81:55:
233.92 s
> called `Result::unwrap()` on an `Err` value: typst failed while compiling template /build/.tmpnhpX4R/.clinnet/templates/linnest-public-behavior.svg
233.92 s
>
233.92 s
> Command executed:
233.92 s
> "typst" "c" "/build/.tmpnhpX4R/.clinnet/templates/linnest-public-behavior.typ" "/build/.tmpnhpX4R/.clinnet/templates/linnest-public-behavior.svg" "--root" "/build/.tmpnhpX4R/.clinnet/templates"
233.92 s
>
233.92 s
> Typst stdout:
233.92 s
>
233.92 s
>
233.92 s
> Typst stderr:
233.92 s
>
233.92 s
>
233.92 s
> Location:
233.92 s
> crates/clinnet/src/lib.rs:741:13
233.92 s
> stack backtrace:
233.92 s
> 0: __rustc::rust_begin_unwind
233.92 s
> 1: core::panicking::panic_fmt
233.92 s
> 2: core::result::unwrap_failed
233.92 s
> 3: public_typst_behavior::render
233.92 s
> 4: <std::sync::once::Once>::call_once_force::<<std::sync::once_lock::OnceLock<alloc::string::String>>::initialize<<std::sync::once_lock::OnceLock<alloc::string::String>>::get_or_init<public_typst_behavior::linnest_public_svg::{closure#0}>::{closure#0}, !>::{closure#0}>::{closure#0}
233.92 s
> 5: <std::sys::sync::once::futex::Once>::call
233.92 s
> 6: <std::sync::once_lock::OnceLock<alloc::string::String>>::initialize::<<std::sync::once_lock::OnceLock<alloc::string::String>>::get_or_init<public_typst_behavior::linnest_public_svg::{closure#0}>::{closure#0}, !>
233.92 s
> 7: <public_typst_behavior::public_linnest_labels_follow_their_carriers::{closure#0} as core::ops::function::FnOnce<()>>::call_once
233.92 s
> note: Some details are omitted, run with `RUST_BACKTRACE=full` for a verbose backtrace.
233.92 s
>
233.92 s
> FAIL [ 116.007s] (33/38) clinnet::public_typst_behavior public_linnest_edge_styles_skip_fallbacks
233.92 s
> stdout ---
233.92 s
>
233.92 s
> running 1 test
233.92 s
> test public_linnest_edge_styles_skip_fallbacks has been running for over 60 seconds
233.92 s
> test public_linnest_edge_styles_skip_fallbacks ... FAILED
233.92 s
>
233.92 s
> failures:
233.92 s
>
233.92 s
> failures:
233.92 s
> public_linnest_edge_styles_skip_fallbacks
233.92 s
>
233.92 s
> test result: FAILED. 0 passed; 1 failed; 0 ignored; 0 measured; 17 filtered out; finished in 115.99s
233.92 s
>
233.92 s
> stderr ---
233.92 s
>
233.92 s
> thread 'public_linnest_edge_styles_skip_fallbacks' (280) panicked at crates/clinnet/tests/public_typst_behavior.rs:81:55:
233.92 s
> called `Result::unwrap()` on an `Err` value: typst failed while compiling template /build/.tmp8UiuE8/.clinnet/templates/linnest-public-behavior.svg
233.92 s
>
233.92 s
> Command executed:
233.92 s
> "typst" "c" "/build/.tmp8UiuE8/.clinnet/templates/linnest-public-behavior.typ" "/build/.tmp8UiuE8/.clinnet/templates/linnest-public-behavior.svg" "--root" "/build/.tmp8UiuE8/.clinnet/templates"
233.92 s
>
233.92 s
> Typst stdout:
233.92 s
>
233.92 s
>
233.92 s
> Typst stderr:
233.92 s
>
233.92 s
>
233.92 s
> Location:
233.92 s
> crates/clinnet/src/lib.rs:741:13
233.92 s
> stack backtrace:
233.92 s
> 0: __rustc::rust_begin_unwind
233.92 s
> 1: core::panicking::panic_fmt
233.92 s
> 2: core::result::unwrap_failed
233.92 s
> 3: public_typst_behavior::render
233.92 s
> 4: <std::sync::once::Once>::call_once_force::<<std::sync::once_lock::OnceLock<alloc::string::String>>::initialize<<std::sync::once_lock::OnceLock<alloc::string::String>>::get_or_init<public_typst_behavior::linnest_public_svg::{closure#0}>::{closure#0}, !>::{closure#0}>::{closure#0}
233.92 s
> 5: <std::sys::sync::once::futex::Once>::call
233.92 s
> 6: <std::sync::once_lock::OnceLock<alloc::string::String>>::initialize::<<std::sync::once_lock::OnceLock<alloc::string::String>>::get_or_init<public_typst_behavior::linnest_public_svg::{closure#0}>::{closure#0}, !>
233.92 s
> 7: <public_typst_behavior::public_linnest_edge_styles_skip_fallbacks::{closure#0} as core::ops::function::FnOnce<()>>::call_once
233.92 s
> note: Some details are omitted, run with `RUST_BACKTRACE=full` for a verbose backtrace.
233.92 s
>
233.92 s
> FAIL [ 126.436s] (34/38) clinnet::public_typst_behavior public_linnest_endpoint_anchor_distances_stay_local
233.92 s
> stdout ---
233.92 s
>
233.92 s
> running 1 test
233.92 s
> test public_linnest_endpoint_anchor_distances_stay_local has been running for over 60 seconds
233.92 s
> test public_linnest_endpoint_anchor_distances_stay_local ... FAILED
233.92 s
>
233.92 s
> failures:
233.92 s
>
233.92 s
> failures:
233.92 s
> public_linnest_endpoint_anchor_distances_stay_local
233.92 s
>
233.92 s
> test result: FAILED. 0 passed; 1 failed; 0 ignored; 0 measured; 17 filtered out; finished in 126.43s
233.92 s
>
233.92 s
> stderr ---
233.92 s
>
233.92 s
> thread 'public_linnest_endpoint_anchor_distances_stay_local' (273) panicked at crates/clinnet/tests/public_typst_behavior.rs:81:55:
233.92 s
> called `Result::unwrap()` on an `Err` value: typst failed while compiling template /build/.tmp6IvFIA/.clinnet/templates/linnest-public-behavior.svg
233.92 s
>
233.92 s
> Command executed:
233.92 s
> "typst" "c" "/build/.tmp6IvFIA/.clinnet/templates/linnest-public-behavior.typ" "/build/.tmp6IvFIA/.clinnet/templates/linnest-public-behavior.svg" "--root" "/build/.tmp6IvFIA/.clinnet/templates"
233.92 s
>
233.92 s
> Typst stdout:
233.92 s
>
233.92 s
>
233.92 s
> Typst stderr:
233.92 s
>
233.92 s
>
233.92 s
> Location:
233.92 s
> crates/clinnet/src/lib.rs:741:13
233.92 s
> stack backtrace:
233.92 s
> 0: __rustc::rust_begin_unwind
233.92 s
> 1: core::panicking::panic_fmt
233.92 s
> 2: core::result::unwrap_failed
233.92 s
> 3: public_typst_behavior::render
233.92 s
> 4: <std::sync::once::Once>::call_once_force::<<std::sync::once_lock::OnceLock<alloc::string::String>>::initialize<<std::sync::once_lock::OnceLock<alloc::string::String>>::get_or_init<public_typst_behavior::linnest_public_svg::{closure#0}>::{closure#0}, !>::{closure#0}>::{closure#0}
233.92 s
> 5: <std::sys::sync::once::futex::Once>::call
233.92 s
> 6: <std::sync::once_lock::OnceLock<alloc::string::String>>::initialize::<<std::sync::once_lock::OnceLock<alloc::string::String>>::get_or_init<public_typst_behavior::linnest_public_svg::{closure#0}>::{closure#0}, !>
233.92 s
> 7: <public_typst_behavior::public_linnest_endpoint_anchor_distances_stay_local::{closure#0} as core::ops::function::FnOnce<()>>::call_once
233.92 s
> note: Some details are omitted, run with `RUST_BACKTRACE=full` for a verbose backtrace.
233.92 s
>
233.92 s
> error : test run failed
233.92 s
>
233.92 s
> ========== nextest test summary ==========
233.92 s
> report: target/nextest/ci_gammaloop/junit.xml
233.92 s
> tests: 38, failures: 3, errors: 0
233.92 s
>
233.92 s
> 1. clinnet::public_typst_behavior::public_linnest_labels_follow_their_carriers
233.92 s
> failure: test failure with exit code 101
233.92 s
> thread 'public_linnest_labels_follow_their_carriers' (277) panicked at crates/clinnet/tests/public_typst_behavior.rs:81:55:
233.92 s
> called `Result::unwrap()` on an `Err` value: typst failed while compiling template /build/.tmpnhpX4R/.clinnet/templates/linnest-public-behavior.svg
233.92 s
>
233.92 s
> Command executed:
233.92 s
> "typst" "c" "/build/.tmpnhpX4R/.clinnet/templates/linnest-public-behavior.typ" "/build/.tmpnhpX4R/.clinnet/templates/linnest-public-behavior.svg" "--root" "/build/.tmpnhpX4R/.clinnet/templates"
233.92 s
>
233.92 s
> Typst stdout:
233.92 s
>
233.92 s
>
233.92 s
> Typst stderr:
233.92 s
>
233.92 s
>
233.92 s
> Location:
233.92 s
> crates/clinnet/src/lib.rs:741:13
233.92 s
> stack backtrace:
233.92 s
> 0: __rustc::rust_begin_unwind
233.92 s
> 1: core::panicking::panic_fmt
233.92 s
> 2: core::result::unwrap_failed
233.92 s
> 3: public_typst_behavior::render
233.92 s
> 4: <std::sync::once::Once>::call_once_force::<<std::sync::once_lock::OnceLock<alloc::string::String>>::initialize<<std::sync::once_lock::OnceLock<alloc::string::String>>::get_or_init<public_typst_behavior::linnest_public_svg::{closure#0}>::{closure#0}, !>::{closure#0}>::{closure#0}
233.92 s
> 5: <std::sys::sync::once::futex::Once>::call
233.92 s
> 6: <std::sync::once_lock::OnceLock<alloc::string::String>>::initialize::<<std::sync::once_lock::OnceLock<alloc::string::String>>::get_or_init<public_typst_behavior::linnest_public_svg::{closure#0}>::{closure#0}, !>
233.92 s
> 7: <public_typst_behavior::public_linnest_labels_follow_their_carriers::{closure#0} as core::ops::function::FnOnce<()>>::call_once
233.92 s
> note: Some details are omitted, run with `RUST_BACKTRACE=full` for a verbose backtrace.
233.92 s
> system-out
233.92 s
> running 1 test
233.92 s
> test public_linnest_labels_follow_their_carriers has been running for over 60 seconds
233.92 s
> test public_linnest_labels_follow_their_carriers ... FAILED
233.92 s
>
233.92 s
> failures:
233.92 s
>
233.92 s
> failures:
233.92 s
> public_linnest_labels_follow_their_carriers
233.92 s
>
233.92 s
> test result: FAILED. 0 passed; 1 failed; 0 ignored; 0 measured; 17 filtered out; finished in 110.77s
233.92 s
> system-err
233.92 s
> thread 'public_linnest_labels_follow_their_carriers' (277) panicked at crates/clinnet/tests/public_typst_behavior.rs:81:55:
233.92 s
> called `Result::unwrap()` on an `Err` value: typst failed while compiling template /build/.tmpnhpX4R/.clinnet/templates/linnest-public-behavior.svg
233.92 s
>
233.92 s
> Command executed:
233.92 s
> "typst" "c" "/build/.tmpnhpX4R/.clinnet/templates/linnest-public-behavior.typ" "/build/.tmpnhpX4R/.clinnet/templates/linnest-public-behavior.svg" "--root" "/build/.tmpnhpX4R/.clinnet/templates"
233.92 s
>
233.92 s
> Typst stdout:
233.92 s
>
233.92 s
>
233.92 s
> Typst stderr:
233.92 s
>
233.92 s
>
233.92 s
> Location:
233.92 s
> crates/clinnet/src/lib.rs:741:13
233.92 s
> stack backtrace:
233.92 s
> 0: __rustc::rust_begin_unwind
233.92 s
> 1: core::panicking::panic_fmt
233.92 s
> 2: core::result::unwrap_failed
233.92 s
> 3: public_typst_behavior::render
233.92 s
> 4: <std::sync::once::Once>::call_once_force::<<std::sync::once_lock::OnceLock<alloc::string::String>>::initialize<<std::sync::once_lock::OnceLock<alloc::string::String>>::get_or_init<public_typst_behavior::linnest_public_svg::{closure#0}>::{closure#0}, !>::{closure#0}>::{closure#0}
233.92 s
> 5: <std::sys::sync::once::futex::Once>::call
233.92 s
> 6: <std::sync::once_lock::OnceLock<alloc::string::String>>::initialize::<<std::sync::once_lock::OnceLock<alloc::string::String>>::get_or_init<public_typst_behavior::linnest_public_svg::{closure#0}>::{closure#0}, !>
233.92 s
> 7: <public_typst_behavior::public_linnest_labels_follow_their_carriers::{closure#0} as core::ops::function::FnOnce<()>>::call_once
233.92 s
> note: Some details are omitted, run with `RUST_BACKTRACE=full` for a verbose backtrace.
233.92 s
>
233.92 s
> 2. clinnet::public_typst_behavior::public_linnest_edge_styles_skip_fallbacks
233.92 s
> failure: test failure with exit code 101
233.92 s
> thread 'public_linnest_edge_styles_skip_fallbacks' (280) panicked at crates/clinnet/tests/public_typst_behavior.rs:81:55:
233.92 s
> called `Result::unwrap()` on an `Err` value: typst failed while compiling template /build/.tmp8UiuE8/.clinnet/templates/linnest-public-behavior.svg
233.92 s
>
233.92 s
> Command executed:
233.92 s
> "typst" "c" "/build/.tmp8UiuE8/.clinnet/templates/linnest-public-behavior.typ" "/build/.tmp8UiuE8/.clinnet/templates/linnest-public-behavior.svg" "--root" "/build/.tmp8UiuE8/.clinnet/templates"
233.92 s
>
233.92 s
> Typst stdout:
233.92 s
>
233.92 s
>
233.92 s
> Typst stderr:
233.92 s
>
233.92 s
>
233.92 s
> Location:
233.92 s
> crates/clinnet/src/lib.rs:741:13
233.92 s
> stack backtrace:
233.92 s
> 0: __rustc::rust_begin_unwind
233.92 s
> 1: core::panicking::panic_fmt
233.92 s
> 2: core::result::unwrap_failed
233.92 s
> 3: public_typst_behavior::render
233.92 s
> 4: <std::sync::once::Once>::call_once_force::<<std::sync::once_lock::OnceLock<alloc::string::String>>::initialize<<std::sync::once_lock::OnceLock<alloc::string::String>>::get_or_init<public_typst_behavior::linnest_public_svg::{closure#0}>::{closure#0}, !>::{closure#0}>::{closure#0}
233.92 s
> 5: <std::sys::sync::once::futex::Once>::call
233.92 s
> 6: <std::sync::once_lock::OnceLock<alloc::string::String>>::initialize::<<std::sync::once_lock::OnceLock<alloc::string::String>>::get_or_init<public_typst_behavior::linnest_public_svg::{closure#0}>::{closure#0}, !>
233.92 s
> 7: <public_typst_behavior::public_linnest_edge_styles_skip_fallbacks::{closure#0} as core::ops::function::FnOnce<()>>::call_once
233.92 s
> note: Some details are omitted, run with `RUST_BACKTRACE=full` for a verbose backtrace.
233.92 s
> system-out
233.92 s
> running 1 test
233.92 s
> test public_linnest_edge_styles_skip_fallbacks has been running for over 60 seconds
233.92 s
> test public_linnest_edge_styles_skip_fallbacks ... FAILED
233.92 s
>
233.92 s
> failures:
233.92 s
>
233.92 s
> failures:
233.92 s
> public_linnest_edge_styles_skip_fallbacks
233.92 s
>
233.92 s
> test result: FAILED. 0 passed; 1 failed; 0 ignored; 0 measured; 17 filtered out; finished in 115.99s
233.92 s
> system-err
233.92 s
> thread 'public_linnest_edge_styles_skip_fallbacks' (280) panicked at crates/clinnet/tests/public_typst_behavior.rs:81:55:
233.92 s
> called `Result::unwrap()` on an `Err` value: typst failed while compiling template /build/.tmp8UiuE8/.clinnet/templates/linnest-public-behavior.svg
233.92 s
>
233.92 s
> Command executed:
233.92 s
> "typst" "c" "/build/.tmp8UiuE8/.clinnet/templates/linnest-public-behavior.typ" "/build/.tmp8UiuE8/.clinnet/templates/linnest-public-behavior.svg" "--root" "/build/.tmp8UiuE8/.clinnet/templates"
233.92 s
>
233.92 s
> Typst stdout:
233.92 s
>
233.92 s
>
233.92 s
> Typst stderr:
233.92 s
>
233.92 s
>
233.92 s
> Location:
233.92 s
> crates/clinnet/src/lib.rs:741:13
233.92 s
> stack backtrace:
233.92 s
> 0: __rustc::rust_begin_unwind
233.92 s
> 1: core::panicking::panic_fmt
233.92 s
> 2: core::result::unwrap_failed
233.92 s
> 3: public_typst_behavior::render
233.92 s
> 4: <std::sync::once::Once>::call_once_force::<<std::sync::once_lock::OnceLock<alloc::string::String>>::initialize<<std::sync::once_lock::OnceLock<alloc::string::String>>::get_or_init<public_typst_behavior::linnest_public_svg::{closure#0}>::{closure#0}, !>::{closure#0}>::{closure#0}
233.92 s
> 5: <std::sys::sync::once::futex::Once>::call
233.92 s
> 6: <std::sync::once_lock::OnceLock<alloc::string::String>>::initialize::<<std::sync::once_lock::OnceLock<alloc::string::String>>::get_or_init<public_typst_behavior::linnest_public_svg::{closure#0}>::{closure#0}, !>
233.92 s
> 7: <public_typst_behavior::public_linnest_edge_styles_skip_fallbacks::{closure#0} as core::ops::function::FnOnce<()>>::call_once
233.92 s
> note: Some details are omitted, run with `RUST_BACKTRACE=full` for a verbose backtrace.
233.92 s
>
233.92 s
> 3. clinnet::public_typst_behavior::public_linnest_endpoint_anchor_distances_stay_local
233.92 s
> failure: test failure with exit code 101
233.92 s
> thread 'public_linnest_endpoint_anchor_distances_stay_local' (273) panicked at crates/clinnet/tests/public_typst_behavior.rs:81:55:
233.92 s
> called `Result::unwrap()` on an `Err` value: typst failed while compiling template /build/.tmp6IvFIA/.clinnet/templates/linnest-public-behavior.svg
233.92 s
>
233.92 s
> Command executed:
233.92 s
> "typst" "c" "/build/.tmp6IvFIA/.clinnet/templates/linnest-public-behavior.typ" "/build/.tmp6IvFIA/.clinnet/templates/linnest-public-behavior.svg" "--root" "/build/.tmp6IvFIA/.clinnet/templates"
233.92 s
>
233.92 s
> Typst stdout:
233.92 s
>
233.92 s
>
233.92 s
> Typst stderr:
233.92 s
>
233.92 s
>
233.92 s
> Location:
233.92 s
> crates/clinnet/src/lib.rs:741:13
233.92 s
> stack backtrace:
233.92 s
> 0: __rustc::rust_begin_unwind
233.92 s
> 1: core::panicking::panic_fmt
233.92 s
> 2: core::result::unwrap_failed
233.92 s
> 3: public_typst_behavior::render
233.92 s
> 4: <std::sync::once::Once>::call_once_force::<<std::sync::once_lock::OnceLock<alloc::string::String>>::initialize<<std::sync::once_lock::OnceLock<alloc::string::String>>::get_or_init<public_typst_behavior::linnest_public_svg::{closure#0}>::{closure#0}, !>::{closure#0}>::{closure#0}
233.92 s
> 5: <std::sys::sync::once::futex::Once>::call
233.92 s
> 6: <std::sync::once_lock::OnceLock<alloc::string::String>>::initialize::<<std::sync::once_lock::OnceLock<alloc::string::String>>::get_or_init<public_typst_behavior::linnest_public_svg::{closure#0}>::{closure#0}, !>
233.92 s
> 7: <public_typst_behavior::public_linnest_endpoint_anchor_distances_stay_local::{closure#0} as core::ops::function::FnOnce<()>>::call_once
233.92 s
> note: Some details are omitted, run with `RUST_BACKTRACE=full` for a verbose backtrace.
233.92 s
> system-out
233.92 s
> running 1 test
233.92 s
> test public_linnest_endpoint_anchor_distances_stay_local has been running for over 60 seconds
233.92 s
> test public_linnest_endpoint_anchor_distances_stay_local ... FAILED
233.92 s
>
233.92 s
> failures:
233.92 s
>
233.92 s
> failures:
233.92 s
> public_linnest_endpoint_anchor_distances_stay_local
233.92 s
>
233.92 s
> test result: FAILED. 0 passed; 1 failed; 0 ignored; 0 measured; 17 filtered out; finished in 126.43s
233.93 s
> system-err
233.93 s
> thread 'public_linnest_endpoint_anchor_distances_stay_local' (273) panicked at crates/clinnet/tests/public_typst_behavior.rs:81:55:
233.93 s
> called `Result::unwrap()` on an `Err` value: typst failed while compiling template /build/.tmp6IvFIA/.clinnet/templates/linnest-public-behavior.svg
233.93 s
>
233.93 s
> Command executed:
233.93 s
> "typst" "c" "/build/.tmp6IvFIA/.clinnet/templates/linnest-public-behavior.typ" "/build/.tmp6IvFIA/.clinnet/templates/linnest-public-behavior.svg" "--root" "/build/.tmp6IvFIA/.clinnet/templates"
233.93 s
>
233.93 s
> Typst stdout:
233.93 s
>
233.93 s
>
233.93 s
> Typst stderr:
233.93 s
>
233.93 s
>
233.93 s
> Location:
233.93 s
> crates/clinnet/src/lib.rs:741:13
233.93 s
> stack backtrace:
233.93 s
> 0: __rustc::rust_begin_unwind
233.93 s
> 1: core::panicking::panic_fmt
233.93 s
> 2: core::result::unwrap_failed
233.93 s
> 3: public_typst_behavior::render
233.93 s
> 4: <std::sync::once::Once>::call_once_force::<<std::sync::once_lock::OnceLock<alloc::string::String>>::initialize<<std::sync::once_lock::OnceLock<alloc::string::String>>::get_or_init<public_typst_behavior::linnest_public_svg::{closure#0}>::{closure#0}, !>::{closure#0}>::{closure#0}
233.93 s
> 5: <std::sys::sync::once::futex::Once>::call
233.93 s
> 6: <std::sync::once_lock::OnceLock<alloc::string::String>>::initialize::<<std::sync::once_lock::OnceLock<alloc::string::String>>::get_or_init<public_typst_behavior::linnest_public_svg::{closure#0}>::{closure#0}, !>
233.93 s
> 7: <public_typst_behavior::public_linnest_endpoint_anchor_distances_stay_local::{closure#0} as core::ops::function::FnOnce<()>>::call_once
233.93 s
> note: Some details are omitted, run with `RUST_BACKTRACE=full` for a verbose backtrace.
233.93 s
> =========================================
233.93 s
For full logs, run:
233.93 s
nix log /nix/store/4pqspwvh8pi9s2vg9g6mfsggpl9ynwzx-gammaloop-nextest-clinnet.drv
234.23 s
[6 built (1 failed ), 76 Run failed.