test packages.x86_64-linux.nix-ci-check-gammaloop-nextest-integration

Reproduce this run
Original Run
  1. 211.51 s gammaloop-nextest-integration> | dod2_bubble | rls.integrated | GL0 | pass | 0.0sigma | compatible within 2sigma | - |
  2. 211.51 s gammaloop-nextest-integration> +-------------+-----------------+---------+--------+----------+-----------------------------------------------------------------------------------------------------------------------+-------+
  3. 211.51 s gammaloop-nextest-integration> | dod2_bubble | mu_r.inspect | inspect | pass | - | best inspect relative delta 6.951e-1 >= 1000*accuracy 1.000e-7 (accuracy=1.000e-10, exponent=+0.0, seed=0, probes=10) | - |
  4. 211.51 s gammaloop-nextest-integration> +-------------+-----------------+---------+--------+----------+-----------------------------------------------------------------------------------------------------------------------+-------+
  5. 211.51 s gammaloop-nextest-integration> | dod2_bubble | target | - | pass | - | 2sigma | - |
  6. 211.51 s gammaloop-nextest-integration> +-------------+-----------------+---------+--------+----------+-----------------------------------------------------------------------------------------------------------------------+-------+
  7. 211.51 s gammaloop-nextest-integration> test dod2_bubble_uv ... FAILED
  8. 211.51 s gammaloop-nextest-integration>
  9. 211.51 s gammaloop-nextest-integration> failures:
  10. 211.51 s gammaloop-nextest-integration>
  11. 211.51 s gammaloop-nextest-integration> failures:
  12. 211.51 s gammaloop-nextest-integration> dod2_bubble_uv
  13. 211.51 s gammaloop-nextest-integration>
  14. 211.51 s gammaloop-nextest-integration> test result: FAILED. 0 passed; 1 failed; 0 ignored; 0 measured; 24 filtered out; finished in 67.45s
  15. 211.51 s gammaloop-nextest-integration> system-err
  16. 211.51 s gammaloop-nextest-integration> [2026-09-02 09:05:26.215] @gammaloop_api::se... INFO : Running command run generate
  17. 211.51 s gammaloop-nextest-integration> [2026-09-02 09:05:26.215] @gammaloop_api::se... INFO : Starting command block generate
  18. 211.51 s gammaloop-nextest-integration> [2026-09-02 09:05:26.216] @gammaloop_api::se... INFO : Running command import model scalars-default.json
  19. 211.51 s gammaloop-nextest-integration> [2026-09-02 09:05:26.216] @import::model INFO : Loading built-in JSON model scalars-default
  20. 211.51 s gammaloop-nextest-integration> [2026-09-02 09:05:26.219] @gammalooprs::model INFO : The following 2 external parameters were forced to zero by the restriction card:
  21. 211.51 s gammaloop-nextest-integration> width_scalar_1, width_scalar_2
  22. 211.51 s gammaloop-nextest-integration> [2026-09-02 09:05:26.220] @gammaloop_api::se... INFO : Running command remove processes
  23. 211.51 s gammaloop-nextest-integration> [2026-09-02 09:05:26.220] @gammaloop_api::se... INFO : Running command set global kv global.generation.uv.generate_integrated=true
  24. 211.51 s gammaloop-nextest-integration> [2026-09-02 09:05:26.220] @gammaloop_api::se... INFO : Running command import graphs ./tests/resources/graphs/scalar/dod2_bubble.dot -p bubble_dod2 -i scalar_bubble_below_thres
  25. 211.51 s gammaloop-nextest-integration> [2026-09-02 09:05:26.220] @commands::import INFO : Loading graphs from '/build/source/tests/resources/graphs/scalar/dod2_bubble.dot'
  26. 211.51 s gammaloop-nextest-integration> [2026-09-02 09:05:26.223] @gammaloop_api::se... INFO : Running command generate existing -p bubble_dod2 -i scalar_bubble_below_thres
  27. 211.51 s gammaloop-nextest-integration> [2026-09-02 09:05:26.223] @approx::local_4d [{#uv, #inspect, #integrated}] DEBUG : Rescaled momenta expanded
  28. 211.51 s gammaloop-nextest-integration> field value
  29. 211.51 s gammaloop-nextest-integration> res n-terms: 1, byte size: 3,expr:
  30. 211.51 s gammaloop-nextest-integration> 1
  31. 211.51 s gammaloop-nextest-integration> [2026-09-02 09:05:26.224] @approx::local_4d [{#uv, #inspect, #integrated}] DEBUG : Rescaled momenta expanded
  32. 211.51 s gammaloop-nextest-integration> field value
  33. 211.51 s gammaloop-nextest-integration> res n-terms: 1, byte size: 585,expr:
  34. 211.51 s gammaloop-nextest-integration> -SCALAR_COUPLING²·q₀(αᵉ².¹)·q₀(αᵉ³.¹)·q₂(αᵉ².¹)·q₂(αᵉ³.¹)
  35. 211.51 s gammaloop-nextest-integration> /(t²·denom(3,-q₀-q₂/t,mass_scalar_2²,-mass_scalar_2²+2·(q₀.q₂)/t+(q₂.q₂)/t²+(q₀.q₀))
  36. 211.51 s gammaloop-nextest-integration> ·denom(2,q₂/t,mass_scalar_2²,-mass_scalar_2²+(q₂.q₂)/t²))
  37. 211.51 s gammaloop-nextest-integration> [2026-09-02 09:05:26.229] @approx::final_integrand[{#generation, #profile, #uv, #graph, #summary}] DEBUG : Computed global numerator
  38. 211.51 s gammaloop-nextest-integration> field value
  39. 211.51 s gammaloop-nextest-integration> global_num n-terms: 1, byte size: 4,expr:
  40. 211.51 s gammaloop-nextest-integration> 1/2
  41. 211.51 s gammaloop-nextest-integration> span build_3d{span_context=true graph=GL0 current=subgraph=0, topo_order=0, dod=0}
  42. 211.51 s gammaloop-nextest-integration> [2026-09-02 09:05:26.232] @uv::approx [{#generation, #uv, #fourd}] DEBUG : Computing 4D
  43. 211.51 s gammaloop-nextest-integration> field value
  44. 211.51 s gammaloop-nextest-integration> simple subgraph(S_11,S_y)*Approx(subgraph(S_y,0)) of GL0
  45. 211.51 s gammaloop-nextest-integration> span compute_4d{span_context=true graph=GL0 current=subgraph=y, topo_order=1, dod=2 given=subgraph=0, topo_order=0, dod=0 reduced=SubSet { set: BitVec<usize, bitvec::order::Lsb0> { addr: 0x7fffec027530, head: 000000, bits: 6, capacity: 64 } [0, 0, 1, 1, 1, 1], id: PhantomData<linnet::half_edge::involution::Hedge> }}
  46. 211.51 s gammaloop-nextest-integration> [2026-09-02 09:05:26.232] @approx::local_4d [{#uv, #algebra, #integrated, #start}] DEBUG :
  47. 211.51 s gammaloop-nextest-integration> field value
  48. 211.51 s gammaloop-nextest-integration> integrand n-terms: 1, byte size: 409,expr:
  49. 211.51 s gammaloop-nextest-integration> SCALAR_COUPLING²·(q₀(αᵉ³.¹)+q₃(αᵉ³.¹))·q₀(αᵉ².¹)·q₀(αᵉ³.¹)·q₂(αᵉ².¹)
  50. 211.51 s gammaloop-nextest-integration> /(denom(2,q₂,mass_scalar_2²,-mass_scalar_2²+(q₂.q₂))·denom(3,q₃,mass_scalar_2²,-mass_scalar_2²+(q₃.q₃)))
  51. 211.51 s gammaloop-nextest-integration> reduced y
  52. 211.51 s gammaloop-nextest-integration> span grow{span_context=true current=subgraph=y, topo_order=1, dod=2 given=subgraph=0, topo_order=0, dod=0}
  53. 211.51 s gammaloop-nextest-integration> [2026-09-02 09:05:26.232] @approx::local_4d [{#uv, #inspect, #integrated}] DEBUG : Rescaled momenta expanded
  54. 211.51 s gammaloop-nextest-integration> field value
  55. 211.51 s gammaloop-nextest-integration> res n-terms: 1, byte size: 585,expr:
  56. 211.51 s gammaloop-nextest-integration> -SCALAR_COUPLING²·q₀(αᵉ².¹)·q₀(αᵉ³.¹)·q₂(αᵉ².¹)·q₂(αᵉ³.¹)
  57. 211.51 s gammaloop-nextest-integration> /(t²·denom(3,-q₀-q₂/t,mass_scalar_2²,-mass_scalar_2²+2·(q₀.q₂)/t+(q₂.q₂)/t²+(q₀.q₀))
  58. 211.51 s gammaloop-nextest-integration> ·denom(2,q₂/t,mass_scalar_2²,-mass_scalar_2²+(q₂.q₂)/t²))
  59. 211.51 s gammaloop-nextest-integration> span t{span_context=true current=subgraph=y, topo_order=1, dod=2 given=subgraph=0, topo_order=0, dod=0}
  60. 211.51 s gammaloop-nextest-integration> [2026-09-02 09:05:26.232] @approx::local_4d [{#uv, #integrated, #rescaled}] DEBUG : Rescaled expanded
  61. 211.51 s gammaloop-nextest-integration> field value
  62. 211.51 s gammaloop-nextest-integration> n_loops 1
  63. 211.51 s gammaloop-nextest-integration> res n-terms: 1, byte size: 707,expr:
  64. 211.51 s gammaloop-nextest-integration> -SCALAR_COUPLING²·q₀(αᵉ².¹)·q₀(αᵉ³.¹)·q₂(αᵉ².¹)·q₂(αᵉ³.¹)
  65. 211.51 s gammaloop-nextest-integration> /(t²·denom(3,-q₂,mUVexp²+t²·mass_scalar_2²,-mUV²+t²·(-mass_scalar_2²+2·(q₀.q₂)/t+(q₂.q₂)/t²+(q₀.q₀))+t²·mUVexp²)
  66. 211.51 s gammaloop-nextest-integration> ·denom(2,q₂,mUVexp²+t²·mass_scalar_2²,-mUV²+t²·(-mass_scalar_2²+(q₂.q₂)/t²)+t²·mUVexp²))
  67. 211.51 s gammaloop-nextest-integration> span t{span_context=true current=subgraph=y, topo_order=1, dod=2 given=subgraph=0, topo_order=0, dod=0}
  68. 211.51 s gammaloop-nextest-integration> [2026-09-02 09:05:26.233] @approx::local_4d [{#uv, #integrated, #series}] DEBUG : Series expanded
  69. 211.51 s gammaloop-nextest-integration> field value
  70. 211.51 s gammaloop-nextest-integration> res n-terms: 3, byte size: 1896,expr:
  71. 211.51 s gammaloop-nextest-integration> (1/2·SCALAR_COUPLING²·(2·mUVexp²-2·mass_scalar_2²)/(denom(2,q₂,mUVexp²,-mUV²+(q₂.q₂))²·denom(3,-q₂,mUVexp²,-mUV²+(q₂.q₂)))
  72. 211.51 s gammaloop-nextest-integration> -SCALAR_COUPLING²
  73. 211.51 s gammaloop-nextest-integration> ·(-1/2·(2·mUVexp²-2·mass_scalar_2²+2·(q₀.q₀))/denom(3,-q₂,mUVexp²,-mUV²+(q₂.q₂))
  74. 211.51 s gammaloop-nextest-integration> +4·(q₀.q₂)²/denom(3,-q₂,mUVexp²,-mUV²+(q₂.q₂))²
  75. 211.51 s gammaloop-nextest-integration> )/(denom(2,q₂,mUVexp²,-mUV²+(q₂.q₂))·denom(3,-q₂,mUVexp²,-mUV²+(q₂.q₂)))
  76. 211.51 s gammaloop-nextest-integration> )·q₀(αᵉ².¹)·q₀(αᵉ³.¹)·q₂(αᵉ².¹)·q₂(αᵉ³.¹)
  77. 211.51 s gammaloop-nextest-integration> +2·SCALAR_COUPLING²·(q₀.q₂)·q₀(αᵉ².¹)·q₀(αᵉ³.¹)·q₂(αᵉ².¹)·q₂(αᵉ³.¹)
  78. 211.51 s gammaloop-nextest-integration> /(t·denom(2,q₂,mUVexp²,-mUV²+(q₂.q₂))·denom(3,-q₂,mUVexp²,-mUV²+(q₂.q₂))²)
  79. 211.51 s gammaloop-nextest-integration> -SCALAR_COUPLING²·q₀(αᵉ².¹)·q₀(αᵉ³.¹)·q₂(αᵉ².¹)·q₂(αᵉ³.¹)
  80. 211.51 s gammaloop-nextest-integration> /(t²·denom(2,q₂,mUVexp²,-mUV²+(q₂.q₂))·denom(3,-q₂,mUVexp²,-mUV²+(q₂.q₂)))
  81. 211.51 s gammaloop-nextest-integration> span t{span_context=true current=subgraph=y, topo_order=1, dod=2 given=subgraph=0, topo_order=0, dod=0}
  82. 211.51 s gammaloop-nextest-integration> [2026-09-02 09:05:26.233] @approx::local_4d [{#uv, #integrated, #series}] DEBUG : Evaluated at t = 1
  83. 211.51 s gammaloop-nextest-integration> field value
  84. 211.51 s gammaloop-nextest-integration> res n-terms: 3, byte size: 1880,expr:
  85. 211.51 s gammaloop-nextest-integration> (1/2·SCALAR_COUPLING²·(2·mUVexp²-2·mass_scalar_2²)/(denom(2,q₂,mUVexp²,-mUV²+(q₂.q₂))²·denom(3,-q₂,mUVexp²,-mUV²+(q₂.q₂)))
  86. 211.51 s gammaloop-nextest-integration> -SCALAR_COUPLING²
  87. 211.51 s gammaloop-nextest-integration> ·(-1/2·(2·mUVexp²-2·mass_scalar_2²+2·(q₀.q₀))/denom(3,-q₂,mUVexp²,-mUV²+(q₂.q₂))
  88. 211.51 s gammaloop-nextest-integration> +4·(q₀.q₂)²/denom(3,-q₂,mUVexp²,-mUV²+(q₂.q₂))²
  89. 211.51 s gammaloop-nextest-integration> )/(denom(2,q₂,mUVexp²,-mUV²+(q₂.q₂))·denom(3,-q₂,mUVexp²,-mUV²+(q₂.q₂)))
  90. 211.51 s gammaloop-nextest-integration> )·q₀(αᵉ².¹)·q₀(αᵉ³.¹)·q₂(αᵉ².¹)·q₂(αᵉ³.¹)
  91. 211.51 s gammaloop-nextest-integration> -SCALAR_COUPLING²·q₀(αᵉ².¹)·q₀(αᵉ³.¹)·q₂(αᵉ².¹)·q₂(αᵉ³.¹)
  92. 211.51 s gammaloop-nextest-integration> /(denom(2,q₂,mUVexp²,-mUV²+(q₂.q₂))·denom(3,-q₂,mUVexp²,-mUV²+(q₂.q₂)))
  93. 211.51 s gammaloop-nextest-integration> +2·SCALAR_COUPLING²·(q₀.q₂)·q₀(αᵉ².¹)·q₀(αᵉ³.¹)·q₂(αᵉ².¹)·q₂(αᵉ³.¹)
  94. 211.51 s gammaloop-nextest-integration> /(denom(2,q₂,mUVexp²,-mUV²+(q₂.q₂))·denom(3,-q₂,mUVexp²,-mUV²+(q₂.q₂))²)
  95. 211.51 s gammaloop-nextest-integration> span t{span_context=true current=subgraph=y, topo_order=1, dod=2 given=subgraph=0, topo_order=0, dod=0}
  96. 211.51 s gammaloop-nextest-integration> [2026-09-02 09:05:26.235] @approx::local_4d [{#uv, #collect, #integrated}] DEBUG : After gamma chain collection
  97. 211.51 s gammaloop-nextest-integration> field value
  98. 211.51 s gammaloop-nextest-integration> expr n-terms: 3, byte size: 1880,expr:
  99. 211.51 s gammaloop-nextest-integration> (1/2·SCALAR_COUPLING²·(2·mUVexp²-2·mass_scalar_2²)/(denom(2,q₂,mUVexp²,-mUV²+(q₂.q₂))²·denom(3,-q₂,mUVexp²,-mUV²+(q₂.q₂)))
  100. 211.51 s gammaloop-nextest-integration> -SCALAR_COUPLING²
  101. 211.51 s gammaloop-nextest-integration> ·(-1/2·(2·mUVexp²-2·mass_scalar_2²+2·(q₀.q₀))/denom(3,-q₂,mUVexp²,-mUV²+(q₂.q₂))
  102. 211.51 s gammaloop-nextest-integration> +4·(q₀.q₂)²/denom(3,-q₂,mUVexp²,-mUV²+(q₂.q₂))²
  103. 211.51 s gammaloop-nextest-integration> )/(denom(2,q₂,mUVexp²,-mUV²+(q₂.q₂))·denom(3,-q₂,mUVexp²,-mUV²+(q₂.q₂)))
  104. 211.51 s gammaloop-nextest-integration> )·q₀(αᵉ².¹)·q₀(αᵉ³.¹)·q₂(αᵉ².¹)·q₂(αᵉ³.¹)
  105. 211.51 s gammaloop-nextest-integration> -SCALAR_COUPLING²·q₀(αᵉ².¹)·q₀(αᵉ³.¹)·q₂(αᵉ².¹)·q₂(αᵉ³.¹)
  106. 211.51 s gammaloop-nextest-integration> /(denom(2,q₂,mUVexp²,-mUV²+(q₂.q₂))·denom(3,-q₂,mUVexp²,-mUV²+(q₂.q₂)))
  107. 211.51 s gammaloop-nextest-integration> +2·SCALAR_COUPLING²·(q₀.q₂)·q₀(αᵉ².¹)·q₀(αᵉ³.¹)·q₂(αᵉ².¹)·q₂(αᵉ³.¹)
  108. 211.52 s gammaloop-nextest-integration> /(denom(2,q₂,mUVexp²,-mUV²+(q₂.q₂))·denom(3,-q₂,mUVexp²,-mUV²+(q₂.q₂))²)
  109. 211.52 s gammaloop-nextest-integration> span t{span_context=true current=subgraph=y, topo_order=1, dod=2 given=subgraph=0, topo_order=0, dod=0}
  110. 211.52 s gammaloop-nextest-integration> [2026-09-02 09:05:26.236] @approx::local_4d [{#profile, #uv, #collect, #integrated, #start, #trace}] DEBUG : After gamma schoonschip
  111. 211.52 s gammaloop-nextest-integration> field value
  112. 211.52 s gammaloop-nextest-integration> expr n-terms: 3, byte size: 1631,expr:
  113. 211.52 s gammaloop-nextest-integration> (1/2·SCALAR_COUPLING²·(2·mUVexp²-2·mass_scalar_2²)/(denom(2,q₂,mUVexp²,-mUV²+(q₂.q₂))²·denom(3,-q₂,mUVexp²,-mUV²+(q₂.q₂)))
  114. 211.52 s gammaloop-nextest-integration> -SCALAR_COUPLING²
  115. 211.52 s gammaloop-nextest-integration> ·(-1/2·(2·mUVexp²-2·mass_scalar_2²+2·(q₀.q₀))/denom(3,-q₂,mUVexp²,-mUV²+(q₂.q₂))
  116. 211.52 s gammaloop-nextest-integration> +4·(q₀.q₂)²/denom(3,-q₂,mUVexp²,-mUV²+(q₂.q₂))²
  117. 211.52 s gammaloop-nextest-integration> )/(denom(2,q₂,mUVexp²,-mUV²+(q₂.q₂))·denom(3,-q₂,mUVexp²,-mUV²+(q₂.q₂)))
  118. 211.52 s gammaloop-nextest-integration> )·(q₀.q₂)²
  119. 211.52 s gammaloop-nextest-integration> -SCALAR_COUPLING²·(q₀.q₂)²/(denom(2,q₂,mUVexp²,-mUV²+(q₂.q₂))·denom(3,-q₂,mUVexp²,-mUV²+(q₂.q₂)))
  120. 211.52 s gammaloop-nextest-integration> +2·SCALAR_COUPLING²·(q₀.q₂)·(q₀.q₂)²
  121. 211.52 s gammaloop-nextest-integration> /(denom(2,q₂,mUVexp²,-mUV²+(q₂.q₂))·denom(3,-q₂,mUVexp²,-mUV²+(q₂.q₂))²)
  122. 211.52 s gammaloop-nextest-integration> span t{span_context=true current=subgraph=y, topo_order=1, dod=2 given=subgraph=0, topo_order=0, dod=0}
  123. 211.52 s gammaloop-nextest-integration> [2026-09-02 09:05:26.237] @approx::local_4d [{#profile, #uv, #collect, #integrated, #start, #trace}] DEBUG : After gamma collection
  124. 211.52 s gammaloop-nextest-integration> field value
  125. 211.52 s gammaloop-nextest-integration> expr n-terms: 1, byte size: 1347,expr:
  126. 211.52 s gammaloop-nextest-integration> SCALAR_COUPLING²
  127. 211.52 s gammaloop-nextest-integration> ·(-denom(2,q₂,mUVexp²,-mUV²+(q₂.q₂))·denom(3,-q₂,mUVexp²,-mUV²+(q₂.q₂))²
  128. 211.52 s gammaloop-nextest-integration> +1/2·(2·mUVexp²-2·mass_scalar_2²)·denom(3,-q₂,mUVexp²,-mUV²+(q₂.q₂))²
  129. 211.52 s gammaloop-nextest-integration> -(-1/2·(2·mUVexp²-2·mass_scalar_2²+2·(q₀.q₀))·denom(3,-q₂,mUVexp²,-mUV²+(q₂.q₂))+4·(q₀.q₂)²)
  130. 211.52 s gammaloop-nextest-integration> ·denom(2,q₂,mUVexp²,-mUV²+(q₂.q₂))
  131. 211.52 s gammaloop-nextest-integration> +2·(q₀.q₂)·denom(2,q₂,mUVexp²,-mUV²+(q₂.q₂))·denom(3,-q₂,mUVexp²,-mUV²+(q₂.q₂))
  132. 211.52 s gammaloop-nextest-integration> )·(q₀.q₂)²/(denom(2,q₂,mUVexp²,-mUV²+(q₂.q₂))²·denom(3,-q₂,mUVexp²,-mUV²+(q₂.q₂))³)
  133. 211.52 s gammaloop-nextest-integration> span t{span_context=true current=subgraph=y, topo_order=1, dod=2 given=subgraph=0, topo_order=0, dod=0}
  134. 211.52 s gammaloop-nextest-integration> [2026-09-02 09:05:26.238] @approx::local_4d [{#profile, #uv, #gamma, #integrated, #start, #trace, #vakint}] DEBUG : After gamma simplification
  135. 211.52 s gammaloop-nextest-integration> ... omitted 3263 more lines; see full nextest output above
  136. 211.52 s gammaloop-nextest-integration>
  137. 211.52 s gammaloop-nextest-integration> 8. gammaloop-integration-tests::uv::sunrise_scalar_1_uv
  138. 211.55 s gammaloop-nextest-integration> failure: test failure with exit code 101
  139. 211.55 s gammaloop-nextest-integration> system-out
  140. 211.55 s gammaloop-nextest-integration> running 1 test
  141. 211.55 s gammaloop-nextest-integration> test sunrise_scalar_1_uv has been running for over 60 seconds
  142. 211.55 s gammaloop-nextest-integration> +------------------+------------------------+--------------+--------+----------+----------------------------------------------------------------------------------------------------------------------+-------+
  143. 211.55 s gammaloop-nextest-integration> | case | check | graph | status | sigma | threshold | error |
  144. 211.55 s gammaloop-nextest-integration> +------------------+------------------------+--------------+--------+----------+----------------------------------------------------------------------------------------------------------------------+-------+
  145. 211.55 s gammaloop-nextest-integration> | sunrise_scalar_1 | uv_profile | - | FAIL | - | - | - |
  146. 211.55 s gammaloop-nextest-integration> +------------------+------------------------+--------------+--------+----------+----------------------------------------------------------------------------------------------------------------------+-------+
  147. 211.55 s gammaloop-nextest-integration> | sunrise_scalar_1 | m_uv.inspect | inspect | pass | - | best inspect relative delta 1.624e0 >= 1000*accuracy 1.000e-3 (accuracy=1.000e-6, exponent=+1.0, seed=1, probes=10) | - |
  148. 211.55 s gammaloop-nextest-integration> +------------------+------------------------+--------------+--------+----------+----------------------------------------------------------------------------------------------------------------------+-------+
  149. 211.55 s gammaloop-nextest-integration> | sunrise_scalar_1 | m_uv.integrated | sunrise | pass | 0.1sigma | compatible within 2sigma | - |
  150. 211.55 s gammaloop-nextest-integration> +------------------+------------------------+--------------+--------+----------+----------------------------------------------------------------------------------------------------------------------+-------+
  151. 211.55 s gammaloop-nextest-integration> | sunrise_scalar_1 | rls.inspect | inspect | pass | - | best inspect relative delta 8.682e-1 >= 1000*accuracy 1.000e-3 (accuracy=1.000e-6, exponent=+1.0, seed=1, probes=10) | - |
  152. 211.55 s gammaloop-nextest-integration> +------------------+------------------------+--------------+--------+----------+----------------------------------------------------------------------------------------------------------------------+-------+
  153. 211.55 s gammaloop-nextest-integration> | sunrise_scalar_1 | rls.integrated | sunrise | pass | 0.0sigma | compatible within 2sigma | - |
  154. 211.55 s gammaloop-nextest-integration> +------------------+------------------------+--------------+--------+----------+----------------------------------------------------------------------------------------------------------------------+-------+
  155. 211.55 s gammaloop-nextest-integration> | sunrise_scalar_1 | mu_r.inspect | inspect | pass | - | best inspect relative delta 1.752e0 >= 1000*accuracy 1.000e-3 (accuracy=1.000e-6, exponent=+1.0, seed=1, probes=10) | - |
  156. 211.55 s gammaloop-nextest-integration> +------------------+------------------------+--------------+--------+----------+----------------------------------------------------------------------------------------------------------------------+-------+
  157. 211.55 s gammaloop-nextest-integration> | sunrise_scalar_1 | integrated.relerr | integrated | pass | - | relative error 9.20% <= 10.00% | - |
  158. 211.55 s gammaloop-nextest-integration> +------------------+------------------------+--------------+--------+----------+----------------------------------------------------------------------------------------------------------------------+-------+
  159. 211.55 s gammaloop-nextest-integration> | sunrise_scalar_1 | m_uv.integrated.relerr | m_uv-shifted | pass | - | relative error 5.89% <= 10.00% | - |
  160. 211.55 s gammaloop-nextest-integration> +------------------+------------------------+--------------+--------+----------+----------------------------------------------------------------------------------------------------------------------+-------+
  161. 211.55 s gammaloop-nextest-integration> | sunrise_scalar_1 | target | - | pass | - | 2sigma | - |
  162. 211.55 s gammaloop-nextest-integration> +------------------+------------------------+--------------+--------+----------+----------------------------------------------------------------------------------------------------------------------+-------+
  163. 211.55 s gammaloop-nextest-integration> test sunrise_scalar_1_uv ... FAILED
  164. 211.55 s gammaloop-nextest-integration>
  165. 211.55 s gammaloop-nextest-integration> failures:
  166. 211.55 s gammaloop-nextest-integration>
  167. 211.55 s gammaloop-nextest-integration> failures:
  168. 211.55 s gammaloop-nextest-integration> sunrise_scalar_1_uv
  169. 211.55 s gammaloop-nextest-integration>
  170. 211.55 s gammaloop-nextest-integration> test result: FAILED. 0 passed; 1 failed; 0 ignored; 0 measured; 24 filtered out; finished in 127.80s
  171. 211.56 s gammaloop-nextest-integration> system-err
  172. 211.56 s gammaloop-nextest-integration> [2026-09-02 09:05:32.145] @gammaloop_api::se... INFO : Running command run generate
  173. 211.56 s gammaloop-nextest-integration> [2026-09-02 09:05:32.145] @gammaloop_api::se... INFO : Starting command block generate
  174. 211.56 s gammaloop-nextest-integration> [2026-09-02 09:05:32.145] @gammaloop_api::se... INFO : Running command import model scalars-default.json
  175. 211.56 s gammaloop-nextest-integration> [2026-09-02 09:05:32.145] @import::model INFO : Loading built-in JSON model scalars-default
  176. 211.56 s gammaloop-nextest-integration> [2026-09-02 09:05:32.152] @gammalooprs::model INFO : The following 2 external parameters were forced to zero by the restriction card:
  177. 211.56 s gammaloop-nextest-integration> width_scalar_1, width_scalar_2
  178. 211.56 s gammaloop-nextest-integration> [2026-09-02 09:05:32.152] @gammaloop_api::se... INFO : Running command remove processes
  179. 211.56 s gammaloop-nextest-integration> [2026-09-02 09:05:32.152] @gammaloop_api::se... INFO : Running command set global kv global.generation.uv.generate_integrated=true
  180. 211.56 s gammaloop-nextest-integration> [2026-09-02 09:05:32.153] @gammaloop_api::se... INFO : Running command import graphs ./tests/resources/graphs/scalar_sunrise.dot -p sunrise_scalar_1 -i scalar_sunrise
  181. 211.56 s gammaloop-nextest-integration> [2026-09-02 09:05:32.153] @commands::import INFO : Loading graphs from '/build/source/tests/resources/graphs/scalar_sunrise.dot'
  182. 211.56 s gammaloop-nextest-integration> [2026-09-02 09:05:32.158] @gammaloop_api::se... INFO : Running command generate existing -p sunrise_scalar_1 -i scalar_sunrise
  183. 211.56 s gammaloop-nextest-integration> [2026-09-02 09:05:32.159] @approx::local_4d [{#uv, #inspect, #integrated}] DEBUG : Rescaled momenta expanded
  184. 211.56 s gammaloop-nextest-integration> field value
  185. 211.56 s gammaloop-nextest-integration> res n-terms: 1, byte size: 3,expr:
  186. 211.56 s gammaloop-nextest-integration> 1
  187. 211.56 s gammaloop-nextest-integration> [2026-09-02 09:05:32.160] @approx::local_4d [{#uv, #inspect, #integrated}] DEBUG : Rescaled momenta expanded
  188. 211.56 s gammaloop-nextest-integration> field value
  189. 211.56 s gammaloop-nextest-integration> res n-terms: 1, byte size: 611,expr:
  190. 211.56 s gammaloop-nextest-integration> 1/(denom(0,q₀/t,mass_scalar_1²,-mass_scalar_1²+(q₀.q₀)/t²)
  191. 211.56 s gammaloop-nextest-integration> ·denom(1,-q₂+q₃-q₀/t,mass_scalar_1²,
  192. 211.56 s gammaloop-nextest-integration> -mass_scalar_1²+2·(q₀.q₂)/t-2·(q₀.q₃)/t+(q₀.q₀)/t²+(q₂.q₂)
  193. 211.56 s gammaloop-nextest-integration> -2·(q₂.q₃)+(q₃.q₃)
  194. 211.56 s gammaloop-nextest-integration> ))
  195. 211.56 s gammaloop-nextest-integration> [2026-09-02 09:05:32.186] @approx::local_4d [{#uv, #inspect, #integrated}] DEBUG : Rescaled momenta expanded
  196. 211.56 s gammaloop-nextest-integration> field value
  197. 211.56 s gammaloop-nextest-integration> res n-terms: 1, byte size: 611,expr:
  198. 211.56 s gammaloop-nextest-integration> 1/(denom(1,q₁/t,mass_scalar_1²,-mass_scalar_1²+(q₁.q₁)/t²)
  199. 211.56 s gammaloop-nextest-integration> ·denom(2,-q₀+q₃-q₁/t,mass_scalar_1²,
  200. 211.56 s gammaloop-nextest-integration> -mass_scalar_1²+2·(q₀.q₁)/t-2·(q₁.q₃)/t+(q₁.q₁)/t²+(q₀.q₀)
  201. 211.56 s gammaloop-nextest-integration> -2·(q₀.q₃)+(q₃.q₃)
  202. 211.56 s gammaloop-nextest-integration> ))
  203. 211.56 s gammaloop-nextest-integration> [2026-09-02 09:05:32.203] @approx::local_4d [{#uv, #inspect, #integrated}] DEBUG : Rescaled momenta expanded
  204. 211.56 s gammaloop-nextest-integration> field value
  205. 211.56 s gammaloop-nextest-integration> res n-terms: 1, byte size: 777,expr:
  206. 211.56 s gammaloop-nextest-integration> 1/(denom(0,q₀/t,mass_scalar_1²,-mass_scalar_1²+(q₀.q₀)/t²)·denom(1,q₁/t,mass_scalar_1²,-mass_scalar_1²+(q₁.q₁)/t²)
  207. 211.56 s gammaloop-nextest-integration> ·denom(2,q₄-q₀/t-q₁/t,mass_scalar_1²,
  208. 211.56 s gammaloop-nextest-integration> -mass_scalar_1²-2·(q₀.q₄)/t-2·(q₁.q₄)/t+(q₀.q₀)/t²+2·(q₀.q₁)/t²
  209. 211.56 s gammaloop-nextest-integration> +(q₁.q₁)/t²+(q₄.q₄)
  210. 211.56 s gammaloop-nextest-integration> ))
  211. 211.56 s gammaloop-nextest-integration> [2026-09-02 09:05:32.226] @approx::local_4d [{#uv, #inspect, #integrated}] DEBUG : Rescaled momenta expanded
  212. 211.56 s gammaloop-nextest-integration> field value
  213. 211.56 s gammaloop-nextest-integration> res n-terms: 1, byte size: 611,expr:
  214. 211.56 s gammaloop-nextest-integration> 1/(denom(0,q₀/t,mass_scalar_1²,-mass_scalar_1²+(q₀.q₀)/t²)
  215. 211.56 s gammaloop-nextest-integration> ·denom(2,-q₁+q₃-q₀/t,mass_scalar_1²,
  216. 211.56 s gammaloop-nextest-integration> -mass_scalar_1²+2·(q₀.q₁)/t-2·(q₀.q₃)/t+(q₀.q₀)/t²+(q₁.q₁)
  217. 211.56 s gammaloop-nextest-integration> -2·(q₁.q₃)+(q₃.q₃)
  218. 211.56 s gammaloop-nextest-integration> ))
  219. 211.56 s gammaloop-nextest-integration> [2026-09-02 09:05:32.226] @approx::final_integrand[{#generation, #profile, #uv, #graph, #summary}] DEBUG : Computed global numerator
  220. 211.56 s gammaloop-nextest-integration> field value
  221. 211.56 s gammaloop-nextest-integration> global_num n-terms: 1, byte size: 3,expr:
  222. 211.56 s gammaloop-nextest-integration> 1
  223. 211.56 s gammaloop-nextest-integration> span build_3d{span_context=true graph=sunrise current=subgraph=0, topo_order=0, dod=0}
  224. 211.56 s gammaloop-nextest-integration> [2026-09-02 09:05:32.252] @uv::approx [{#generation, #uv, #fourd}] DEBUG : Computing 4D
  225. 211.56 s gammaloop-nextest-integration> field value
  226. 211.56 s gammaloop-nextest-integration> simple subgraph(S_47,S_y)*Approx(subgraph(S_y,0)) of sunrise
  227. 211.56 s gammaloop-nextest-integration> span compute_4d{span_context=true graph=sunrise current=subgraph=y, topo_order=1, dod=0 given=subgraph=0, topo_order=0, dod=0 reduced=SubSet { set: BitVec<usize, bitvec::order::Lsb0> { addr: 0x7fffec01df50, head: 000000, bits: 8, capacity: 64 } [0, 0, 1, 1, 1, 1, 0, 0], id: PhantomData<linnet::half_edge::involution::Hedge> }}
  228. 211.56 s gammaloop-nextest-integration> [2026-09-02 09:05:32.253] @approx::local_4d [{#uv, #algebra, #integrated, #start}] DEBUG :
  229. 211.56 s gammaloop-nextest-integration> field value
  230. 211.56 s gammaloop-nextest-integration> integrand n-terms: 1, byte size: 217,expr:
  231. 211.56 s gammaloop-nextest-integration> 1/(denom(0,q₀,mass_scalar_1²,-mass_scalar_1²+(q₀.q₀))·denom(1,q₁,mass_scalar_1²,-mass_scalar_1²+(q₁.q₁)))
  232. 211.56 s gammaloop-nextest-integration> reduced y
  233. 211.56 s gammaloop-nextest-integration> span grow{span_context=true current=subgraph=y, topo_order=1, dod=0 given=subgraph=0, topo_order=0, dod=0}
  234. 211.56 s gammaloop-nextest-integration> [2026-09-02 09:05:32.253] @approx::local_4d [{#uv, #inspect, #integrated}] DEBUG : Rescaled momenta expanded
  235. 211.56 s gammaloop-nextest-integration> field value
  236. 211.56 s gammaloop-nextest-integration> res n-terms: 1, byte size: 611,expr:
  237. 211.56 s gammaloop-nextest-integration> 1/(denom(0,q₀/t,mass_scalar_1²,-mass_scalar_1²+(q₀.q₀)/t²)
  238. 211.56 s gammaloop-nextest-integration> ·denom(1,-q₂+q₃-q₀/t,mass_scalar_1²,
  239. 211.56 s gammaloop-nextest-integration> -mass_scalar_1²+2·(q₀.q₂)/t-2·(q₀.q₃)/t+(q₀.q₀)/t²+(q₂.q₂)
  240. 211.56 s gammaloop-nextest-integration> -2·(q₂.q₃)+(q₃.q₃)
  241. 211.56 s gammaloop-nextest-integration> ))
  242. 211.56 s gammaloop-nextest-integration> span t{span_context=true current=subgraph=y, topo_order=1, dod=0 given=subgraph=0, topo_order=0, dod=0}
  243. 211.56 s gammaloop-nextest-integration> [2026-09-02 09:05:32.253] @approx::local_4d [{#uv, #integrated, #rescaled}] DEBUG : Rescaled expanded
  244. 211.56 s gammaloop-nextest-integration> field value
  245. 211.56 s gammaloop-nextest-integration> n_loops 1
  246. 211.56 s gammaloop-nextest-integration> res n-terms: 1, byte size: 723,expr:
  247. 211.56 s gammaloop-nextest-integration> 1/(denom(0,q₀,mUVexp²+t²·mass_scalar_1²,-mUV²+t²·(-mass_scalar_1²+(q₀.q₀)/t²)+t²·mUVexp²)
  248. 211.56 s gammaloop-nextest-integration> ·denom(1,-q₀,mUVexp²+t²·mass_scalar_1²,
  249. 211.56 s gammaloop-nextest-integration> -mUV²
  250. 211.56 s gammaloop-nextest-integration> +t²
  251. 211.56 s gammaloop-nextest-integration> ·(-mass_scalar_1²+2·(q₀.q₂)/t-2·(q₀.q₃)/t+(q₀.q₀)/t²+(q₂.q₂)
  252. 211.56 s gammaloop-nextest-integration> -2·(q₂.q₃)+(q₃.q₃)
  253. 211.56 s gammaloop-nextest-integration> )
  254. 211.56 s gammaloop-nextest-integration> +t²·mUVexp²
  255. 211.56 s gammaloop-nextest-integration> ))
  256. 211.56 s gammaloop-nextest-integration> span t{span_context=true current=subgraph=y, topo_order=1, dod=0 given=subgraph=0, topo_order=0, dod=0}
  257. 211.56 s gammaloop-nextest-integration> [2026-09-02 09:05:32.254] @approx::local_4d [{#uv, #integrated, #series}] DEBUG : Series expanded
  258. 211.56 s gammaloop-nextest-integration> field value
  259. 211.56 s gammaloop-nextest-integration> res n-terms: 1, byte size: 223,expr:
  260. 211.56 s gammaloop-nextest-integration> 1/(denom(0,q₀,mUVexp²,-mUV²+(q₀.q₀))·denom(1,-q₀,mUVexp²,-mUV²+(q₀.q₀)))
  261. 211.56 s gammaloop-nextest-integration> span t{span_context=true current=subgraph=y, topo_order=1, dod=0 given=subgraph=0, topo_order=0, dod=0}
  262. 211.56 s gammaloop-nextest-integration> [2026-09-02 09:05:32.254] @approx::local_4d [{#uv, #integrated, #series}] DEBUG : Evaluated at t = 1
  263. 211.56 s gammaloop-nextest-integration> field value
  264. 211.56 s gammaloop-nextest-integration> res n-terms: 1, byte size: 223,expr:
  265. 211.56 s gammaloop-nextest-integration> 1/(denom(0,q₀,mUVexp²,-mUV²+(q₀.q₀))·denom(1,-q₀,mUVexp²,-mUV²+(q₀.q₀)))
  266. 211.56 s gammaloop-nextest-integration> span t{span_context=true current=subgraph=y, topo_order=1, dod=0 given=subgraph=0, topo_order=0, dod=0}
  267. 211.56 s gammaloop-nextest-integration> [2026-09-02 09:05:32.254] @approx::local_4d [{#uv, #collect, #integrated}] DEBUG : After gamma chain collection
  268. 211.56 s gammaloop-nextest-integration> field value
  269. 211.56 s gammaloop-nextest-integration> expr n-terms: 1, byte size: 223,expr:
  270. 211.56 s gammaloop-nextest-integration> 1/(denom(0,q₀,mUVexp²,-mUV²+(q₀.q₀))·denom(1,-q₀,mUVexp²,-mUV²+(q₀.q₀)))
  271. 211.56 s gammaloop-nextest-integration> span t{span_context=true current=subgraph=y, topo_order=1, dod=0 given=subgraph=0, topo_order=0, dod=0}
  272. 211.56 s gammaloop-nextest-integration> [2026-09-02 09:05:32.280] @approx::local_4d [{#profile, #uv, #collect, #integrated, #start, #trace}] DEBUG : After gamma schoonschip
  273. 211.56 s gammaloop-nextest-integration> field value
  274. 211.56 s gammaloop-nextest-integration> expr n-terms: 1, byte size: 223,expr:
  275. 211.56 s gammaloop-nextest-integration> 1/(denom(0,q₀,mUVexp²,-mUV²+(q₀.q₀))·denom(1,-q₀,mUVexp²,-mUV²+(q₀.q₀)))
  276. 211.56 s gammaloop-nextest-integration> span t{span_context=true current=subgraph=y, topo_order=1, dod=0 given=subgraph=0, topo_order=0, dod=0}
  277. 211.56 s gammaloop-nextest-integration> [2026-09-02 09:05:32.281] @approx::local_4d [{#profile, #uv, #collect, #integrated, #start, #trace}] DEBUG : After gamma collection
  278. 211.56 s gammaloop-nextest-integration> field value
  279. 211.56 s gammaloop-nextest-integration> expr n-terms: 1, byte size: 223,expr:
  280. 211.56 s gammaloop-nextest-integration> 1/(denom(0,q₀,mUVexp²,-mUV²+(q₀.q₀))·denom(1,-q₀,mUVexp²,-mUV²+(q₀.q₀)))
  281. 211.56 s gammaloop-nextest-integration> span t{span_context=true current=subgraph=y, topo_order=1, dod=0 given=subgraph=0, topo_order=0, dod=0}
  282. 211.56 s gammaloop-nextest-integration> [2026-09-02 09:05:32.281] @approx::local_4d [{#profile, #uv, #gamma, #integrated, #start, #trace, #vakint}] DEBUG : After gamma simplification
  283. 211.56 s gammaloop-nextest-integration> field value
  284. 211.56 s gammaloop-nextest-integration> expr n-terms: 1, byte size: 223,expr:
  285. 211.56 s gammaloop-nextest-integration> 1/(denom(0,q₀,mUVexp²,-mUV²+(q₀.q₀))·denom(1,-q₀,mUVexp²,-mUV²+(q₀.q₀)))
  286. 211.56 s gammaloop-nextest-integration> span t{span_context=true current=subgraph=y, topo_order=1, dod=0 given=subgraph=0, topo_order=0, dod=0}
  287. 211.56 s gammaloop-nextest-integration> [2026-09-02 09:05:32.295] @approx::local_4d [{#profile, #uv, #integrated, #schoonschip, #start, #trace, #vakint}] DEBUG : After Schoonschip net
  288. 211.56 s gammaloop-nextest-integration> field value
  289. 211.56 s gammaloop-nextest-integration> expr n-terms: 1, byte size: 223,expr:
  290. 211.56 s gammaloop-nextest-integration> 1/(denom(0,q₀,mUVexp²,-mUV²+(q₀.q₀))·denom(1,-q₀,mUVexp²,-mUV²+(q₀.q₀)))
  291. 211.56 s gammaloop-nextest-integration> ... omitted 20090 more lines; see full nextest output above
  292. 211.56 s gammaloop-nextest-integration>
  293. 211.56 s gammaloop-nextest-integration> 9. gammaloop-integration-tests::uv::se1l_uv
  294. 211.56 s gammaloop-nextest-integration> failure: test failure with exit code 101
  295. 211.56 s gammaloop-nextest-integration> system-out
  296. 211.56 s gammaloop-nextest-integration> running 1 test
  297. 211.56 s gammaloop-nextest-integration> test se1l_uv has been running for over 60 seconds
  298. 211.56 s gammaloop-nextest-integration> +------+-----------------+---------+--------+----------+-----------------------------------------------------------------------------------------------------------------------+-------+
  299. 211.56 s gammaloop-nextest-integration> | case | check | graph | status | sigma | threshold | error |
  300. 211.56 s gammaloop-nextest-integration> +------+-----------------+---------+--------+----------+-----------------------------------------------------------------------------------------------------------------------+-------+
  301. 211.56 s gammaloop-nextest-integration> | se1l | uv_profile | - | FAIL | - | - | - |
  302. 211.56 s gammaloop-nextest-integration> +------+-----------------+---------+--------+----------+-----------------------------------------------------------------------------------------------------------------------+-------+
  303. 211.56 s gammaloop-nextest-integration> | se1l | m_uv.inspect | inspect | pass | - | best inspect relative delta 1.097e-1 >= 1000*accuracy 1.000e-7 (accuracy=1.000e-10, exponent=+2.0, seed=1, probes=10) | - |
  304. 211.56 s gammaloop-nextest-integration> +------+-----------------+---------+--------+----------+-----------------------------------------------------------------------------------------------------------------------+-------+
  305. 211.56 s gammaloop-nextest-integration> | se1l | m_uv.integrated | se1l | pass | 0.1sigma | compatible within 2sigma | - |
  306. 211.56 s gammaloop-nextest-integration> +------+-----------------+---------+--------+----------+-----------------------------------------------------------------------------------------------------------------------+-------+
  307. 211.56 s gammaloop-nextest-integration> | se1l | rls.inspect | inspect | pass | - | best inspect relative delta 4.499e-2 >= 1000*accuracy 1.000e-7 (accuracy=1.000e-10, exponent=+2.0, seed=1, probes=10) | - |
  308. 211.56 s gammaloop-nextest-integration> +------+-----------------+---------+--------+----------+-----------------------------------------------------------------------------------------------------------------------+-------+
  309. 211.56 s gammaloop-nextest-integration> | se1l | rls.integrated | se1l | pass | 0.0sigma | compatible within 2sigma | - |
  310. 211.56 s gammaloop-nextest-integration> +------+-----------------+---------+--------+----------+-----------------------------------------------------------------------------------------------------------------------+-------+
  311. 211.56 s gammaloop-nextest-integration> | se1l | mu_r.inspect | inspect | pass | - | best inspect relative delta 1.424e-1 >= 1000*accuracy 1.000e-7 (accuracy=1.000e-10, exponent=+2.0, seed=1, probes=10) | - |
  312. 211.56 s gammaloop-nextest-integration> +------+-----------------+---------+--------+----------+-----------------------------------------------------------------------------------------------------------------------+-------+
  313. 211.56 s gammaloop-nextest-integration> | se1l | target | - | pass | - | 2sigma | - |
  314. 211.56 s gammaloop-nextest-integration> +------+-----------------+---------+--------+----------+-----------------------------------------------------------------------------------------------------------------------+-------+
  315. 211.56 s gammaloop-nextest-integration> test se1l_uv ... FAILED
  316. 211.56 s gammaloop-nextest-integration>
  317. 211.56 s gammaloop-nextest-integration> failures:
  318. 211.56 s gammaloop-nextest-integration>
  319. 211.56 s gammaloop-nextest-integration> failures:
  320. 211.56 s gammaloop-nextest-integration> se1l_uv
  321. 211.56 s gammaloop-nextest-integration>
  322. 211.56 s gammaloop-nextest-integration> test result: FAILED. 0 passed; 1 failed; 0 ignored; 0 measured; 24 filtered out; finished in 130.52s
  323. 211.56 s gammaloop-nextest-integration> system-err
  324. 211.56 s gammaloop-nextest-integration> [2026-09-02 09:05:31.370] @gammaloop_api::se... INFO : Running command run generate
  325. 211.56 s gammaloop-nextest-integration> [2026-09-02 09:05:31.370] @gammaloop_api::se... INFO : Starting command block generate
  326. 211.56 s gammaloop-nextest-integration> [2026-09-02 09:05:31.370] @gammaloop_api::se... INFO : Running command import model sm-default
  327. 211.56 s gammaloop-nextest-integration> [2026-09-02 09:05:31.370] @import::model INFO : Loading built-in JSON model sm-default
  328. 211.56 s gammaloop-nextest-integration> [2026-09-02 09:05:31.410] @gammalooprs::model INFO : The following 11 external parameters were forced to zero by the restriction card:
  329. 211.56 s gammaloop-nextest-integration> lamWS, AWS, rhoWS, etaWS, ymc, yme, ymm, MC, Me, MM, WTau
  330. 211.56 s gammaloop-nextest-integration> [2026-09-02 09:05:31.410] @gammalooprs::model INFO : The following 34 vertex rules were removed by the restriction card:
  331. 211.56 s gammaloop-nextest-integration> V_82 -> (c~, d, G+) | V_83 -> (t~, d, G+) | V_84 -> (c~, s, G+) | V_85 -> (t~, s, G+) | V_86 -> (u~, b, G+) | V_87 -> (c~, b, G+) | V_90 -> (c~, d, W+) | V_91 -> (t~, d, W+) | V_92 -> (u~, s, W+) | V_94 -> (t~, s, W+) | V_95 -> (u~, b, W+) | V_96 -> (c~, b, W+) | V_101 -> (e+, e-, G0) | V_102 -> (mu+, mu-, G0) | V_104 -> (e+, e-, H) | V_105 -> (mu+, mu-, H) | V_110 -> (ve~, e-, G+) | V_111 -> (vm~, mu-, G+) | V_116 -> (b~, u, G-) | V_117 -> (d~, c, G-) | V_118 -> (s~, c, G-) | V_119 -> (b~, c, G-) | V_120 -> (d~, t, G-) | V_121 -> (s~, t, G-) | V_124 -> (s~, u, W-) | V_125 -> (b~, u, W-) | V_126 -> (d~, c, W-) | V_128 -> (b~, c, W-) | V_129 -> (d~, t, W-) | V_130 -> (s~, t, W-) | V_138 -> (c~, c, G0) | V_140 -> (c~, c, H) | V_145 -> (e+, ve, G-) | V_146 -> (mu+, vm, G-)
  332. 211.56 s gammaloop-nextest-integration> [2026-09-02 09:05:31.410] @gammalooprs::model INFO : The following 36 couplings were removed by the restriction card:
  333. 211.56 s gammaloop-nextest-integration> GC_13, GC_14, GC_16, GC_17, GC_18, GC_19, GC_20, GC_22, GC_23, GC_24, GC_25, GC_26, GC_28, GC_29, GC_42, GC_43, GC_44, GC_46, GC_47, GC_48, GC_84, GC_85, GC_86, GC_87, GC_88, GC_89, GC_90, GC_91, GC_92, GC_93, GC_101, GC_102, GC_103, GC_105, GC_106, GC_107
  334. 211.56 s gammaloop-nextest-integration> [2026-09-02 09:05:31.410] @gammaloop_api::se... INFO : Running command remove processes
  335. 211.56 s gammaloop-nextest-integration> [2026-09-02 09:05:31.411] @gammaloop_api::se... INFO : Running command set global kv global.generation.uv.generate_integrated=true
  336. 211.56 s gammaloop-nextest-integration> [2026-09-02 09:05:31.411] @gammaloop_api::se... INFO : Running command import graphs ./tests/resources/graphs/uv_tests/se1l.dot -p se1l -i se1l
  337. 211.56 s gammaloop-nextest-integration> [2026-09-02 09:05:31.411] @commands::import INFO : Loading graphs from '/build/source/tests/resources/graphs/uv_tests/se1l.dot'
  338. 211.56 s gammaloop-nextest-integration> [2026-09-02 09:05:31.417] @gammaloop_api::se... INFO : Running command generate existing -p se1l -i se1l
  339. 211.56 s gammaloop-nextest-integration> [2026-09-02 09:05:32.937] @commands::generate INFO :
  340. 211.56 s gammaloop-nextest-integration> Integrand generation summary
  341. 211.56 s gammaloop-nextest-integration> peak RAM 89.36 MiB | cores 1
  342. 211.56 s gammaloop-nextest-integration> ╭───────────┬───────┬─────────┬─────────────┬─────────────┬────────────────┬─────────────╮
  343. 211.56 s gammaloop-nextest-integration> │ integrand │ graph │ # evals │ expr build │ spenso │ symbolica eval │ compile │
  344. 211.56 s gammaloop-nextest-integration> ├───────────┼───────┼─────────┼─────────────┼─────────────┼────────────────┼─────────────┤
  345. 211.56 s gammaloop-nextest-integration> │ se1l │ se1l │ 5 │ 1.37s (93%) │ 35ms (2.4%) │ 60ms (4.1%) │ 0ms (0.00%) │
  346. 211.56 s gammaloop-nextest-integration> ├───────────┼───────┼─────────┼─────────────┼─────────────┼────────────────┼─────────────┤
  347. 211.56 s gammaloop-nextest-integration> │ Total │ │ 5 │ 1.37s (93%) │ 35ms (2.4%) │ 60ms (4.1%) │ 0ms (0.00%) │
  348. 211.56 s gammaloop-nextest-integration> ╰───────────┴───────┴─────────┴─────────────┴─────────────┴────────────────┴─────────────╯
  349. 211.56 s gammaloop-nextest-integration> [2026-09-02 09:05:32.938] @gammaloop_api::se... INFO : Running command set process -p se1l -i se1l kv general.m_uv=0.2
  350. 211.56 s gammaloop-nextest-integration> [2026-09-02 09:05:32.939] @gammaloop_api::se... INFO : Running command set process -p se1l -i se1l kv general.mu_r=0.2
  351. 211.56 s gammaloop-nextest-integration> [2026-09-02 09:05:32.940] @gammaloop_api::se... INFO : Running command set process -p se1l -i se1l kv general.renormalization_localization_scale=0.2
  352. 211.56 s gammaloop-nextest-integration> [2026-09-02 09:05:32.944] @gammaloop_api::se... INFO : Running command duplicate integrand -p se1l -i se1l --output_process_name se1l --output_integrand_name se1l_muv_shifted
  353. 211.56 s gammaloop-nextest-integration> [2026-09-02 09:05:32.945] @gammaloop_api::se... INFO : Running command set process -p se1l -i se1l_muv_shifted kv general.m_uv=0.5
  354. 211.56 s gammaloop-nextest-integration> [2026-09-02 09:05:32.946] @gammaloop_api::se... INFO : Running command duplicate integrand -p se1l -i se1l --output_process_name se1l --output_integrand_name se1l_rls_shifted
  355. 211.56 s gammaloop-nextest-integration> [2026-09-02 09:05:32.951] @gammaloop_api::se... INFO : Running command set process -p se1l -i se1l_rls_shifted kv general.renormalization_localization_scale=1
  356. 211.56 s gammaloop-nextest-integration> [2026-09-02 09:05:32.952] @gammaloop_api::se... INFO : Running command duplicate integrand -p se1l -i se1l --output_process_name se1l --output_integrand_name se1l_mur_shifted
  357. 211.56 s gammaloop-nextest-integration> [2026-09-02 09:05:32.957] @gammaloop_api::se... INFO : Running command set process -p se1l -i se1l_mur_shifted kv general.mu_r=0.8
  358. 211.56 s gammaloop-nextest-integration> [2026-09-02 09:05:32.969] @process::amplitude WARNING : External state 0 ('g', PDG 21, helicity +) is off shell: p^2 = +2.5e5, expected m^2 = +0e0 (|Δ| = +2.5e5). Fixed-helicity spinor/vector/tensor external states may be ill-defined at this kinematic point.
  359. 211.56 s gammaloop-nextest-integration> field value
  360. 211.56 s gammaloop-nextest-integration> span warm_up{integrand.name=se1l}
  361. 211.56 s gammaloop-nextest-integration> [2026-09-02 09:05:32.969] @process::amplitude WARNING : External state 1 ('g', PDG 21, helicity -) is off shell: p^2 = +2.5e5, expected m^2 = +0e0 (|Δ| = +2.5e5). Fixed-helicity spinor/vector/tensor external states may be ill-defined at this kinematic point.
  362. 211.56 s gammaloop-nextest-integration> field value
  363. 211.56 s gammaloop-nextest-integration> span warm_up{integrand.name=se1l}
  364. 211.56 s gammaloop-nextest-integration> [2026-09-02 09:05:32.969] @process::amplitude INFO : Input is above threshold: 1 existing threshold E-surfaces across 1/1 graph groups
  365. 211.56 s gammaloop-nextest-integration> field value
  366. 211.56 s gammaloop-nextest-integration> existing_esurfaces 1
  367. 211.56 s gammaloop-nextest-integration> group_count 1
  368. 211.56 s gammaloop-nextest-integration> groups_above_threshold 1
  369. 211.56 s gammaloop-nextest-integration> integrand se1l
  370. 211.56 s gammaloop-nextest-integration> span warm_up{integrand.name=se1l}
  371. 211.56 s gammaloop-nextest-integration> threshold_status above threshold
  372. 211.56 s gammaloop-nextest-integration> [2026-09-02 09:05:32.969] @process::amplitude INFO : overlap structure of group 0: [1: [0(2,3)]]
  373. 211.56 s gammaloop-nextest-integration> field value
  374. 211.56 s gammaloop-nextest-integration> span warm_up{integrand.name=se1l}
  375. 211.56 s gammaloop-nextest-integration> [2026-09-02 09:05:33.312] @commands::profile INFO :
  376. 211.56 s gammaloop-nextest-integration> ╭───────┬──────┬──────────┬───────┬─────┬──────────┬───────────╮
  377. 211.56 s gammaloop-nextest-integration> │ fixed │ → ∞ │ slope │ r2 │ DOD │ bare DOD │ inspect │
  378. 211.56 s gammaloop-nextest-integration> ├───────┼──────┼──────────┼───────┼─────┼──────────┼───────────┤
  379. 211.56 s gammaloop-nextest-integration> │ {} │ {e3} │ 1.639236 │ 0.904 │ 2 │ 2 │ arb retry │
  380. 211.56 s gammaloop-nextest-integration> │ {} │ {e2} │ 1.698834 │ 0.902 │ 2 │ 2 │ arb retry │
  381. 211.56 s gammaloop-nextest-integration> ╰───────┴──────┴──────────┴───────┴─────┴──────────┴───────────╯
  382. 211.56 s gammaloop-nextest-integration> [2026-09-02 09:05:33.312] @commands::profile INFO :
  383. 211.56 s gammaloop-nextest-integration> ╭───────┬──────┬─────────────┬──────────┬───────┬─────┬──────────┬───────────╮
  384. 211.56 s gammaloop-nextest-integration> │ fixed │ → ∞ │ orientation │ slope │ r2 │ DOD │ bare DOD │ inspect │
  385. 211.56 s gammaloop-nextest-integration> ├───────┼──────┼─────────────┼──────────┼───────┼─────┼──────────┼───────────┤
  386. 211.56 s gammaloop-nextest-integration> │ {} │ {e3} │ 00-+ │ 0.343429 │ 0.145 │ 0 │ 2 │ arb retry │
  387. 211.56 s gammaloop-nextest-integration> │ {} │ {e3} │ 00+- │ 0.342577 │ 0.135 │ 0 │ 2 │ arb retry │
  388. 211.56 s gammaloop-nextest-integration> │ {} │ {e2} │ 00-+ │ 0.385975 │ 0.161 │ 0 │ 2 │ arb retry │
  389. 211.56 s gammaloop-nextest-integration> │ {} │ {e2} │ 00+- │ 0.384920 │ 0.192 │ 0 │ 2 │ arb retry │
  390. 211.56 s gammaloop-nextest-integration> ╰───────┴──────┴─────────────┴──────────┴───────┴─────┴──────────┴───────────╯
  391. 211.56 s gammaloop-nextest-integration> [2026-09-02 09:05:33.325] @gammaloop_api::se... INFO : Running command set process kv integrator.target_relative_accuracy=0.001 integrator.n_increase=0 integrator.n_start=50000 integrator.n_max=400000 integrator.seed=1337
  392. 211.56 s gammaloop-nextest-integration> [2026-09-02 09:05:33.326] @commands::integrate INFO : Created workspace directory at /build/source/tests/artifacts/se1l/integration_workspace_se1l
  393. 211.56 s gammaloop-nextest-integration> [2026-09-02 09:05:33.603] @commands::integrate INFO : No integration state found, starting new integration
  394. 211.56 s gammaloop-nextest-integration> [2026-09-02 09:05:33.603] @commands::integrate INFO : Gammaloop now integrates se1l@se1l, se1l@se1l_muv_shifted, se1l@se1l_rls_shifted
  395. 211.56 s gammaloop-nextest-integration> [2026-09-02 09:05:33.603] @process::amplitude WARNING : External state 0 ('g', PDG 21, helicity +) is off shell: p^2 = +2.5e5, expected m^2 = +0e0 (|Δ| = +2.5e5). Fixed-helicity spinor/vector/tensor external states may be ill-defined at this kinematic point.
  396. 211.56 s gammaloop-nextest-integration> field value
  397. 211.56 s gammaloop-nextest-integration> span warm_up{integrand.name=se1l}
  398. 211.56 s gammaloop-nextest-integration> [2026-09-02 09:05:33.603] @process::amplitude WARNING : External state 1 ('g', PDG 21, helicity -) is off shell: p^2 = +2.5e5, expected m^2 = +0e0 (|Δ| = +2.5e5). Fixed-helicity spinor/vector/tensor external states may be ill-defined at this kinematic point.
  399. 211.56 s gammaloop-nextest-integration> field value
  400. 211.56 s gammaloop-nextest-integration> span warm_up{integrand.name=se1l}
  401. 211.56 s gammaloop-nextest-integration> [2026-09-02 09:05:33.604] @process::amplitude INFO : Input is above threshold: 1 existing threshold E-surfaces across 1/1 graph groups
  402. 211.56 s gammaloop-nextest-integration> field value
  403. 211.56 s gammaloop-nextest-integration> existing_esurfaces 1
  404. 211.56 s gammaloop-nextest-integration> group_count 1
  405. 211.56 s gammaloop-nextest-integration> groups_above_threshold 1
  406. 211.56 s gammaloop-nextest-integration> integrand se1l
  407. 211.56 s gammaloop-nextest-integration> span warm_up{integrand.name=se1l}
  408. 211.56 s gammaloop-nextest-integration> threshold_status above threshold
  409. 211.56 s gammaloop-nextest-integration> [2026-09-02 09:05:33.604] @process::amplitude INFO : overlap structure of group 0: [1: [0(2,3)]]
  410. 211.56 s gammaloop-nextest-integration> field value
  411. 211.56 s gammaloop-nextest-integration> span warm_up{integrand.name=se1l}
  412. 211.56 s gammaloop-nextest-integration> [2026-09-02 09:05:33.615] @process::amplitude WARNING : External state 0 ('g', PDG 21, helicity +) is off shell: p^2 = +2.5e5, expected m^2 = +0e0 (|Δ| = +2.5e5). Fixed-helicity spinor/vector/tensor external states may be ill-defined at this kinematic point.
  413. 211.56 s gammaloop-nextest-integration> field value
  414. 211.56 s gammaloop-nextest-integration> span warm_up{integrand.name=se1l_muv_shifted}
  415. 211.56 s gammaloop-nextest-integration> [2026-09-02 09:05:33.615] @process::amplitude WARNING : External state 1 ('g', PDG 21, helicity -) is off shell: p^2 = +2.5e5, expected m^2 = +0e0 (|Δ| = +2.5e5). Fixed-helicity spinor/vector/tensor external states may be ill-defined at this kinematic point.
  416. 211.56 s gammaloop-nextest-integration> field value
  417. 211.56 s gammaloop-nextest-integration> span warm_up{integrand.name=se1l_muv_shifted}
  418. 211.56 s gammaloop-nextest-integration> [2026-09-02 09:05:33.615] @process::amplitude INFO : Input is above threshold: 1 existing threshold E-surfaces across 1/1 graph groups
  419. 211.56 s gammaloop-nextest-integration> field value
  420. 211.56 s gammaloop-nextest-integration> existing_esurfaces 1
  421. 211.56 s gammaloop-nextest-integration> group_count 1
  422. 211.56 s gammaloop-nextest-integration> groups_above_threshold 1
  423. 211.56 s gammaloop-nextest-integration> integrand se1l_muv_shifted
  424. 211.56 s gammaloop-nextest-integration> span warm_up{integrand.name=se1l_muv_shifted}
  425. 211.56 s gammaloop-nextest-integration> threshold_status above threshold
  426. 211.56 s gammaloop-nextest-integration> [2026-09-02 09:05:33.616] @process::amplitude INFO : overlap structure of group 0: [1: [0(2,3)]]
  427. 211.56 s gammaloop-nextest-integration> field value
  428. 211.56 s gammaloop-nextest-integration> span warm_up{integrand.name=se1l_muv_shifted}
  429. 211.56 s gammaloop-nextest-integration> [2026-09-02 09:05:33.648] @process::amplitude WARNING : External state 0 ('g', PDG 21, helicity +) is off shell: p^2 = +2.5e5, expected m^2 = +0e0 (|Δ| = +2.5e5). Fixed-helicity spinor/vector/tensor external states may be ill-defined at this kinematic point.
  430. 211.56 s gammaloop-nextest-integration> field value
  431. 211.56 s gammaloop-nextest-integration> span warm_up{integrand.name=se1l_rls_shifted}
  432. 211.56 s gammaloop-nextest-integration> [2026-09-02 09:05:33.648] @process::amplitude WARNING : External state 1 ('g', PDG 21, helicity -) is off shell: p^2 = +2.5e5, expected m^2 = +0e0 (|Δ| = +2.5e5). Fixed-helicity spinor/vector/tensor external states may be ill-defined at this kinematic point.
  433. 211.56 s gammaloop-nextest-integration> field value
  434. 211.56 s gammaloop-nextest-integration> span warm_up{integrand.name=se1l_rls_shifted}
  435. 211.56 s gammaloop-nextest-integration> [2026-09-02 09:05:33.649] @process::amplitude INFO : Input is above threshold: 1 existing threshold E-surfaces across 1/1 graph groups
  436. 211.56 s gammaloop-nextest-integration> field value
  437. 211.56 s gammaloop-nextest-integration> existing_esurfaces 1
  438. 211.56 s gammaloop-nextest-integration> group_count 1
  439. 211.56 s gammaloop-nextest-integration> groups_above_threshold 1
  440. 211.56 s gammaloop-nextest-integration> integrand se1l_rls_shifted
  441. 211.56 s gammaloop-nextest-integration> span warm_up{integrand.name=se1l_rls_shifted}
  442. 211.56 s gammaloop-nextest-integration> threshold_status above threshold
  443. 211.56 s gammaloop-nextest-integration> ... omitted 1410 more lines; see full nextest output above
  444. 211.56 s gammaloop-nextest-integration> =========================================
  445. 211.82 s error: Cannot build '/nix/store/gyvajj13r9n4dqbd2ss93zqm2svy6ai2-gammaloop-nextest-integration.drv'.
  446. 211.82 s Reason: builder failed with exit code 100.
  447. 211.82 s Output paths:
  448. 211.82 s /nix/store/x0hxyiwmyjy5fyi7rxqa3pyfg39bkny0-gammaloop-nextest-integration
  449. 211.82 s Last 2048 log lines:
  450. 211.82 s > threshold_status above threshold
  451. 211.82 s > [2026-09-02 09:07:41.331] @process::amplitude INFO : overlap structure of group 0: [1: [0(2,3)]]
  452. 211.82 s > field value
  453. 211.82 s > span warm_up{integrand.name=se1l_muv_shifted}
  454. 211.82 s > [2026-09-02 09:07:41.335] @process::amplitude WARNING : External state 0 ('g', PDG 21, helicity +) is off shell: p^2 = +2.5e5, expected m^2 = +0e0 (|Δ| = +2.5e5). Fixed-helicity spinor/vector/tensor external states may be ill-defined at this kinematic point.
  455. 211.82 s > field value
  456. 211.82 s > span warm_up{integrand.name=se1l}
  457. 211.82 s > [2026-09-02 09:07:41.335] @process::amplitude WARNING : External state 1 ('g', PDG 21, helicity -) is off shell: p^2 = +2.5e5, expected m^2 = +0e0 (|Δ| = +2.5e5). Fixed-helicity spinor/vector/tensor external states may be ill-defined at this kinematic point.
  458. 211.82 s > field value
  459. 211.82 s > span warm_up{integrand.name=se1l}
  460. 211.82 s > [2026-09-02 09:07:41.335] @process::amplitude INFO : Input is above threshold: 1 existing threshold E-surfaces across 1/1 graph groups
  461. 211.82 s > field value
  462. 211.82 s > existing_esurfaces 1
  463. 211.82 s > group_count 1
  464. 211.82 s > groups_above_threshold 1
  465. 211.82 s > integrand se1l
  466. 211.82 s > span warm_up{integrand.name=se1l}
  467. 211.82 s > threshold_status above threshold
  468. 211.82 s > [2026-09-02 09:07:41.335] @process::amplitude INFO : overlap structure of group 0: [1: [0(2,3)]]
  469. 211.82 s > field value
  470. 211.82 s > span warm_up{integrand.name=se1l}
  471. 211.82 s > [2026-09-02 09:07:41.340] @process::amplitude WARNING : External state 0 ('g', PDG 21, helicity +) is off shell: p^2 = +2.5e5, expected m^2 = +0e0 (|Δ| = +2.5e5). Fixed-helicity spinor/vector/tensor external states may be ill-defined at this kinematic point.
  472. 211.82 s > field value
  473. 211.82 s > span warm_up{integrand.name=se1l_muv_shifted}
  474. 211.82 s > [2026-09-02 09:07:41.340] @process::amplitude WARNING : External state 1 ('g', PDG 21, helicity -) is off shell: p^2 = +2.5e5, expected m^2 = +0e0 (|Δ| = +2.5e5). Fixed-helicity spinor/vector/tensor external states may be ill-defined at this kinematic point.
  475. 211.82 s > field value
  476. 211.82 s > span warm_up{integrand.name=se1l_muv_shifted}
  477. 211.82 s > [2026-09-02 09:07:41.340] @process::amplitude INFO : Input is above threshold: 1 existing threshold E-surfaces across 1/1 graph groups
  478. 211.82 s > field value
  479. 211.82 s > existing_esurfaces 1
  480. 211.82 s > group_count 1
  481. 211.82 s > groups_above_threshold 1
  482. 211.82 s > integrand se1l_muv_shifted
  483. 211.82 s > span warm_up{integrand.name=se1l_muv_shifted}
  484. 211.82 s > threshold_status above threshold
  485. 211.82 s > [2026-09-02 09:07:41.340] @process::amplitude INFO : overlap structure of group 0: [1: [0(2,3)]]
  486. 211.82 s > field value
  487. 211.82 s > span warm_up{integrand.name=se1l_muv_shifted}
  488. 211.82 s > [2026-09-02 09:07:41.344] @process::amplitude WARNING : External state 0 ('g', PDG 21, helicity +) is off shell: p^2 = +2.5e5, expected m^2 = +0e0 (|Δ| = +2.5e5). Fixed-helicity spinor/vector/tensor external states may be ill-defined at this kinematic point.
  489. 211.82 s > field value
  490. 211.82 s > span warm_up{integrand.name=se1l}
  491. 211.82 s > [2026-09-02 09:07:41.344] @process::amplitude WARNING : External state 1 ('g', PDG 21, helicity -) is off shell: p^2 = +2.5e5, expected m^2 = +0e0 (|Δ| = +2.5e5). Fixed-helicity spinor/vector/tensor external states may be ill-defined at this kinematic point.
  492. 211.82 s > field value
  493. 211.82 s > span warm_up{integrand.name=se1l}
  494. 211.82 s > [2026-09-02 09:07:41.345] @process::amplitude INFO : Input is above threshold: 1 existing threshold E-surfaces across 1/1 graph groups
  495. 211.82 s > field value
  496. 211.82 s > existing_esurfaces 1
  497. 211.82 s > group_count 1
  498. 211.82 s > groups_above_threshold 1
  499. 211.82 s > integrand se1l
  500. 211.82 s > span warm_up{integrand.name=se1l}
  501. 211.82 s > threshold_status above threshold
  502. 211.82 s > [2026-09-02 09:07:41.345] @process::amplitude INFO : overlap structure of group 0: [1: [0(2,3)]]
  503. 211.82 s > field value
  504. 211.82 s > span warm_up{integrand.name=se1l}
  505. 211.82 s > [2026-09-02 09:07:41.349] @process::amplitude WARNING : External state 0 ('g', PDG 21, helicity +) is off shell: p^2 = +2.5e5, expected m^2 = +0e0 (|Δ| = +2.5e5). Fixed-helicity spinor/vector/tensor external states may be ill-defined at this kinematic point.
  506. 211.82 s > field value
  507. 211.82 s > span warm_up{integrand.name=se1l_muv_shifted}
  508. 211.82 s > [2026-09-02 09:07:41.349] @process::amplitude WARNING : External state 1 ('g', PDG 21, helicity -) is off shell: p^2 = +2.5e5, expected m^2 = +0e0 (|Δ| = +2.5e5). Fixed-helicity spinor/vector/tensor external states may be ill-defined at this kinematic point.
  509. 211.82 s > field value
  510. 211.82 s > span warm_up{integrand.name=se1l_muv_shifted}
  511. 211.82 s > [2026-09-02 09:07:41.349] @process::amplitude INFO : Input is above threshold: 1 existing threshold E-surfaces across 1/1 graph groups
  512. 211.82 s > field value
  513. 211.82 s > existing_esurfaces 1
  514. 211.82 s > group_count 1
  515. 211.82 s > groups_above_threshold 1
  516. 211.82 s > integrand se1l_muv_shifted
  517. 211.82 s > span warm_up{integrand.name=se1l_muv_shifted}
  518. 211.82 s > threshold_status above threshold
  519. 211.82 s > [2026-09-02 09:07:41.350] @process::amplitude INFO : overlap structure of group 0: [1: [0(2,3)]]
  520. 211.82 s > field value
  521. 211.82 s > span warm_up{integrand.name=se1l_muv_shifted}
  522. 211.82 s > [2026-09-02 09:07:41.354] @process::amplitude WARNING : External state 0 ('g', PDG 21, helicity +) is off shell: p^2 = +2.5e5, expected m^2 = +0e0 (|Δ| = +2.5e5). Fixed-helicity spinor/vector/tensor external states may be ill-defined at this kinematic point.
  523. 211.82 s > field value
  524. 211.82 s > span warm_up{integrand.name=se1l}
  525. 211.82 s > [2026-09-02 09:07:41.354] @process::amplitude WARNING : External state 1 ('g', PDG 21, helicity -) is off shell: p^2 = +2.5e5, expected m^2 = +0e0 (|Δ| = +2.5e5). Fixed-helicity spinor/vector/tensor external states may be ill-defined at this kinematic point.
  526. 211.82 s > field value
  527. 211.82 s > span warm_up{integrand.name=se1l}
  528. 211.82 s > [2026-09-02 09:07:41.354] @process::amplitude INFO : Input is above threshold: 1 existing threshold E-surfaces across 1/1 graph groups
  529. 211.82 s > field value
  530. 211.82 s > existing_esurfaces 1
  531. 211.82 s > group_count 1
  532. 211.82 s > groups_above_threshold 1
  533. 211.82 s > integrand se1l
  534. 211.82 s > span warm_up{integrand.name=se1l}
  535. 211.82 s > threshold_status above threshold
  536. 211.82 s > [2026-09-02 09:07:41.354] @process::amplitude INFO : overlap structure of group 0: [1: [0(2,3)]]
  537. 211.82 s > field value
  538. 211.82 s > span warm_up{integrand.name=se1l}
  539. 211.82 s > [2026-09-02 09:07:41.359] @process::amplitude WARNING : External state 0 ('g', PDG 21, helicity +) is off shell: p^2 = +2.5e5, expected m^2 = +0e0 (|Δ| = +2.5e5). Fixed-helicity spinor/vector/tensor external states may be ill-defined at this kinematic point.
  540. 211.82 s > field value
  541. 211.82 s > span warm_up{integrand.name=se1l_muv_shifted}
  542. 211.82 s > [2026-09-02 09:07:41.359] @process::amplitude WARNING : External state 1 ('g', PDG 21, helicity -) is off shell: p^2 = +2.5e5, expected m^2 = +0e0 (|Δ| = +2.5e5). Fixed-helicity spinor/vector/tensor external states may be ill-defined at this kinematic point.
  543. 211.82 s > field value
  544. 211.82 s > span warm_up{integrand.name=se1l_muv_shifted}
  545. 211.82 s > [2026-09-02 09:07:41.359] @process::amplitude INFO : Input is above threshold: 1 existing threshold E-surfaces across 1/1 graph groups
  546. 211.82 s > field value
  547. 211.82 s > existing_esurfaces 1
  548. 211.82 s > group_count 1
  549. 211.82 s > groups_above_threshold 1
  550. 211.82 s > integrand se1l_muv_shifted
  551. 211.82 s > span warm_up{integrand.name=se1l_muv_shifted}
  552. 211.82 s > threshold_status above threshold
  553. 211.82 s > [2026-09-02 09:07:41.360] @process::amplitude INFO : overlap structure of group 0: [1: [0(2,3)]]
  554. 211.82 s > field value
  555. 211.82 s > span warm_up{integrand.name=se1l_muv_shifted}
  556. 211.82 s > [2026-09-02 09:07:41.365] @process::amplitude WARNING : External state 0 ('g', PDG 21, helicity +) is off shell: p^2 = +2.5e5, expected m^2 = +0e0 (|Δ| = +2.5e5). Fixed-helicity spinor/vector/tensor external states may be ill-defined at this kinematic point.
  557. 211.82 s > field value
  558. 211.82 s > span warm_up{integrand.name=se1l}
  559. 211.82 s > [2026-09-02 09:07:41.365] @process::amplitude WARNING : External state 1 ('g', PDG 21, helicity -) is off shell: p^2 = +2.5e5, expected m^2 = +0e0 (|Δ| = +2.5e5). Fixed-helicity spinor/vector/tensor external states may be ill-defined at this kinematic point.
  560. 211.82 s > field value
  561. 211.82 s > span warm_up{integrand.name=se1l}
  562. 211.82 s > [2026-09-02 09:07:41.365] @process::amplitude INFO : Input is above threshold: 1 existing threshold E-surfaces across 1/1 graph groups
  563. 211.82 s > field value
  564. 211.82 s > existing_esurfaces 1
  565. 211.82 s > group_count 1
  566. 211.82 s > groups_above_threshold 1
  567. 211.82 s > integrand se1l
  568. 211.82 s > span warm_up{integrand.name=se1l}
  569. 211.82 s > threshold_status above threshold
  570. 211.82 s > [2026-09-02 09:07:41.365] @process::amplitude INFO : overlap structure of group 0: [1: [0(2,3)]]
  571. 211.82 s > field value
  572. 211.82 s > span warm_up{integrand.name=se1l}
  573. 211.82 s > [2026-09-02 09:07:41.370] @process::amplitude WARNING : External state 0 ('g', PDG 21, helicity +) is off shell: p^2 = +2.5e5, expected m^2 = +0e0 (|Δ| = +2.5e5). Fixed-helicity spinor/vector/tensor external states may be ill-defined at this kinematic point.
  574. 211.82 s > field value
  575. 211.82 s > span warm_up{integrand.name=se1l_rls_shifted}
  576. 211.82 s > [2026-09-02 09:07:41.370] @process::amplitude WARNING : External state 1 ('g', PDG 21, helicity -) is off shell: p^2 = +2.5e5, expected m^2 = +0e0 (|Δ| = +2.5e5). Fixed-helicity spinor/vector/tensor external states may be ill-defined at this kinematic point.
  577. 211.82 s > field value
  578. 211.82 s > span warm_up{integrand.name=se1l_rls_shifted}
  579. 211.82 s > [2026-09-02 09:07:41.370] @process::amplitude INFO : Input is above threshold: 1 existing threshold E-surfaces across 1/1 graph groups
  580. 211.82 s > field value
  581. 211.82 s > existing_esurfaces 1
  582. 211.82 s > group_count 1
  583. 211.82 s > groups_above_threshold 1
  584. 211.82 s > integrand se1l_rls_shifted
  585. 211.82 s > span warm_up{integrand.name=se1l_rls_shifted}
  586. 211.82 s > threshold_status above threshold
  587. 211.82 s > [2026-09-02 09:07:41.370] @process::amplitude INFO : overlap structure of group 0: [1: [0(2,3)]]
  588. 211.82 s > field value
  589. 211.82 s > span warm_up{integrand.name=se1l_rls_shifted}
  590. 211.82 s > [2026-09-02 09:07:41.375] @process::amplitude WARNING : External state 0 ('g', PDG 21, helicity +) is off shell: p^2 = +2.5e5, expected m^2 = +0e0 (|Δ| = +2.5e5). Fixed-helicity spinor/vector/tensor external states may be ill-defined at this kinematic point.
  591. 211.82 s > field value
  592. 211.82 s > span warm_up{integrand.name=se1l}
  593. 211.82 s > [2026-09-02 09:07:41.375] @process::amplitude WARNING : External state 1 ('g', PDG 21, helicity -) is off shell: p^2 = +2.5e5, expected m^2 = +0e0 (|Δ| = +2.5e5). Fixed-helicity spinor/vector/tensor external states may be ill-defined at this kinematic point.
  594. 211.82 s > field value
  595. 211.82 s > span warm_up{integrand.name=se1l}
  596. 211.82 s > [2026-09-02 09:07:41.375] @process::amplitude INFO : Input is above threshold: 1 existing threshold E-surfaces across 1/1 graph groups
  597. 211.82 s > field value
  598. 211.82 s > existing_esurfaces 1
  599. 211.82 s > group_count 1
  600. 211.82 s > groups_above_threshold 1
  601. 211.82 s > integrand se1l
  602. 211.82 s > span warm_up{integrand.name=se1l}
  603. 211.82 s > threshold_status above threshold
  604. 211.82 s > [2026-09-02 09:07:41.375] @process::amplitude INFO : overlap structure of group 0: [1: [0(2,3)]]
  605. 211.82 s > field value
  606. 211.82 s > span warm_up{integrand.name=se1l}
  607. 211.82 s > [2026-09-02 09:07:41.379] @process::amplitude WARNING : External state 0 ('g', PDG 21, helicity +) is off shell: p^2 = +2.5e5, expected m^2 = +0e0 (|Δ| = +2.5e5). Fixed-helicity spinor/vector/tensor external states may be ill-defined at this kinematic point.
  608. 211.82 s > field value
  609. 211.82 s > span warm_up{integrand.name=se1l_rls_shifted}
  610. 211.82 s > [2026-09-02 09:07:41.379] @process::amplitude WARNING : External state 1 ('g', PDG 21, helicity -) is off shell: p^2 = +2.5e5, expected m^2 = +0e0 (|Δ| = +2.5e5). Fixed-helicity spinor/vector/tensor external states may be ill-defined at this kinematic point.
  611. 211.82 s > field value
  612. 211.82 s > span warm_up{integrand.name=se1l_rls_shifted}
  613. 211.82 s > [2026-09-02 09:07:41.380] @process::amplitude INFO : Input is above threshold: 1 existing threshold E-surfaces across 1/1 graph groups
  614. 211.82 s > field value
  615. 211.82 s > existing_esurfaces 1
  616. 211.82 s > group_count 1
  617. 211.82 s > groups_above_threshold 1
  618. 211.82 s > integrand se1l_rls_shifted
  619. 211.82 s > span warm_up{integrand.name=se1l_rls_shifted}
  620. 211.82 s > threshold_status above threshold
  621. 211.82 s > [2026-09-02 09:07:41.380] @process::amplitude INFO : overlap structure of group 0: [1: [0(2,3)]]
  622. 211.82 s > field value
  623. 211.82 s > span warm_up{integrand.name=se1l_rls_shifted}
  624. 211.82 s > [2026-09-02 09:07:41.384] @process::amplitude WARNING : External state 0 ('g', PDG 21, helicity +) is off shell: p^2 = +2.5e5, expected m^2 = +0e0 (|Δ| = +2.5e5). Fixed-helicity spinor/vector/tensor external states may be ill-defined at this kinematic point.
  625. 211.82 s > field value
  626. 211.82 s > span warm_up{integrand.name=se1l}
  627. 211.82 s > [2026-09-02 09:07:41.384] @process::amplitude WARNING : External state 1 ('g', PDG 21, helicity -) is off shell: p^2 = +2.5e5, expected m^2 = +0e0 (|Δ| = +2.5e5). Fixed-helicity spinor/vector/tensor external states may be ill-defined at this kinematic point.
  628. 211.82 s > field value
  629. 211.82 s > span warm_up{integrand.name=se1l}
  630. 211.82 s > [2026-09-02 09:07:41.384] @process::amplitude INFO : Input is above threshold: 1 existing threshold E-surfaces across 1/1 graph groups
  631. 211.82 s > field value
  632. 211.82 s > existing_esurfaces 1
  633. 211.82 s > group_count 1
  634. 211.82 s > groups_above_threshold 1
  635. 211.82 s > integrand se1l
  636. 211.82 s > span warm_up{integrand.name=se1l}
  637. 211.82 s > threshold_status above threshold
  638. 211.82 s > [2026-09-02 09:07:41.384] @process::amplitude INFO : overlap structure of group 0: [1: [0(2,3)]]
  639. 211.82 s > field value
  640. 211.82 s > span warm_up{integrand.name=se1l}
  641. 211.82 s > [2026-09-02 09:07:41.389] @process::amplitude WARNING : External state 0 ('g', PDG 21, helicity +) is off shell: p^2 = +2.5e5, expected m^2 = +0e0 (|Δ| = +2.5e5). Fixed-helicity spinor/vector/tensor external states may be ill-defined at this kinematic point.
  642. 211.82 s > field value
  643. 211.82 s > span warm_up{integrand.name=se1l_rls_shifted}
  644. 211.82 s > [2026-09-02 09:07:41.389] @process::amplitude WARNING : External state 1 ('g', PDG 21, helicity -) is off shell: p^2 = +2.5e5, expected m^2 = +0e0 (|Δ| = +2.5e5). Fixed-helicity spinor/vector/tensor external states may be ill-defined at this kinematic point.
  645. 211.82 s > field value
  646. 211.82 s > span warm_up{integrand.name=se1l_rls_shifted}
  647. 211.82 s > [2026-09-02 09:07:41.389] @process::amplitude INFO : Input is above threshold: 1 existing threshold E-surfaces across 1/1 graph groups
  648. 211.82 s > field value
  649. 211.82 s > existing_esurfaces 1
  650. 211.82 s > group_count 1
  651. 211.82 s > groups_above_threshold 1
  652. 211.82 s > integrand se1l_rls_shifted
  653. 211.82 s > span warm_up{integrand.name=se1l_rls_shifted}
  654. 211.82 s > threshold_status above threshold
  655. 211.82 s > [2026-09-02 09:07:41.389] @process::amplitude INFO : overlap structure of group 0: [1: [0(2,3)]]
  656. 211.82 s > field value
  657. 211.82 s > span warm_up{integrand.name=se1l_rls_shifted}
  658. 211.82 s > [2026-09-02 09:07:41.394] @process::amplitude WARNING : External state 0 ('g', PDG 21, helicity +) is off shell: p^2 = +2.5e5, expected m^2 = +0e0 (|Δ| = +2.5e5). Fixed-helicity spinor/vector/tensor external states may be ill-defined at this kinematic point.
  659. 211.82 s > field value
  660. 211.82 s > span warm_up{integrand.name=se1l}
  661. 211.82 s > [2026-09-02 09:07:41.394] @process::amplitude WARNING : External state 1 ('g', PDG 21, helicity -) is off shell: p^2 = +2.5e5, expected m^2 = +0e0 (|Δ| = +2.5e5). Fixed-helicity spinor/vector/tensor external states may be ill-defined at this kinematic point.
  662. 211.82 s > field value
  663. 211.82 s > span warm_up{integrand.name=se1l}
  664. 211.82 s > [2026-09-02 09:07:41.394] @process::amplitude INFO : Input is above threshold: 1 existing threshold E-surfaces across 1/1 graph groups
  665. 211.82 s > field value
  666. 211.82 s > existing_esurfaces 1
  667. 211.82 s > group_count 1
  668. 211.82 s > groups_above_threshold 1
  669. 211.82 s > integrand se1l
  670. 211.82 s > span warm_up{integrand.name=se1l}
  671. 211.82 s > threshold_status above threshold
  672. 211.82 s > [2026-09-02 09:07:41.394] @process::amplitude INFO : overlap structure of group 0: [1: [0(2,3)]]
  673. 211.82 s > field value
  674. 211.82 s > span warm_up{integrand.name=se1l}
  675. 211.82 s > [2026-09-02 09:07:41.399] @process::amplitude WARNING : External state 0 ('g', PDG 21, helicity +) is off shell: p^2 = +2.5e5, expected m^2 = +0e0 (|Δ| = +2.5e5). Fixed-helicity spinor/vector/tensor external states may be ill-defined at this kinematic point.
  676. 211.82 s > field value
  677. 211.82 s > span warm_up{integrand.name=se1l_rls_shifted}
  678. 211.82 s > [2026-09-02 09:07:41.399] @process::amplitude WARNING : External state 1 ('g', PDG 21, helicity -) is off shell: p^2 = +2.5e5, expected m^2 = +0e0 (|Δ| = +2.5e5). Fixed-helicity spinor/vector/tensor external states may be ill-defined at this kinematic point.
  679. 211.82 s > field value
  680. 211.82 s > span warm_up{integrand.name=se1l_rls_shifted}
  681. 211.82 s > [2026-09-02 09:07:41.399] @process::amplitude INFO : Input is above threshold: 1 existing threshold E-surfaces across 1/1 graph groups
  682. 211.82 s > field value
  683. 211.82 s > existing_esurfaces 1
  684. 211.82 s > group_count 1
  685. 211.82 s > groups_above_threshold 1
  686. 211.82 s > integrand se1l_rls_shifted
  687. 211.82 s > span warm_up{integrand.name=se1l_rls_shifted}
  688. 211.82 s > threshold_status above threshold
  689. 211.82 s > [2026-09-02 09:07:41.399] @process::amplitude INFO : overlap structure of group 0: [1: [0(2,3)]]
  690. 211.82 s > field value
  691. 211.82 s > span warm_up{integrand.name=se1l_rls_shifted}
  692. 211.82 s > [2026-09-02 09:07:41.404] @process::amplitude WARNING : External state 0 ('g', PDG 21, helicity +) is off shell: p^2 = +2.5e5, expected m^2 = +0e0 (|Δ| = +2.5e5). Fixed-helicity spinor/vector/tensor external states may be ill-defined at this kinematic point.
  693. 211.82 s > field value
  694. 211.82 s > span warm_up{integrand.name=se1l}
  695. 211.82 s > [2026-09-02 09:07:41.404] @process::amplitude WARNING : External state 1 ('g', PDG 21, helicity -) is off shell: p^2 = +2.5e5, expected m^2 = +0e0 (|Δ| = +2.5e5). Fixed-helicity spinor/vector/tensor external states may be ill-defined at this kinematic point.
  696. 211.82 s > field value
  697. 211.82 s > span warm_up{integrand.name=se1l}
  698. 211.82 s > [2026-09-02 09:07:41.404] @process::amplitude INFO : Input is above threshold: 1 existing threshold E-surfaces across 1/1 graph groups
  699. 211.82 s > field value
  700. 211.82 s > existing_esurfaces 1
  701. 211.82 s > group_count 1
  702. 211.82 s > groups_above_threshold 1
  703. 211.82 s > integrand se1l
  704. 211.82 s > span warm_up{integrand.name=se1l}
  705. 211.82 s > threshold_status above threshold
  706. 211.82 s > [2026-09-02 09:07:41.404] @process::amplitude INFO : overlap structure of group 0: [1: [0(2,3)]]
  707. 211.82 s > field value
  708. 211.82 s > span warm_up{integrand.name=se1l}
  709. 211.82 s > [2026-09-02 09:07:41.409] @process::amplitude WARNING : External state 0 ('g', PDG 21, helicity +) is off shell: p^2 = +2.5e5, expected m^2 = +0e0 (|Δ| = +2.5e5). Fixed-helicity spinor/vector/tensor external states may be ill-defined at this kinematic point.
  710. 211.82 s > field value
  711. 211.82 s > span warm_up{integrand.name=se1l_rls_shifted}
  712. 211.82 s > [2026-09-02 09:07:41.409] @process::amplitude WARNING : External state 1 ('g', PDG 21, helicity -) is off shell: p^2 = +2.5e5, expected m^2 = +0e0 (|Δ| = +2.5e5). Fixed-helicity spinor/vector/tensor external states may be ill-defined at this kinematic point.
  713. 211.82 s > field value
  714. 211.82 s > span warm_up{integrand.name=se1l_rls_shifted}
  715. 211.82 s > [2026-09-02 09:07:41.409] @process::amplitude INFO : Input is above threshold: 1 existing threshold E-surfaces across 1/1 graph groups
  716. 211.82 s > field value
  717. 211.82 s > existing_esurfaces 1
  718. 211.82 s > group_count 1
  719. 211.82 s > groups_above_threshold 1
  720. 211.82 s > integrand se1l_rls_shifted
  721. 211.82 s > span warm_up{integrand.name=se1l_rls_shifted}
  722. 211.82 s > threshold_status above threshold
  723. 211.82 s > [2026-09-02 09:07:41.409] @process::amplitude INFO : overlap structure of group 0: [1: [0(2,3)]]
  724. 211.82 s > field value
  725. 211.82 s > span warm_up{integrand.name=se1l_rls_shifted}
  726. 211.82 s > [2026-09-02 09:07:41.414] @process::amplitude WARNING : External state 0 ('g', PDG 21, helicity +) is off shell: p^2 = +2.5e5, expected m^2 = +0e0 (|Δ| = +2.5e5). Fixed-helicity spinor/vector/tensor external states may be ill-defined at this kinematic point.
  727. 211.82 s > field value
  728. 211.82 s > span warm_up{integrand.name=se1l}
  729. 211.82 s > [2026-09-02 09:07:41.414] @process::amplitude WARNING : External state 1 ('g', PDG 21, helicity -) is off shell: p^2 = +2.5e5, expected m^2 = +0e0 (|Δ| = +2.5e5). Fixed-helicity spinor/vector/tensor external states may be ill-defined at this kinematic point.
  730. 211.82 s > field value
  731. 211.82 s > span warm_up{integrand.name=se1l}
  732. 211.82 s > [2026-09-02 09:07:41.414] @process::amplitude INFO : Input is above threshold: 1 existing threshold E-surfaces across 1/1 graph groups
  733. 211.82 s > field value
  734. 211.82 s > existing_esurfaces 1
  735. 211.82 s > group_count 1
  736. 211.82 s > groups_above_threshold 1
  737. 211.82 s > integrand se1l
  738. 211.82 s > span warm_up{integrand.name=se1l}
  739. 211.82 s > threshold_status above threshold
  740. 211.82 s > [2026-09-02 09:07:41.414] @process::amplitude INFO : overlap structure of group 0: [1: [0(2,3)]]
  741. 211.82 s > field value
  742. 211.82 s > span warm_up{integrand.name=se1l}
  743. 211.82 s > [2026-09-02 09:07:41.419] @process::amplitude WARNING : External state 0 ('g', PDG 21, helicity +) is off shell: p^2 = +2.5e5, expected m^2 = +0e0 (|Δ| = +2.5e5). Fixed-helicity spinor/vector/tensor external states may be ill-defined at this kinematic point.
  744. 211.82 s > field value
  745. 211.82 s > span warm_up{integrand.name=se1l_rls_shifted}
  746. 211.82 s > [2026-09-02 09:07:41.419] @process::amplitude WARNING : External state 1 ('g', PDG 21, helicity -) is off shell: p^2 = +2.5e5, expected m^2 = +0e0 (|Δ| = +2.5e5). Fixed-helicity spinor/vector/tensor external states may be ill-defined at this kinematic point.
  747. 211.82 s > field value
  748. 211.82 s > span warm_up{integrand.name=se1l_rls_shifted}
  749. 211.82 s > [2026-09-02 09:07:41.419] @process::amplitude INFO : Input is above threshold: 1 existing threshold E-surfaces across 1/1 graph groups
  750. 211.82 s > field value
  751. 211.82 s > existing_esurfaces 1
  752. 211.82 s > group_count 1
  753. 211.82 s > groups_above_threshold 1
  754. 211.82 s > integrand se1l_rls_shifted
  755. 211.82 s > span warm_up{integrand.name=se1l_rls_shifted}
  756. 211.82 s > threshold_status above threshold
  757. 211.82 s > [2026-09-02 09:07:41.419] @process::amplitude INFO : overlap structure of group 0: [1: [0(2,3)]]
  758. 211.82 s > field value
  759. 211.82 s > span warm_up{integrand.name=se1l_rls_shifted}
  760. 211.82 s > [2026-09-02 09:07:41.424] @process::amplitude WARNING : External state 0 ('g', PDG 21, helicity +) is off shell: p^2 = +2.5e5, expected m^2 = +0e0 (|Δ| = +2.5e5). Fixed-helicity spinor/vector/tensor external states may be ill-defined at this kinematic point.
  761. 211.82 s > field value
  762. 211.82 s > span warm_up{integrand.name=se1l}
  763. 211.82 s > [2026-09-02 09:07:41.424] @process::amplitude WARNING : External state 1 ('g', PDG 21, helicity -) is off shell: p^2 = +2.5e5, expected m^2 = +0e0 (|Δ| = +2.5e5). Fixed-helicity spinor/vector/tensor external states may be ill-defined at this kinematic point.
  764. 211.82 s > field value
  765. 211.82 s > span warm_up{integrand.name=se1l}
  766. 211.82 s > [2026-09-02 09:07:41.424] @process::amplitude INFO : Input is above threshold: 1 existing threshold E-surfaces across 1/1 graph groups
  767. 211.82 s > field value
  768. 211.82 s > existing_esurfaces 1
  769. 211.82 s > group_count 1
  770. 211.82 s > groups_above_threshold 1
  771. 211.82 s > integrand se1l
  772. 211.82 s > span warm_up{integrand.name=se1l}
  773. 211.82 s > threshold_status above threshold
  774. 211.82 s > [2026-09-02 09:07:41.424] @process::amplitude INFO : overlap structure of group 0: [1: [0(2,3)]]
  775. 211.82 s > field value
  776. 211.82 s > span warm_up{integrand.name=se1l}
  777. 211.82 s > [2026-09-02 09:07:41.429] @process::amplitude WARNING : External state 0 ('g', PDG 21, helicity +) is off shell: p^2 = +2.5e5, expected m^2 = +0e0 (|Δ| = +2.5e5). Fixed-helicity spinor/vector/tensor external states may be ill-defined at this kinematic point.
  778. 211.82 s > field value
  779. 211.82 s > span warm_up{integrand.name=se1l_rls_shifted}
  780. 211.82 s > [2026-09-02 09:07:41.429] @process::amplitude WARNING : External state 1 ('g', PDG 21, helicity -) is off shell: p^2 = +2.5e5, expected m^2 = +0e0 (|Δ| = +2.5e5). Fixed-helicity spinor/vector/tensor external states may be ill-defined at this kinematic point.
  781. 211.82 s > field value
  782. 211.82 s > span warm_up{integrand.name=se1l_rls_shifted}
  783. 211.82 s > [2026-09-02 09:07:41.429] @process::amplitude INFO : Input is above threshold: 1 existing threshold E-surfaces across 1/1 graph groups
  784. 211.82 s > field value
  785. 211.82 s > existing_esurfaces 1
  786. 211.82 s > group_count 1
  787. 211.82 s > groups_above_threshold 1
  788. 211.82 s > integrand se1l_rls_shifted
  789. 211.82 s > span warm_up{integrand.name=se1l_rls_shifted}
  790. 211.82 s > threshold_status above threshold
  791. 211.82 s > [2026-09-02 09:07:41.429] @process::amplitude INFO : overlap structure of group 0: [1: [0(2,3)]]
  792. 211.82 s > field value
  793. 211.82 s > span warm_up{integrand.name=se1l_rls_shifted}
  794. 211.82 s > [2026-09-02 09:07:41.433] @process::amplitude WARNING : External state 0 ('g', PDG 21, helicity +) is off shell: p^2 = +2.5e5, expected m^2 = +0e0 (|Δ| = +2.5e5). Fixed-helicity spinor/vector/tensor external states may be ill-defined at this kinematic point.
  795. 211.82 s > field value
  796. 211.82 s > span warm_up{integrand.name=se1l}
  797. 211.82 s > [2026-09-02 09:07:41.433] @process::amplitude WARNING : External state 1 ('g', PDG 21, helicity -) is off shell: p^2 = +2.5e5, expected m^2 = +0e0 (|Δ| = +2.5e5). Fixed-helicity spinor/vector/tensor external states may be ill-defined at this kinematic point.
  798. 211.82 s > field value
  799. 211.82 s > span warm_up{integrand.name=se1l}
  800. 211.82 s > [2026-09-02 09:07:41.434] @process::amplitude INFO : Input is above threshold: 1 existing threshold E-surfaces across 1/1 graph groups
  801. 211.82 s > field value
  802. 211.82 s > existing_esurfaces 1
  803. 211.82 s > group_count 1
  804. 211.82 s > groups_above_threshold 1
  805. 211.82 s > integrand se1l
  806. 211.82 s > span warm_up{integrand.name=se1l}
  807. 211.82 s > threshold_status above threshold
  808. 211.82 s > [2026-09-02 09:07:41.434] @process::amplitude INFO : overlap structure of group 0: [1: [0(2,3)]]
  809. 211.82 s > field value
  810. 211.82 s > span warm_up{integrand.name=se1l}
  811. 211.82 s > [2026-09-02 09:07:41.438] @process::amplitude WARNING : External state 0 ('g', PDG 21, helicity +) is off shell: p^2 = +2.5e5, expected m^2 = +0e0 (|Δ| = +2.5e5). Fixed-helicity spinor/vector/tensor external states may be ill-defined at this kinematic point.
  812. 211.82 s > field value
  813. 211.82 s > span warm_up{integrand.name=se1l_rls_shifted}
  814. 211.82 s > [2026-09-02 09:07:41.438] @process::amplitude WARNING : External state 1 ('g', PDG 21, helicity -) is off shell: p^2 = +2.5e5, expected m^2 = +0e0 (|Δ| = +2.5e5). Fixed-helicity spinor/vector/tensor external states may be ill-defined at this kinematic point.
  815. 211.82 s > field value
  816. 211.82 s > span warm_up{integrand.name=se1l_rls_shifted}
  817. 211.82 s > [2026-09-02 09:07:41.438] @process::amplitude INFO : Input is above threshold: 1 existing threshold E-surfaces across 1/1 graph groups
  818. 211.82 s > field value
  819. 211.82 s > existing_esurfaces 1
  820. 211.82 s > group_count 1
  821. 211.82 s > groups_above_threshold 1
  822. 211.82 s > integrand se1l_rls_shifted
  823. 211.82 s > span warm_up{integrand.name=se1l_rls_shifted}
  824. 211.82 s > threshold_status above threshold
  825. 211.82 s > [2026-09-02 09:07:41.439] @process::amplitude INFO : overlap structure of group 0: [1: [0(2,3)]]
  826. 211.82 s > field value
  827. 211.82 s > span warm_up{integrand.name=se1l_rls_shifted}
  828. 211.82 s > [2026-09-02 09:07:41.443] @process::amplitude WARNING : External state 0 ('g', PDG 21, helicity +) is off shell: p^2 = +2.5e5, expected m^2 = +0e0 (|Δ| = +2.5e5). Fixed-helicity spinor/vector/tensor external states may be ill-defined at this kinematic point.
  829. 211.82 s > field value
  830. 211.82 s > span warm_up{integrand.name=se1l}
  831. 211.82 s > [2026-09-02 09:07:41.443] @process::amplitude WARNING : External state 1 ('g', PDG 21, helicity -) is off shell: p^2 = +2.5e5, expected m^2 = +0e0 (|Δ| = +2.5e5). Fixed-helicity spinor/vector/tensor external states may be ill-defined at this kinematic point.
  832. 211.82 s > field value
  833. 211.82 s > span warm_up{integrand.name=se1l}
  834. 211.82 s > [2026-09-02 09:07:41.443] @process::amplitude INFO : Input is above threshold: 1 existing threshold E-surfaces across 1/1 graph groups
  835. 211.82 s > field value
  836. 211.82 s > existing_esurfaces 1
  837. 211.82 s > group_count 1
  838. 211.82 s > groups_above_threshold 1
  839. 211.82 s > integrand se1l
  840. 211.82 s > span warm_up{integrand.name=se1l}
  841. 211.82 s > threshold_status above threshold
  842. 211.82 s > [2026-09-02 09:07:41.443] @process::amplitude INFO : overlap structure of group 0: [1: [0(2,3)]]
  843. 211.82 s > field value
  844. 211.82 s > span warm_up{integrand.name=se1l}
  845. 211.82 s > [2026-09-02 09:07:41.448] @process::amplitude WARNING : External state 0 ('g', PDG 21, helicity +) is off shell: p^2 = +2.5e5, expected m^2 = +0e0 (|Δ| = +2.5e5). Fixed-helicity spinor/vector/tensor external states may be ill-defined at this kinematic point.
  846. 211.82 s > field value
  847. 211.82 s > span warm_up{integrand.name=se1l_rls_shifted}
  848. 211.82 s > [2026-09-02 09:07:41.448] @process::amplitude WARNING : External state 1 ('g', PDG 21, helicity -) is off shell: p^2 = +2.5e5, expected m^2 = +0e0 (|Δ| = +2.5e5). Fixed-helicity spinor/vector/tensor external states may be ill-defined at this kinematic point.
  849. 211.82 s > field value
  850. 211.82 s > span warm_up{integrand.name=se1l_rls_shifted}
  851. 211.82 s > [2026-09-02 09:07:41.448] @process::amplitude INFO : Input is above threshold: 1 existing threshold E-surfaces across 1/1 graph groups
  852. 211.82 s > field value
  853. 211.82 s > existing_esurfaces 1
  854. 211.82 s > group_count 1
  855. 211.82 s > groups_above_threshold 1
  856. 211.82 s > integrand se1l_rls_shifted
  857. 211.82 s > span warm_up{integrand.name=se1l_rls_shifted}
  858. 211.82 s > threshold_status above threshold
  859. 211.82 s > [2026-09-02 09:07:41.448] @process::amplitude INFO : overlap structure of group 0: [1: [0(2,3)]]
  860. 211.82 s > field value
  861. 211.82 s > span warm_up{integrand.name=se1l_rls_shifted}
  862. 211.82 s > [2026-09-02 09:07:41.453] @process::amplitude WARNING : External state 0 ('g', PDG 21, helicity +) is off shell: p^2 = +2.5e5, expected m^2 = +0e0 (|Δ| = +2.5e5). Fixed-helicity spinor/vector/tensor external states may be ill-defined at this kinematic point.
  863. 211.82 s > field value
  864. 211.82 s > span warm_up{integrand.name=se1l}
  865. 211.82 s > [2026-09-02 09:07:41.453] @process::amplitude WARNING : External state 1 ('g', PDG 21, helicity -) is off shell: p^2 = +2.5e5, expected m^2 = +0e0 (|Δ| = +2.5e5). Fixed-helicity spinor/vector/tensor external states may be ill-defined at this kinematic point.
  866. 211.82 s > field value
  867. 211.82 s > span warm_up{integrand.name=se1l}
  868. 211.82 s > [2026-09-02 09:07:41.453] @process::amplitude INFO : Input is above threshold: 1 existing threshold E-surfaces across 1/1 graph groups
  869. 211.82 s > field value
  870. 211.82 s > existing_esurfaces 1
  871. 211.82 s > group_count 1
  872. 211.82 s > groups_above_threshold 1
  873. 211.82 s > integrand se1l
  874. 211.82 s > span warm_up{integrand.name=se1l}
  875. 211.82 s > threshold_status above threshold
  876. 211.82 s > [2026-09-02 09:07:41.453] @process::amplitude INFO : overlap structure of group 0: [1: [0(2,3)]]
  877. 211.82 s > field value
  878. 211.82 s > span warm_up{integrand.name=se1l}
  879. 211.82 s > [2026-09-02 09:07:41.458] @process::amplitude WARNING : External state 0 ('g', PDG 21, helicity +) is off shell: p^2 = +2.5e5, expected m^2 = +0e0 (|Δ| = +2.5e5). Fixed-helicity spinor/vector/tensor external states may be ill-defined at this kinematic point.
  880. 211.82 s > field value
  881. 211.82 s > span warm_up{integrand.name=se1l_rls_shifted}
  882. 211.82 s > [2026-09-02 09:07:41.458] @process::amplitude WARNING : External state 1 ('g', PDG 21, helicity -) is off shell: p^2 = +2.5e5, expected m^2 = +0e0 (|Δ| = +2.5e5). Fixed-helicity spinor/vector/tensor external states may be ill-defined at this kinematic point.
  883. 211.82 s > field value
  884. 211.82 s > span warm_up{integrand.name=se1l_rls_shifted}
  885. 211.82 s > [2026-09-02 09:07:41.458] @process::amplitude INFO : Input is above threshold: 1 existing threshold E-surfaces across 1/1 graph groups
  886. 211.82 s > field value
  887. 211.82 s > existing_esurfaces 1
  888. 211.82 s > group_count 1
  889. 211.82 s > groups_above_threshold 1
  890. 211.82 s > integrand se1l_rls_shifted
  891. 211.82 s > span warm_up{integrand.name=se1l_rls_shifted}
  892. 211.82 s > threshold_status above threshold
  893. 211.82 s > [2026-09-02 09:07:41.458] @process::amplitude INFO : overlap structure of group 0: [1: [0(2,3)]]
  894. 211.82 s > field value
  895. 211.82 s > span warm_up{integrand.name=se1l_rls_shifted}
  896. 211.82 s > [2026-09-02 09:07:41.462] @process::amplitude WARNING : External state 0 ('g', PDG 21, helicity +) is off shell: p^2 = +2.5e5, expected m^2 = +0e0 (|Δ| = +2.5e5). Fixed-helicity spinor/vector/tensor external states may be ill-defined at this kinematic point.
  897. 211.82 s > field value
  898. 211.82 s > span warm_up{integrand.name=se1l}
  899. 211.82 s > [2026-09-02 09:07:41.462] @process::amplitude WARNING : External state 1 ('g', PDG 21, helicity -) is off shell: p^2 = +2.5e5, expected m^2 = +0e0 (|Δ| = +2.5e5). Fixed-helicity spinor/vector/tensor external states may be ill-defined at this kinematic point.
  900. 211.82 s > field value
  901. 211.82 s > span warm_up{integrand.name=se1l}
  902. 211.82 s > [2026-09-02 09:07:41.463] @process::amplitude INFO : Input is above threshold: 1 existing threshold E-surfaces across 1/1 graph groups
  903. 211.82 s > field value
  904. 211.82 s > existing_esurfaces 1
  905. 211.82 s > group_count 1
  906. 211.82 s > groups_above_threshold 1
  907. 211.82 s > integrand se1l
  908. 211.82 s > span warm_up{integrand.name=se1l}
  909. 211.82 s > threshold_status above threshold
  910. 211.82 s > [2026-09-02 09:07:41.463] @process::amplitude INFO : overlap structure of group 0: [1: [0(2,3)]]
  911. 211.82 s > field value
  912. 211.82 s > span warm_up{integrand.name=se1l}
  913. 211.82 s > [2026-09-02 09:07:41.467] @process::amplitude WARNING : External state 0 ('g', PDG 21, helicity +) is off shell: p^2 = +2.5e5, expected m^2 = +0e0 (|Δ| = +2.5e5). Fixed-helicity spinor/vector/tensor external states may be ill-defined at this kinematic point.
  914. 211.82 s > field value
  915. 211.82 s > span warm_up{integrand.name=se1l_mur_shifted}
  916. 211.82 s > [2026-09-02 09:07:41.467] @process::amplitude WARNING : External state 1 ('g', PDG 21, helicity -) is off shell: p^2 = +2.5e5, expected m^2 = +0e0 (|Δ| = +2.5e5). Fixed-helicity spinor/vector/tensor external states may be ill-defined at this kinematic point.
  917. 211.82 s > field value
  918. 211.82 s > span warm_up{integrand.name=se1l_mur_shifted}
  919. 211.82 s > [2026-09-02 09:07:41.468] @process::amplitude INFO : Input is above threshold: 1 existing threshold E-surfaces across 1/1 graph groups
  920. 211.82 s > field value
  921. 211.82 s > existing_esurfaces 1
  922. 211.82 s > group_count 1
  923. 211.82 s > groups_above_threshold 1
  924. 211.82 s > integrand se1l_mur_shifted
  925. 211.82 s > span warm_up{integrand.name=se1l_mur_shifted}
  926. 211.82 s > threshold_status above threshold
  927. 211.82 s > [2026-09-02 09:07:41.468] @process::amplitude INFO : overlap structure of group 0: [1: [0(2,3)]]
  928. 211.82 s > field value
  929. 211.82 s > span warm_up{integrand.name=se1l_mur_shifted}
  930. 211.82 s > [2026-09-02 09:07:41.472] @process::amplitude WARNING : External state 0 ('g', PDG 21, helicity +) is off shell: p^2 = +2.5e5, expected m^2 = +0e0 (|Δ| = +2.5e5). Fixed-helicity spinor/vector/tensor external states may be ill-defined at this kinematic point.
  931. 211.82 s > field value
  932. 211.82 s > span warm_up{integrand.name=se1l}
  933. 211.82 s > [2026-09-02 09:07:41.472] @process::amplitude WARNING : External state 1 ('g', PDG 21, helicity -) is off shell: p^2 = +2.5e5, expected m^2 = +0e0 (|Δ| = +2.5e5). Fixed-helicity spinor/vector/tensor external states may be ill-defined at this kinematic point.
  934. 211.82 s > field value
  935. 211.82 s > span warm_up{integrand.name=se1l}
  936. 211.82 s > [2026-09-02 09:07:41.472] @process::amplitude INFO : Input is above threshold: 1 existing threshold E-surfaces across 1/1 graph groups
  937. 211.82 s > field value
  938. 211.82 s > existing_esurfaces 1
  939. 211.82 s > group_count 1
  940. 211.82 s > groups_above_threshold 1
  941. 211.82 s > integrand se1l
  942. 211.82 s > span warm_up{integrand.name=se1l}
  943. 211.82 s > threshold_status above threshold
  944. 211.82 s > [2026-09-02 09:07:41.472] @process::amplitude INFO : overlap structure of group 0: [1: [0(2,3)]]
  945. 211.82 s > field value
  946. 211.82 s > span warm_up{integrand.name=se1l}
  947. 211.82 s > [2026-09-02 09:07:41.477] @process::amplitude WARNING : External state 0 ('g', PDG 21, helicity +) is off shell: p^2 = +2.5e5, expected m^2 = +0e0 (|Δ| = +2.5e5). Fixed-helicity spinor/vector/tensor external states may be ill-defined at this kinematic point.
  948. 211.82 s > field value
  949. 211.82 s > span warm_up{integrand.name=se1l_mur_shifted}
  950. 211.82 s > [2026-09-02 09:07:41.477] @process::amplitude WARNING : External state 1 ('g', PDG 21, helicity -) is off shell: p^2 = +2.5e5, expected m^2 = +0e0 (|Δ| = +2.5e5). Fixed-helicity spinor/vector/tensor external states may be ill-defined at this kinematic point.
  951. 211.82 s > field value
  952. 211.82 s > span warm_up{integrand.name=se1l_mur_shifted}
  953. 211.82 s > [2026-09-02 09:07:41.477] @process::amplitude INFO : Input is above threshold: 1 existing threshold E-surfaces across 1/1 graph groups
  954. 211.82 s > field value
  955. 211.82 s > existing_esurfaces 1
  956. 211.82 s > group_count 1
  957. 211.82 s > groups_above_threshold 1
  958. 211.82 s > integrand se1l_mur_shifted
  959. 211.82 s > span warm_up{integrand.name=se1l_mur_shifted}
  960. 211.82 s > threshold_status above threshold
  961. 211.82 s > [2026-09-02 09:07:41.477] @process::amplitude INFO : overlap structure of group 0: [1: [0(2,3)]]
  962. 211.82 s > field value
  963. 211.82 s > span warm_up{integrand.name=se1l_mur_shifted}
  964. 211.82 s > [2026-09-02 09:07:41.481] @process::amplitude WARNING : External state 0 ('g', PDG 21, helicity +) is off shell: p^2 = +2.5e5, expected m^2 = +0e0 (|Δ| = +2.5e5). Fixed-helicity spinor/vector/tensor external states may be ill-defined at this kinematic point.
  965. 211.82 s > field value
  966. 211.82 s > span warm_up{integrand.name=se1l}
  967. 211.82 s > [2026-09-02 09:07:41.481] @process::amplitude WARNING : External state 1 ('g', PDG 21, helicity -) is off shell: p^2 = +2.5e5, expected m^2 = +0e0 (|Δ| = +2.5e5). Fixed-helicity spinor/vector/tensor external states may be ill-defined at this kinematic point.
  968. 211.82 s > field value
  969. 211.82 s > span warm_up{integrand.name=se1l}
  970. 211.82 s > [2026-09-02 09:07:41.481] @process::amplitude INFO : Input is above threshold: 1 existing threshold E-surfaces across 1/1 graph groups
  971. 211.82 s > field value
  972. 211.82 s > existing_esurfaces 1
  973. 211.82 s > group_count 1
  974. 211.82 s > groups_above_threshold 1
  975. 211.82 s > integrand se1l
  976. 211.82 s > span warm_up{integrand.name=se1l}
  977. 211.82 s > threshold_status above threshold
  978. 211.82 s > [2026-09-02 09:07:41.481] @process::amplitude INFO : overlap structure of group 0: [1: [0(2,3)]]
  979. 211.82 s > field value
  980. 211.82 s > span warm_up{integrand.name=se1l}
  981. 211.82 s > [2026-09-02 09:07:41.486] @process::amplitude WARNING : External state 0 ('g', PDG 21, helicity +) is off shell: p^2 = +2.5e5, expected m^2 = +0e0 (|Δ| = +2.5e5). Fixed-helicity spinor/vector/tensor external states may be ill-defined at this kinematic point.
  982. 211.82 s > field value
  983. 211.82 s > span warm_up{integrand.name=se1l_mur_shifted}
  984. 211.82 s > [2026-09-02 09:07:41.486] @process::amplitude WARNING : External state 1 ('g', PDG 21, helicity -) is off shell: p^2 = +2.5e5, expected m^2 = +0e0 (|Δ| = +2.5e5). Fixed-helicity spinor/vector/tensor external states may be ill-defined at this kinematic point.
  985. 211.82 s > field value
  986. 211.82 s > span warm_up{integrand.name=se1l_mur_shifted}
  987. 211.82 s > [2026-09-02 09:07:41.486] @process::amplitude INFO : Input is above threshold: 1 existing threshold E-surfaces across 1/1 graph groups
  988. 211.82 s > field value
  989. 211.82 s > existing_esurfaces 1
  990. 211.82 s > group_count 1
  991. 211.82 s > groups_above_threshold 1
  992. 211.82 s > integrand se1l_mur_shifted
  993. 211.82 s > span warm_up{integrand.name=se1l_mur_shifted}
  994. 211.82 s > threshold_status above threshold
  995. 211.82 s > [2026-09-02 09:07:41.486] @process::amplitude INFO : overlap structure of group 0: [1: [0(2,3)]]
  996. 211.82 s > field value
  997. 211.82 s > span warm_up{integrand.name=se1l_mur_shifted}
  998. 211.82 s > [2026-09-02 09:07:41.491] @process::amplitude WARNING : External state 0 ('g', PDG 21, helicity +) is off shell: p^2 = +2.5e5, expected m^2 = +0e0 (|Δ| = +2.5e5). Fixed-helicity spinor/vector/tensor external states may be ill-defined at this kinematic point.
  999. 211.82 s > field value
  1000. 211.82 s > span warm_up{integrand.name=se1l}
  1001. 211.82 s > [2026-09-02 09:07:41.491] @process::amplitude WARNING : External state 1 ('g', PDG 21, helicity -) is off shell: p^2 = +2.5e5, expected m^2 = +0e0 (|Δ| = +2.5e5). Fixed-helicity spinor/vector/tensor external states may be ill-defined at this kinematic point.
  1002. 211.82 s > field value
  1003. 211.82 s > span warm_up{integrand.name=se1l}
  1004. 211.82 s > [2026-09-02 09:07:41.491] @process::amplitude INFO : Input is above threshold: 1 existing threshold E-surfaces across 1/1 graph groups
  1005. 211.82 s > field value
  1006. 211.82 s > existing_esurfaces 1
  1007. 211.82 s > group_count 1
  1008. 211.82 s > groups_above_threshold 1
  1009. 211.82 s > integrand se1l
  1010. 211.82 s > span warm_up{integrand.name=se1l}
  1011. 211.82 s > threshold_status above threshold
  1012. 211.82 s > [2026-09-02 09:07:41.491] @process::amplitude INFO : overlap structure of group 0: [1: [0(2,3)]]
  1013. 211.82 s > field value
  1014. 211.82 s > span warm_up{integrand.name=se1l}
  1015. 211.82 s > [2026-09-02 09:07:41.495] @process::amplitude WARNING : External state 0 ('g', PDG 21, helicity +) is off shell: p^2 = +2.5e5, expected m^2 = +0e0 (|Δ| = +2.5e5). Fixed-helicity spinor/vector/tensor external states may be ill-defined at this kinematic point.
  1016. 211.82 s > field value
  1017. 211.82 s > span warm_up{integrand.name=se1l_mur_shifted}
  1018. 211.82 s > [2026-09-02 09:07:41.495] @process::amplitude WARNING : External state 1 ('g', PDG 21, helicity -) is off shell: p^2 = +2.5e5, expected m^2 = +0e0 (|Δ| = +2.5e5). Fixed-helicity spinor/vector/tensor external states may be ill-defined at this kinematic point.
  1019. 211.82 s > field value
  1020. 211.82 s > span warm_up{integrand.name=se1l_mur_shifted}
  1021. 211.82 s > [2026-09-02 09:07:41.496] @process::amplitude INFO : Input is above threshold: 1 existing threshold E-surfaces across 1/1 graph groups
  1022. 211.82 s > field value
  1023. 211.82 s > existing_esurfaces 1
  1024. 211.82 s > group_count 1
  1025. 211.82 s > groups_above_threshold 1
  1026. 211.82 s > integrand se1l_mur_shifted
  1027. 211.82 s > span warm_up{integrand.name=se1l_mur_shifted}
  1028. 211.82 s > threshold_status above threshold
  1029. 211.82 s > [2026-09-02 09:07:41.496] @process::amplitude INFO : overlap structure of group 0: [1: [0(2,3)]]
  1030. 211.82 s > field value
  1031. 211.82 s > span warm_up{integrand.name=se1l_mur_shifted}
  1032. 211.82 s > [2026-09-02 09:07:41.500] @process::amplitude WARNING : External state 0 ('g', PDG 21, helicity +) is off shell: p^2 = +2.5e5, expected m^2 = +0e0 (|Δ| = +2.5e5). Fixed-helicity spinor/vector/tensor external states may be ill-defined at this kinematic point.
  1033. 211.82 s > field value
  1034. 211.82 s > span warm_up{integrand.name=se1l}
  1035. 211.82 s > [2026-09-02 09:07:41.500] @process::amplitude WARNING : External state 1 ('g', PDG 21, helicity -) is off shell: p^2 = +2.5e5, expected m^2 = +0e0 (|Δ| = +2.5e5). Fixed-helicity spinor/vector/tensor external states may be ill-defined at this kinematic point.
  1036. 211.82 s > field value
  1037. 211.82 s > span warm_up{integrand.name=se1l}
  1038. 211.82 s > [2026-09-02 09:07:41.500] @process::amplitude INFO : Input is above threshold: 1 existing threshold E-surfaces across 1/1 graph groups
  1039. 211.82 s > field value
  1040. 211.82 s > existing_esurfaces 1
  1041. 211.82 s > group_count 1
  1042. 211.82 s > groups_above_threshold 1
  1043. 211.82 s > integrand se1l
  1044. 211.82 s > span warm_up{integrand.name=se1l}
  1045. 211.82 s > threshold_status above threshold
  1046. 211.82 s > [2026-09-02 09:07:41.500] @process::amplitude INFO : overlap structure of group 0: [1: [0(2,3)]]
  1047. 211.82 s > field value
  1048. 211.82 s > span warm_up{integrand.name=se1l}
  1049. 211.82 s > [2026-09-02 09:07:41.504] @process::amplitude WARNING : External state 0 ('g', PDG 21, helicity +) is off shell: p^2 = +2.5e5, expected m^2 = +0e0 (|Δ| = +2.5e5). Fixed-helicity spinor/vector/tensor external states may be ill-defined at this kinematic point.
  1050. 211.82 s > field value
  1051. 211.82 s > span warm_up{integrand.name=se1l_mur_shifted}
  1052. 211.82 s > [2026-09-02 09:07:41.504] @process::amplitude WARNING : External state 1 ('g', PDG 21, helicity -) is off shell: p^2 = +2.5e5, expected m^2 = +0e0 (|Δ| = +2.5e5). Fixed-helicity spinor/vector/tensor external states may be ill-defined at this kinematic point.
  1053. 211.82 s > field value
  1054. 211.82 s > span warm_up{integrand.name=se1l_mur_shifted}
  1055. 211.82 s > [2026-09-02 09:07:41.505] @process::amplitude INFO : Input is above threshold: 1 existing threshold E-surfaces across 1/1 graph groups
  1056. 211.82 s > field value
  1057. 211.82 s > existing_esurfaces 1
  1058. 211.82 s > group_count 1
  1059. 211.82 s > groups_above_threshold 1
  1060. 211.82 s > integrand se1l_mur_shifted
  1061. 211.82 s > span warm_up{integrand.name=se1l_mur_shifted}
  1062. 211.82 s > threshold_status above threshold
  1063. 211.82 s > [2026-09-02 09:07:41.505] @process::amplitude INFO : overlap structure of group 0: [1: [0(2,3)]]
  1064. 211.82 s > field value
  1065. 211.82 s > span warm_up{integrand.name=se1l_mur_shifted}
  1066. 211.82 s > [2026-09-02 09:07:41.509] @process::amplitude WARNING : External state 0 ('g', PDG 21, helicity +) is off shell: p^2 = +2.5e5, expected m^2 = +0e0 (|Δ| = +2.5e5). Fixed-helicity spinor/vector/tensor external states may be ill-defined at this kinematic point.
  1067. 211.82 s > field value
  1068. 211.82 s > span warm_up{integrand.name=se1l}
  1069. 211.82 s > [2026-09-02 09:07:41.509] @process::amplitude WARNING : External state 1 ('g', PDG 21, helicity -) is off shell: p^2 = +2.5e5, expected m^2 = +0e0 (|Δ| = +2.5e5). Fixed-helicity spinor/vector/tensor external states may be ill-defined at this kinematic point.
  1070. 211.82 s > field value
  1071. 211.82 s > span warm_up{integrand.name=se1l}
  1072. 211.82 s > [2026-09-02 09:07:41.510] @process::amplitude INFO : Input is above threshold: 1 existing threshold E-surfaces across 1/1 graph groups
  1073. 211.82 s > field value
  1074. 211.82 s > existing_esurfaces 1
  1075. 211.82 s > group_count 1
  1076. 211.82 s > groups_above_threshold 1
  1077. 211.82 s > integrand se1l
  1078. 211.82 s > span warm_up{integrand.name=se1l}
  1079. 211.82 s > threshold_status above threshold
  1080. 211.82 s > [2026-09-02 09:07:41.510] @process::amplitude INFO : overlap structure of group 0: [1: [0(2,3)]]
  1081. 211.82 s > field value
  1082. 211.82 s > span warm_up{integrand.name=se1l}
  1083. 211.82 s > [2026-09-02 09:07:41.515] @process::amplitude WARNING : External state 0 ('g', PDG 21, helicity +) is off shell: p^2 = +2.5e5, expected m^2 = +0e0 (|Δ| = +2.5e5). Fixed-helicity spinor/vector/tensor external states may be ill-defined at this kinematic point.
  1084. 211.82 s > field value
  1085. 211.82 s > span warm_up{integrand.name=se1l_mur_shifted}
  1086. 211.82 s > [2026-09-02 09:07:41.515] @process::amplitude WARNING : External state 1 ('g', PDG 21, helicity -) is off shell: p^2 = +2.5e5, expected m^2 = +0e0 (|Δ| = +2.5e5). Fixed-helicity spinor/vector/tensor external states may be ill-defined at this kinematic point.
  1087. 211.82 s > field value
  1088. 211.82 s > span warm_up{integrand.name=se1l_mur_shifted}
  1089. 211.82 s > [2026-09-02 09:07:41.515] @process::amplitude INFO : Input is above threshold: 1 existing threshold E-surfaces across 1/1 graph groups
  1090. 211.82 s > field value
  1091. 211.82 s > existing_esurfaces 1
  1092. 211.82 s > group_count 1
  1093. 211.82 s > groups_above_threshold 1
  1094. 211.82 s > integrand se1l_mur_shifted
  1095. 211.82 s > span warm_up{integrand.name=se1l_mur_shifted}
  1096. 211.82 s > threshold_status above threshold
  1097. 211.82 s > [2026-09-02 09:07:41.515] @process::amplitude INFO : overlap structure of group 0: [1: [0(2,3)]]
  1098. 211.82 s > field value
  1099. 211.82 s > span warm_up{integrand.name=se1l_mur_shifted}
  1100. 211.82 s > [2026-09-02 09:07:41.519] @process::amplitude WARNING : External state 0 ('g', PDG 21, helicity +) is off shell: p^2 = +2.5e5, expected m^2 = +0e0 (|Δ| = +2.5e5). Fixed-helicity spinor/vector/tensor external states may be ill-defined at this kinematic point.
  1101. 211.82 s > field value
  1102. 211.82 s > span warm_up{integrand.name=se1l}
  1103. 211.82 s > [2026-09-02 09:07:41.520] @process::amplitude WARNING : External state 1 ('g', PDG 21, helicity -) is off shell: p^2 = +2.5e5, expected m^2 = +0e0 (|Δ| = +2.5e5). Fixed-helicity spinor/vector/tensor external states may be ill-defined at this kinematic point.
  1104. 211.82 s > field value
  1105. 211.82 s > span warm_up{integrand.name=se1l}
  1106. 211.82 s > [2026-09-02 09:07:41.520] @process::amplitude INFO : Input is above threshold: 1 existing threshold E-surfaces across 1/1 graph groups
  1107. 211.82 s > field value
  1108. 211.82 s > existing_esurfaces 1
  1109. 211.82 s > group_count 1
  1110. 211.82 s > groups_above_threshold 1
  1111. 211.82 s > integrand se1l
  1112. 211.82 s > span warm_up{integrand.name=se1l}
  1113. 211.82 s > threshold_status above threshold
  1114. 211.82 s > [2026-09-02 09:07:41.520] @process::amplitude INFO : overlap structure of group 0: [1: [0(2,3)]]
  1115. 211.82 s > field value
  1116. 211.82 s > span warm_up{integrand.name=se1l}
  1117. 211.82 s > [2026-09-02 09:07:41.524] @process::amplitude WARNING : External state 0 ('g', PDG 21, helicity +) is off shell: p^2 = +2.5e5, expected m^2 = +0e0 (|Δ| = +2.5e5). Fixed-helicity spinor/vector/tensor external states may be ill-defined at this kinematic point.
  1118. 211.82 s > field value
  1119. 211.82 s > span warm_up{integrand.name=se1l_mur_shifted}
  1120. 211.82 s > [2026-09-02 09:07:41.525] @process::amplitude WARNING : External state 1 ('g', PDG 21, helicity -) is off shell: p^2 = +2.5e5, expected m^2 = +0e0 (|Δ| = +2.5e5). Fixed-helicity spinor/vector/tensor external states may be ill-defined at this kinematic point.
  1121. 211.82 s > field value
  1122. 211.82 s > span warm_up{integrand.name=se1l_mur_shifted}
  1123. 211.82 s > [2026-09-02 09:07:41.525] @process::amplitude INFO : Input is above threshold: 1 existing threshold E-surfaces across 1/1 graph groups
  1124. 211.82 s > field value
  1125. 211.82 s > existing_esurfaces 1
  1126. 211.82 s > group_count 1
  1127. 211.82 s > groups_above_threshold 1
  1128. 211.82 s > integrand se1l_mur_shifted
  1129. 211.82 s > span warm_up{integrand.name=se1l_mur_shifted}
  1130. 211.82 s > threshold_status above threshold
  1131. 211.82 s > [2026-09-02 09:07:41.525] @process::amplitude INFO : overlap structure of group 0: [1: [0(2,3)]]
  1132. 211.82 s > field value
  1133. 211.82 s > span warm_up{integrand.name=se1l_mur_shifted}
  1134. 211.82 s > [2026-09-02 09:07:41.530] @process::amplitude WARNING : External state 0 ('g', PDG 21, helicity +) is off shell: p^2 = +2.5e5, expected m^2 = +0e0 (|Δ| = +2.5e5). Fixed-helicity spinor/vector/tensor external states may be ill-defined at this kinematic point.
  1135. 211.82 s > field value
  1136. 211.82 s > span warm_up{integrand.name=se1l}
  1137. 211.82 s > [2026-09-02 09:07:41.530] @process::amplitude WARNING : External state 1 ('g', PDG 21, helicity -) is off shell: p^2 = +2.5e5, expected m^2 = +0e0 (|Δ| = +2.5e5). Fixed-helicity spinor/vector/tensor external states may be ill-defined at this kinematic point.
  1138. 211.82 s > field value
  1139. 211.82 s > span warm_up{integrand.name=se1l}
  1140. 211.82 s > [2026-09-02 09:07:41.530] @process::amplitude INFO : Input is above threshold: 1 existing threshold E-surfaces across 1/1 graph groups
  1141. 211.82 s > field value
  1142. 211.82 s > existing_esurfaces 1
  1143. 211.82 s > group_count 1
  1144. 211.82 s > groups_above_threshold 1
  1145. 211.82 s > integrand se1l
  1146. 211.82 s > span warm_up{integrand.name=se1l}
  1147. 211.82 s > threshold_status above threshold
  1148. 211.82 s > [2026-09-02 09:07:41.530] @process::amplitude INFO : overlap structure of group 0: [1: [0(2,3)]]
  1149. 211.82 s > field value
  1150. 211.82 s > span warm_up{integrand.name=se1l}
  1151. 211.82 s > [2026-09-02 09:07:41.535] @process::amplitude WARNING : External state 0 ('g', PDG 21, helicity +) is off shell: p^2 = +2.5e5, expected m^2 = +0e0 (|Δ| = +2.5e5). Fixed-helicity spinor/vector/tensor external states may be ill-defined at this kinematic point.
  1152. 211.82 s > field value
  1153. 211.82 s > span warm_up{integrand.name=se1l_mur_shifted}
  1154. 211.82 s > [2026-09-02 09:07:41.535] @process::amplitude WARNING : External state 1 ('g', PDG 21, helicity -) is off shell: p^2 = +2.5e5, expected m^2 = +0e0 (|Δ| = +2.5e5). Fixed-helicity spinor/vector/tensor external states may be ill-defined at this kinematic point.
  1155. 211.82 s > field value
  1156. 211.82 s > span warm_up{integrand.name=se1l_mur_shifted}
  1157. 211.82 s > [2026-09-02 09:07:41.535] @process::amplitude INFO : Input is above threshold: 1 existing threshold E-surfaces across 1/1 graph groups
  1158. 211.82 s > field value
  1159. 211.82 s > existing_esurfaces 1
  1160. 211.82 s > group_count 1
  1161. 211.82 s > groups_above_threshold 1
  1162. 211.82 s > integrand se1l_mur_shifted
  1163. 211.82 s > span warm_up{integrand.name=se1l_mur_shifted}
  1164. 211.82 s > threshold_status above threshold
  1165. 211.82 s > [2026-09-02 09:07:41.535] @process::amplitude INFO : overlap structure of group 0: [1: [0(2,3)]]
  1166. 211.82 s > field value
  1167. 211.82 s > span warm_up{integrand.name=se1l_mur_shifted}
  1168. 211.82 s > [2026-09-02 09:07:41.539] @process::amplitude WARNING : External state 0 ('g', PDG 21, helicity +) is off shell: p^2 = +2.5e5, expected m^2 = +0e0 (|Δ| = +2.5e5). Fixed-helicity spinor/vector/tensor external states may be ill-defined at this kinematic point.
  1169. 211.82 s > field value
  1170. 211.82 s > span warm_up{integrand.name=se1l}
  1171. 211.82 s > [2026-09-02 09:07:41.539] @process::amplitude WARNING : External state 1 ('g', PDG 21, helicity -) is off shell: p^2 = +2.5e5, expected m^2 = +0e0 (|Δ| = +2.5e5). Fixed-helicity spinor/vector/tensor external states may be ill-defined at this kinematic point.
  1172. 211.82 s > field value
  1173. 211.82 s > span warm_up{integrand.name=se1l}
  1174. 211.82 s > [2026-09-02 09:07:41.540] @process::amplitude INFO : Input is above threshold: 1 existing threshold E-surfaces across 1/1 graph groups
  1175. 211.82 s > field value
  1176. 211.82 s > existing_esurfaces 1
  1177. 211.82 s > group_count 1
  1178. 211.82 s > groups_above_threshold 1
  1179. 211.82 s > integrand se1l
  1180. 211.82 s > span warm_up{integrand.name=se1l}
  1181. 211.82 s > threshold_status above threshold
  1182. 211.82 s > [2026-09-02 09:07:41.540] @process::amplitude INFO : overlap structure of group 0: [1: [0(2,3)]]
  1183. 211.82 s > field value
  1184. 211.82 s > span warm_up{integrand.name=se1l}
  1185. 211.82 s > [2026-09-02 09:07:41.545] @process::amplitude WARNING : External state 0 ('g', PDG 21, helicity +) is off shell: p^2 = +2.5e5, expected m^2 = +0e0 (|Δ| = +2.5e5). Fixed-helicity spinor/vector/tensor external states may be ill-defined at this kinematic point.
  1186. 211.82 s > field value
  1187. 211.82 s > span warm_up{integrand.name=se1l_mur_shifted}
  1188. 211.82 s > [2026-09-02 09:07:41.545] @process::amplitude WARNING : External state 1 ('g', PDG 21, helicity -) is off shell: p^2 = +2.5e5, expected m^2 = +0e0 (|Δ| = +2.5e5). Fixed-helicity spinor/vector/tensor external states may be ill-defined at this kinematic point.
  1189. 211.82 s > field value
  1190. 211.82 s > span warm_up{integrand.name=se1l_mur_shifted}
  1191. 211.82 s > [2026-09-02 09:07:41.545] @process::amplitude INFO : Input is above threshold: 1 existing threshold E-surfaces across 1/1 graph groups
  1192. 211.82 s > field value
  1193. 211.82 s > existing_esurfaces 1
  1194. 211.82 s > group_count 1
  1195. 211.82 s > groups_above_threshold 1
  1196. 211.82 s > integrand se1l_mur_shifted
  1197. 211.82 s > span warm_up{integrand.name=se1l_mur_shifted}
  1198. 211.82 s > threshold_status above threshold
  1199. 211.82 s > [2026-09-02 09:07:41.545] @process::amplitude INFO : overlap structure of group 0: [1: [0(2,3)]]
  1200. 211.82 s > field value
  1201. 211.82 s > span warm_up{integrand.name=se1l_mur_shifted}
  1202. 211.82 s > [2026-09-02 09:07:41.550] @process::amplitude WARNING : External state 0 ('g', PDG 21, helicity +) is off shell: p^2 = +2.5e5, expected m^2 = +0e0 (|Δ| = +2.5e5). Fixed-helicity spinor/vector/tensor external states may be ill-defined at this kinematic point.
  1203. 211.82 s > field value
  1204. 211.82 s > span warm_up{integrand.name=se1l}
  1205. 211.82 s > [2026-09-02 09:07:41.550] @process::amplitude WARNING : External state 1 ('g', PDG 21, helicity -) is off shell: p^2 = +2.5e5, expected m^2 = +0e0 (|Δ| = +2.5e5). Fixed-helicity spinor/vector/tensor external states may be ill-defined at this kinematic point.
  1206. 211.82 s > field value
  1207. 211.82 s > span warm_up{integrand.name=se1l}
  1208. 211.82 s > [2026-09-02 09:07:41.550] @process::amplitude INFO : Input is above threshold: 1 existing threshold E-surfaces across 1/1 graph groups
  1209. 211.82 s > field value
  1210. 211.82 s > existing_esurfaces 1
  1211. 211.82 s > group_count 1
  1212. 211.82 s > groups_above_threshold 1
  1213. 211.82 s > integrand se1l
  1214. 211.82 s > span warm_up{integrand.name=se1l}
  1215. 211.82 s > threshold_status above threshold
  1216. 211.82 s > [2026-09-02 09:07:41.550] @process::amplitude INFO : overlap structure of group 0: [1: [0(2,3)]]
  1217. 211.82 s > field value
  1218. 211.82 s > span warm_up{integrand.name=se1l}
  1219. 211.82 s > [2026-09-02 09:07:41.555] @process::amplitude WARNING : External state 0 ('g', PDG 21, helicity +) is off shell: p^2 = +2.5e5, expected m^2 = +0e0 (|Δ| = +2.5e5). Fixed-helicity spinor/vector/tensor external states may be ill-defined at this kinematic point.
  1220. 211.82 s > field value
  1221. 211.82 s > span warm_up{integrand.name=se1l_mur_shifted}
  1222. 211.82 s > [2026-09-02 09:07:41.555] @process::amplitude WARNING : External state 1 ('g', PDG 21, helicity -) is off shell: p^2 = +2.5e5, expected m^2 = +0e0 (|Δ| = +2.5e5). Fixed-helicity spinor/vector/tensor external states may be ill-defined at this kinematic point.
  1223. 211.82 s > field value
  1224. 211.82 s > span warm_up{integrand.name=se1l_mur_shifted}
  1225. 211.82 s > [2026-09-02 09:07:41.555] @process::amplitude INFO : Input is above threshold: 1 existing threshold E-surfaces across 1/1 graph groups
  1226. 211.82 s > field value
  1227. 211.82 s > existing_esurfaces 1
  1228. 211.82 s > group_count 1
  1229. 211.82 s > groups_above_threshold 1
  1230. 211.82 s > integrand se1l_mur_shifted
  1231. 211.82 s > span warm_up{integrand.name=se1l_mur_shifted}
  1232. 211.82 s > threshold_status above threshold
  1233. 211.82 s > [2026-09-02 09:07:41.555] @process::amplitude INFO : overlap structure of group 0: [1: [0(2,3)]]
  1234. 211.82 s > field value
  1235. 211.82 s > span warm_up{integrand.name=se1l_mur_shifted}
  1236. 211.82 s > The application panicked (crashed).
  1237. 211.82 s > Message: Integrated UV case failed: se1l
  1238. 211.82 s > Location: tests/tests/uv.rs:1068
  1239. 211.82 s >
  1240. 211.82 s > ━━━━━━━━━━━━━━━━━━━━━━━━━━━━━━━━━━ BACKTRACE ━━━━━━━━━━━━━━━━━━━━━━━━━━━━━━━━━━━
  1241. 211.82 s > 1: <color_eyre[bb06c27fa12d52c3]::config::PanicHook>::panic_report<unknown>
  1242. 211.82 s > at <unknown source file>:<unknown line>
  1243. 211.82 s > 2: <color_eyre[bb06c27fa12d52c3]::config::PanicHook>::into_panic_hook::{closure#0}<unknown>
  1244. 211.82 s > at <unknown source file>:<unknown line>
  1245. 211.82 s > 3: std[5167731717db2e51]::panicking::panic_with_hook<unknown>
  1246. 211.82 s > at <unknown source file>:<unknown line>
  1247. 211.82 s > 4: std[5167731717db2e51]::panicking::panic_handler::{closure#0}<unknown>
  1248. 211.82 s > at <unknown source file>:<unknown line>
  1249. 211.82 s > 5: std[5167731717db2e51]::sys::backtrace::__rust_end_short_backtrace::<std[5167731717db2e51]::panicking::panic_handler::{closure#0}, !><unknown>
  1250. 211.82 s > at <unknown source file>:<unknown line>
  1251. 211.82 s > 6: __rustc[4b1ee1ef74718a7b]::rust_begin_unwind<unknown>
  1252. 211.82 s > at <unknown source file>:<unknown line>
  1253. 211.82 s > 7: core[8c5ac2f034688f9a]::panicking::panic_fmt<unknown>
  1254. 211.82 s > at <unknown source file>:<unknown line>
  1255. 211.82 s > 8: uv[654cd04bf7185af1]::run_single_integrated_uv_case<unknown>
  1256. 211.82 s > at <unknown source file>:<unknown line>
  1257. 211.82 s > 9: <uv[654cd04bf7185af1]::se1l_uv::{closure#0} as core[8c5ac2f034688f9a]::ops::function::FnOnce<()>>::call_once<unknown>
  1258. 211.82 s > at <unknown source file>:<unknown line>
  1259. 211.82 s > 10: test[7974841f8dbd3561]::__rust_begin_short_backtrace::<core[8c5ac2f034688f9a]::result::Result<(), alloc[93e694a8365d93dd]::string::String>, fn() -> core[8c5ac2f034688f9a]::result::Result<(), alloc[93e694a8365d93dd]::string::String>><unknown>
  1260. 211.82 s > at <unknown source file>:<unknown line>
  1261. 211.82 s > 11: test[7974841f8dbd3561]::run_test::{closure#0}<unknown>
  1262. 211.82 s > at <unknown source file>:<unknown line>
  1263. 211.82 s > 12: std[5167731717db2e51]::sys::backtrace::__rust_begin_short_backtrace::<test[7974841f8dbd3561]::run_test::{closure#1}, ()><unknown>
  1264. 211.82 s > at <unknown source file>:<unknown line>
  1265. 211.82 s > 13: <std[5167731717db2e51]::thread::lifecycle::spawn_unchecked<test[7974841f8dbd3561]::run_test::{closure#1}, ()>::{closure#1} as core[8c5ac2f034688f9a]::ops::function::FnOnce<()>>::call_once::{shim:vtable#0}<unknown>
  1266. 211.82 s > at <unknown source file>:<unknown line>
  1267. 211.82 s > 14: <std[5167731717db2e51]::sys::thread::unix::Thread>::new::thread_start<unknown>
  1268. 211.82 s > at <unknown source file>:<unknown line>
  1269. 211.82 s > 15: start_thread<unknown>
  1270. 211.82 s > at <unknown source file>:<unknown line>
  1271. 211.82 s > 16: __clone3<unknown>
  1272. 211.82 s > at <unknown source file>:<unknown line>
  1273. 211.82 s >
  1274. 211.82 s > Run with COLORBT_SHOW_HIDDEN=1 environment variable to disable frame filtering.
  1275. 211.82 s > Run with RUST_BACKTRACE=full to include source snippets.
  1276. 211.82 s >
  1277. 211.82 s > error: test run failed
  1278. 211.82 s >
  1279. 211.82 s > ========== nextest test summary ==========
  1280. 211.82 s > report: target/nextest/ci_gammaloop/junit.xml
  1281. 211.82 s > tests: 106, failures: 9, errors: 0
  1282. 211.82 s >
  1283. 211.82 s > 1. gammaloop-integration-tests::test_runs::approach::approach_momentum_space_reports_incomplete_triplet_cleanly
  1284. 211.82 s > failure: test failure with exit code 101
  1285. 211.82 s > system-out
  1286. 211.82 s > running 1 test
  1287. 211.82 s > test approach::approach_momentum_space_reports_incomplete_triplet_cleanly ... FAILED
  1288. 211.82 s >
  1289. 211.82 s > failures:
  1290. 211.82 s >
  1291. 211.82 s > failures:
  1292. 211.82 s > approach::approach_momentum_space_reports_incomplete_triplet_cleanly
  1293. 211.82 s >
  1294. 211.82 s > test result: FAILED. 0 passed; 1 failed; 0 ignored; 0 measured; 82 filtered out; finished in 1.54s
  1295. 211.82 s > system-err
  1296. 211.82 s > [2026-09-02 09:05:18.643] @gammaloop_api::se... INFO : Running command import model scalars-default.json
  1297. 211.82 s > [2026-09-02 09:05:18.643] @import::model INFO : Loading built-in JSON model scalars-default
  1298. 211.82 s > [2026-09-02 09:05:18.652] @gammalooprs::model INFO : The following 2 external parameters were forced to zero by the restriction card:
  1299. 211.82 s > width_scalar_1, width_scalar_2
  1300. 211.82 s > [2026-09-02 09:05:18.654] @gammaloop_api::se... INFO : Running command remove processes
  1301. 211.82 s > [2026-09-02 09:05:18.657] @gammaloop_api::se... INFO : Running command generate amp scalar_1 > scalar_0 scalar_0 [{1}] --allowed-vertex-interactions V_3_SCALAR_022 V_3_SCALAR_122 -p triangle -i scalar_tri
  1302. 211.82 s > [2026-09-02 09:05:18.658] @feyngen::diagram_... INFO : 0s | Δ=0s | Starting Feynman graph generation with Symbolica...
  1303. 211.82 s > [2026-09-02 09:05:18.658] @feyngen::diagram_... INFO : 0s | Δ=0s | Number of graphs resulting from Symbolica generation: 1
  1304. 211.82 s > [2026-09-02 09:05:18.660] @feyngen::diagram_... INFO : 0s | Δ=0s | Number of graphs retained after removal of vetoed topologies: 1
  1305. 211.82 s > [2026-09-02 09:05:18.661] @feyngen::diagram_... INFO : 0s | Δ=0s | Number of graphs after vertex info assignment: 1
  1306. 211.82 s > [2026-09-02 09:05:18.661] @feyngen::diagram_... INFO : 0s | Δ=0s | Number of graphs after all complete graphs filters are applied: 1
  1307. 211.82 s > [2026-09-02 09:05:18.665] @feyngen::diagram_... INFO : 0s | Δ=0s | Number of graphs after closed fermion chains analysis: 1
  1308. 211.82 s > [2026-09-02 09:05:18.665] @feyngen::diagram_... INFO : 0s | Δ=0s | Number of graphs after symmetrization of external states: 1
  1309. 211.82 s > [2026-09-02 09:05:18.667] @feyngen::diagram_... INFO : 0s | Δ=0s | Number of graphs after canonization of vertices, edges and flows (graph labels assigned here): 1
  1310. 211.82 s > [2026-09-02 09:05:18.707] @feyngen::diagram_... INFO : 0s | Δ=0s | Number of graphs after numerator-aware grouping with strategy 'up to a scalar rescaling': 1 (1 isomorphically unique graph, 0 color zero, 0 lorentz zero, 0 grouped and 0 cancellation)
  1311. 211.82 s > [2026-09-02 09:05:18.707] @feyngen::diagram_... INFO : ( Sum of the symmetry factors from each graph generated = 1 )
  1312. 211.82 s > [2026-09-02 09:05:18.707] @commands::generate INFO : Generated amplitude 1 graphs.
  1313. 211.82 s > [2026-09-02 09:05:18.798] @settings::runtime WARNING : No external kinematics were provided; using default-generated external momenta and helicities.
  1314. 211.82 s > [2026-09-02 09:05:18.844] @commands::generate INFO :
  1315. 211.82 s > Integrand generation summary
  1316. 211.82 s > peak RAM 66.03 MiB | cores 1
  1317. 211.82 s > ╭────────────┬───────┬─────────┬────────────┬───────────┬────────────────┬─────────────╮
  1318. 211.82 s > │ integrand │ graph │ # evals │ expr build │ spenso │ symbolica eval │ compile │
  1319. 211.82 s > ├────────────┼───────┼─────────┼────────────┼───────────┼────────────────┼─────────────┤
  1320. 211.82 s > │ scalar_tri │ GL0 │ 9 │ 38ms (50%) │ 9ms (12%) │ 29ms (38%) │ 0ms (0.00%) │
  1321. 211.82 s > ├────────────┼───────┼─────────┼────────────┼───────────┼────────────────┼─────────────┤
  1322. 211.82 s > │ Total │ │ 9 │ 38ms (50%) │ 9ms (12%) │ 29ms (38%) │ 0ms (0.00%) │
  1323. 211.82 s > ╰────────────┴───────┴─────────┴────────────┴───────────┴────────────────┴─────────────╯
  1324. 211.82 s > [2026-09-02 09:05:18.845] @gammaloop_api::se... INFO : Running command generate amp scalar_0 scalar_0 > scalar_0 scalar_0 [{1}] --allowed-vertex-interactions V_3_SCALAR_022 -p box -i scalar_box --select-graphs GL0
  1325. 211.82 s > [2026-09-02 09:05:18.846] @feyngen::diagram_... INFO : 0s | Δ=0s | Starting Feynman graph generation with Symbolica...
  1326. 211.82 s > [2026-09-02 09:05:18.846] @feyngen::diagram_... INFO : 0s | Δ=0s | Number of graphs resulting from Symbolica generation: 3
  1327. 211.82 s > [2026-09-02 09:05:18.913] @feyngen::diagram_... INFO : 0s | Δ=0s | Number of graphs retained after removal of vetoed topologies: 3
  1328. 211.82 s > [2026-09-02 09:05:18.915] @feyngen::diagram_... INFO : 0s | Δ=0s | Number of graphs after vertex info assignment: 3
  1329. 211.82 s > [2026-09-02 09:05:18.915] @feyngen::diagram_... INFO : 0s | Δ=0s | Number of graphs after all complete graphs filters are applied: 3
  1330. 211.82 s > [2026-09-02 09:05:18.915] @feyngen::diagram_... INFO : 0s | Δ=0s | Number of graphs after closed fermion chains analysis: 3
  1331. 211.82 s > [2026-09-02 09:05:18.915] @feyngen::diagram_... INFO : 0s | Δ=0s | Number of graphs after symmetrization of external states: 3
  1332. 211.82 s > [2026-09-02 09:05:18.915] @feyngen::diagram_... INFO : 0s | Δ=0s | Number of graphs after canonization of vertices, edges and flows (graph labels assigned here): 3
  1333. 211.82 s > [2026-09-02 09:05:18.929] @feyngen::diagram_... INFO : 0s | Δ=0s | Number of graphs after numerator-aware grouping with strategy 'up to a scalar rescaling': 1 (1 isomorphically unique graph, 0 color zero, 0 lorentz zero, 0 grouped and 0 cancellation)
  1334. 211.82 s > [2026-09-02 09:05:18.929] @feyngen::diagram_... INFO : ( Sum of the symmetry factors from each graph generated = 1 )
  1335. 211.82 s > [2026-09-02 09:05:18.929] @commands::generate INFO : Generated amplitude 1 graphs.
  1336. 211.82 s > [2026-09-02 09:05:19.023] @settings::runtime WARNING : No external kinematics were provided; using default-generated external momenta and helicities.
  1337. 211.82 s > [2026-09-02 09:05:19.044] @commands::generate INFO :
  1338. 211.82 s > Integrand generation summary
  1339. 211.82 s > peak RAM 68.58 MiB | cores 1
  1340. 211.82 s > ╭────────────┬───────┬─────────┬────────────┬────────────┬────────────────┬─────────────╮
  1341. 211.82 s > │ integrand │ graph │ # evals │ expr build │ spenso │ symbolica eval │ compile │
  1342. 211.82 s > ├────────────┼───────┼─────────┼────────────┼────────────┼────────────────┼─────────────┤
  1343. 211.82 s > │ scalar_box │ GL0 │ 13 │ 52ms (59%) │ 7ms (8.6%) │ 28ms (32%) │ 0ms (0.00%) │
  1344. 211.82 s > ├────────────┼───────┼─────────┼────────────┼────────────┼────────────────┼─────────────┤
  1345. 211.82 s > │ Total │ │ 13 │ 52ms (59%) │ 7ms (8.6%) │ 28ms (32%) │ 0ms (0.00%) │
  1346. 211.82 s > ╰────────────┴───────┴─────────┴────────────┴────────────┴────────────────┴─────────────╯
  1347. 211.82 s > [2026-09-02 09:05:19.045] @gammaloop_api::se... INFO : Running command generate
  1348. 211.82 s > [2026-09-02 09:05:19.292] @settings::runtime WARNING : No external kinematics were provided; using default-generated external momenta and helicities.
  1349. 211.82 s > [2026-09-02 09:05:19.404] @settings::runtime WARNING : No external kinematics were provided; using default-generated external momenta and helicities.
  1350. 211.82 s > [2026-09-02 09:05:19.487] @commands::generate INFO :
  1351. 211.82 s > Integrand generation summary
  1352. 211.82 s > peak RAM 72.71 MiB | cores 1
  1353. 211.82 s > ╭────────────┬───────┬─────────┬─────────────┬─────────────┬────────────────┬─────────────╮
  1354. 211.82 s > │ integrand │ graph │ # evals │ expr build │ spenso │ symbolica eval │ compile │
  1355. 211.82 s > ├────────────┼───────┼─────────┼─────────────┼─────────────┼────────────────┼─────────────┤
  1356. 211.82 s > │ scalar_tri │ GL0 │ 9 │ 33ms (60%) │ 1ms (3.3%) │ 20ms (37%) │ 0ms (0.00%) │
  1357. 211.82 s > │ scalar_box │ GL0 │ 13 │ 177ms (63%) │ 26ms (9.3%) │ 78ms (28%) │ 0ms (0.00%) │
  1358. 211.82 s > ├────────────┼───────┼─────────┼─────────────┼─────────────┼────────────────┼─────────────┤
  1359. 211.82 s > │ Total │ │ 22 │ 211ms (63%) │ 28ms (8.3%) │ 98ms (29%) │ 0ms (0.00%) │
  1360. 211.82 s > ╰────────────┴───────┴─────────┴─────────────┴─────────────┴────────────────┴─────────────╯
  1361. 211.82 s > [2026-09-02 09:05:19.488] @gammaloop_api::se... INFO : Running command set model mass_scalar_2=2.0
  1362. 211.82 s > [2026-09-02 09:05:19.489] @gammaloop_api::se... INFO : Running command set model mass_scalar_1=1.0
  1363. 211.82 s > [2026-09-02 09:05:19.490] @gammaloop_api::se... INFO : Running command set process -p triangle -i scalar_tri string '
  1364. 211.82 s > [kinematics.externals]
  1365. 211.82 s > type = "constant"
  1366. 211.82 s >
  1367. 211.82 s > [kinematics.externals.data]
  1368. 211.82 s > [...]
  1369. 211.82 s > [2026-09-02 09:05:19.491] @gammaloop_api::se... INFO : Running command set process -p box -i scalar_box string '
  1370. 211.82 s > [kinematics.externals]
  1371. 211.82 s > type = "constant"
  1372. 211.82 s >
  1373. 211.82 s > [kinematics.externals.data]
  1374. 211.82 s > [...]
  1375. 211.82 s > [2026-09-02 09:05:19.492] @gammaloop_api::se... INFO : Running command approach -x 1.0000000000000001e-1,2.0000000000000001e-1,2.9999999999999999e-1,4.0000000000000002e-1 --approach-axis 1.0000000000000000e-3,0.0000000000000000e0,0.0000000000000000e0,0.0000000000000000e0 --n-points 1 --n-cores 1 --output-results /build/source/tests/artifacts/scalar_box_invalid_momentum_approach/approach_momentum.json --momentum-space --graph-id 0
  1376. 211.82 s > The application panicked (crashed).
  1377. 211.82 s > Message: There are 2 processes available. Please specify a process.
  1378. 211.82 s > Location: tests/tests/test_runs/approach.rs:332
  1379. 211.82 s >
  1380. 211.82 s > ━━━━━━━━━━━━━━━━━━━━━━━━━━━━━━━━━━ BACKTRACE ━━━━━━━━━━━━━━━━━━━━━━━━━━━━━━━━━━━
  1381. 211.82 s > 1: <color_eyre[bb06c27fa12d52c3]::config::PanicHook>::panic_report<unknown>
  1382. 211.82 s > at <unknown source file>:<unknown line>
  1383. 211.82 s > 2: <color_eyre[bb06c27fa12d52c3]::config::PanicHook>::into_panic_hook::{closure#0}<unknown>
  1384. 211.82 s > at <unknown source file>:<unknown line>
  1385. 211.82 s > 3: std[5167731717db2e51]::panicking::panic_with_hook<unknown>
  1386. 211.82 s > at <unknown source file>:<unknown line>
  1387. 211.82 s > 4: std[5167731717db2e51]::panicking::panic_handler::{closure#0}<unknown>
  1388. 211.82 s > at <unknown source file>:<unknown line>
  1389. 211.82 s > 5: std[5167731717db2e51]::sys::backtrace::__rust_end_short_backtrace::<std[5167731717db2e51]::panicking::panic_handler::{closure#0}, !><unknown>
  1390. 211.82 s > at <unknown source file>:<unknown line>
  1391. 211.82 s > 6: __rustc[4b1ee1ef74718a7b]::rust_begin_unwind<unknown>
  1392. 211.82 s > at <unknown source file>:<unknown line>
  1393. 211.82 s > 7: core[8c5ac2f034688f9a]::panicking::panic_fmt<unknown>
  1394. 211.82 s > at <unknown source file>:<unknown line>
  1395. 211.82 s > 8: test_runs[928b8788563090d0]::approach::approach_momentum_space_reports_incomplete_triplet_cleanly<unknown>
  1396. 211.82 s > at <unknown source file>:<unknown line>
  1397. 211.82 s > 9: <test_runs[928b8788563090d0]::approach::approach_momentum_space_reports_incomplete_triplet_cleanly::{closure#0} as core[8c5ac2f034688f9a]::ops::function::FnOnce<()>>::call_once<unknown>
  1398. 211.82 s > at <unknown source file>:<unknown line>
  1399. 211.82 s > 10: test[7974841f8dbd3561]::__rust_begin_short_backtrace::<core[8c5ac2f034688f9a]::result::Result<(), alloc[93e694a8365d93dd]::string::String>, fn() -> core[8c5ac2f034688f9a]::result::Result<(), alloc[93e694a8365d93dd]::string::String>><unknown>
  1400. 211.82 s > at <unknown source file>:<unknown line>
  1401. 211.82 s > 11: test[7974841f8dbd3561]::run_test::{closure#0}<unknown>
  1402. 211.82 s > at <unknown source file>:<unknown line>
  1403. 211.82 s > 12: std[5167731717db2e51]::sys::backtrace::__rust_begin_short_backtrace::<test[7974841f8dbd3561]::run_test::{closure#1}, ()><unknown>
  1404. 211.82 s > at <unknown source file>:<unknown line>
  1405. 211.82 s > 13: <std[5167731717db2e51]::thread::lifecycle::spawn_unchecked<test[7974841f8dbd3561]::run_test::{closure#1}, ()>::{closure#1} as core[8c5ac2f034688f9a]::ops::function::FnOnce<()>>::call_once::{shim:vtable#0}<unknown>
  1406. 211.82 s > at <unknown source file>:<unknown line>
  1407. 211.82 s > 14: <std[5167731717db2e51]::sys::thread::unix::Thread>::new::thread_start<unknown>
  1408. 211.82 s > at <unknown source file>:<unknown line>
  1409. 211.82 s > 15: start_thread<unknown>
  1410. 211.82 s > at <unknown source file>:<unknown line>
  1411. 211.82 s > 16: __clone3<unknown>
  1412. 211.82 s > at <unknown source file>:<unknown line>
  1413. 211.82 s >
  1414. 211.82 s > Run with COLORBT_SHOW_HIDDEN=1 environment variable to disable frame filtering.
  1415. 211.82 s > ... omitted 1 more lines; see full nextest output above
  1416. 211.82 s >
  1417. 211.82 s > 2. gammaloop-integration-tests::test_runs::profile_bulk::box_4e_bulk_profile_passes
  1418. 211.82 s > failure: test failure with exit code 101
  1419. 211.82 s > Error:
  1420. 211.82 s > 0: IR profiling requested arbitrary precision but received a quad-precision result
  1421. 211.82 s >
  1422. 211.82 s > Location:
  1423. 211.82 s > crates/gammalooprs/src/integrands/process/ir.rs:2123
  1424. 211.82 s >
  1425. 211.82 s > ━━━━━━━━━━━━━━━━━━━━━━━━━━━━━━━━━━ BACKTRACE ━━━━━━━━━━━━━━━━━━━━━━━━━━━━━━━━━━━
  1426. 211.82 s > 1: <color_eyre[bb06c27fa12d52c3]::config::EyreHook>::into_eyre_hook::{closure#0}<unknown>
  1427. 211.82 s > at <unknown source file>:<unknown line>
  1428. 211.82 s > 2: eyre[9f660d63ab6a72c5]::capture_handler<unknown>
  1429. 211.82 s > at <unknown source file>:<unknown line>
  1430. 211.82 s > 3: eyre[9f660d63ab6a72c5]::private::format_err<unknown>
  1431. 211.82 s > at <unknown source file>:<unknown line>
  1432. 211.82 s > 4: gammalooprs[1b273202b0029755]::integrands::process::ir::evaluate_profile_momentum_point_arb::<gammalooprs[1b273202b0029755]::integrands::process::amplitude::AmplitudeIntegrand><unknown>
  1433. 211.82 s > at <unknown source file>:<unknown line>
  1434. 211.82 s > 5: <gammalooprs[1b273202b0029755]::integrands::process::amplitude::AmplitudeIntegrand>::test_single_ir_limit_impl<unknown>
  1435. 211.82 s > at <unknown source file>:<unknown line>
  1436. 211.82 s > 6: gammalooprs[1b273202b0029755]::integrands::process::ir::run_ir_profile::<gammalooprs[1b273202b0029755]::integrands::process::amplitude::AmplitudeIntegrand, <gammalooprs[1b273202b0029755]::integrands::process::amplitude::AmplitudeIntegrand>::enumerate_ir_limits, <gammalooprs[1b273202b0029755]::integrands::process::amplitude::AmplitudeIntegrand>::graph_cut_definitions, <gammalooprs[1b273202b0029755]::integrands::process::amplitude::AmplitudeIntegrand>::test_single_ir_limit_impl><unknown>
  1437. 211.82 s > at <unknown source file>:<unknown line>
  1438. 211.82 s > 7: <gammalooprs[1b273202b0029755]::integrands::process::amplitude::AmplitudeIntegrand>::test_ir<unknown>
  1439. 211.82 s > at <unknown source file>:<unknown line>
  1440. 211.82 s > 8: <gammaloop_api[9fdde70dfc7501ea]::commands::profile::Profile>::run<unknown>
  1441. 211.82 s > at <unknown source file>:<unknown line>
  1442. 211.82 s > 9: test_runs[928b8788563090d0]::profile_bulk::box_4e_bulk_profile_passes<unknown>
  1443. 211.82 s > at <unknown source file>:<unknown line>
  1444. 211.82 s > 10: <test_runs[928b8788563090d0]::profile_bulk::box_4e_bulk_profile_passes::{closure#0} as core[8c5ac2f034688f9a]::ops::function::FnOnce<()>>::call_once<unknown>
  1445. 211.82 s > at <unknown source file>:<unknown line>
  1446. 211.82 s > 11: test[7974841f8dbd3561]::__rust_begin_short_backtrace::<core[8c5ac2f034688f9a]::result::Result<(), alloc[93e694a8365d93dd]::string::String>, fn() -> core[8c5ac2f034688f9a]::result::Result<(), alloc[93e694a8365d93dd]::string::String>><unknown>
  1447. 211.82 s > at <unknown source file>:<unknown line>
  1448. 211.82 s > 12: test[7974841f8dbd3561]::run_test::{closure#0}<unknown>
  1449. 211.82 s > at <unknown source file>:<unknown line>
  1450. 211.82 s > 13: std[5167731717db2e51]::sys::backtrace::__rust_begin_short_backtrace::<test[7974841f8dbd3561]::run_test::{closure#1}, ()><unknown>
  1451. 211.82 s > at <unknown source file>:<unknown line>
  1452. 211.82 s > 14: <std[5167731717db2e51]::thread::lifecycle::spawn_unchecked<test[7974841f8dbd3561]::run_test::{closure#1}, ()>::{closure#1} as core[8c5ac2f034688f9a]::ops::function::FnOnce<()>>::call_once::{shim:vtable#0}<unknown>
  1453. 211.82 s > at <unknown source file>:<unknown line>
  1454. 211.82 s > 15: <std[5167731717db2e51]::sys::thread::unix::Thread>::new::thread_start<unknown>
  1455. 211.82 s > at <unknown source file>:<unknown line>
  1456. 211.82 s > 16: start_thread<unknown>
  1457. 211.82 s > at <unknown source file>:<unknown line>
  1458. 211.82 s > 17: __clone3<unknown>
  1459. 211.82 s > at <unknown source file>:<unknown line>
  1460. 211.82 s >
  1461. 211.82 s > Run with COLORBT_SHOW_HIDDEN=1 environment variable to disable frame filtering.
  1462. 211.82 s > Run with RUST_BACKTRACE=full to include source snippets.
  1463. 211.82 s > Warning: SpanTrace capture is Unsupported.
  1464. 211.82 s > Ensure that you've setup a tracing-error ErrorLayer and the semver versions are compatible
  1465. 211.82 s > system-out
  1466. 211.82 s > running 1 test
  1467. 211.82 s > test profile_bulk::box_4e_bulk_profile_passes ... FAILED
  1468. 211.82 s >
  1469. 211.82 s > failures:
  1470. 211.82 s >
  1471. 211.82 s > failures:
  1472. 211.82 s > profile_bulk::box_4e_bulk_profile_passes
  1473. 211.82 s >
  1474. 211.82 s > test result: FAILED. 0 passed; 1 failed; 0 ignored; 0 measured; 82 filtered out; finished in 0.45s
  1475. 211.82 s > system-err
  1476. 211.82 s > [2026-09-02 09:05:22.118] @gammaloop_api::se... INFO : Running command import model ./assets/models/json/scalars/scalars.json
  1477. 211.82 s > [2026-09-02 09:05:22.118] @import::model INFO : Loading JSON model scalars-default from /build/source/assets/models/json/scalars/scalars
  1478. 211.82 s > [2026-09-02 09:05:22.125] @gammalooprs::model INFO : The following 2 external parameters were forced to zero by the restriction card:
  1479. 211.82 s > width_scalar_1, width_scalar_2
  1480. 211.82 s > [2026-09-02 09:05:22.127] @gammaloop_api::se... INFO : Running command import graphs ./tests/resources/graphs/massless_box.dot
  1481. 211.82 s > [2026-09-02 09:05:22.127] @commands::import INFO : Loading graphs from '/build/source/tests/resources/graphs/massless_box.dot'
  1482. 211.82 s > [2026-09-02 09:05:22.133] @gammaloop_api::se... INFO : Running command generate
  1483. 211.82 s > [2026-09-02 09:05:22.359] @commands::generate INFO :
  1484. 211.82 s > Integrand generation summary
  1485. 211.82 s > peak RAM 68.19 MiB | cores 1
  1486. 211.82 s > ╭───────────┬────────────────┬─────────┬────────────┬────────────┬────────────────┬─────────────╮
  1487. 211.82 s > │ integrand │ graph │ # evals │ expr build │ spenso │ symbolica eval │ compile │
  1488. 211.82 s > ├───────────┼────────────────┼─────────┼────────────┼────────────┼────────────────┼─────────────┤
  1489. 211.82 s > │ default │ massless_box_0 │ 14 │ 82ms (60%) │ 31ms (23%) │ 23ms (17%) │ 0ms (0.00%) │
  1490. 211.82 s > ├───────────┼────────────────┼─────────┼────────────┼────────────┼────────────────┼─────────────┤
  1491. 211.82 s > │ Total │ │ 14 │ 82ms (60%) │ 31ms (23%) │ 23ms (17%) │ 0ms (0.00%) │
  1492. 211.82 s > ╰───────────┴────────────────┴─────────┴────────────┴────────────┴────────────────┴─────────────╯
  1493. 211.82 s > [2026-09-02 09:05:22.362] @process::amplitude INFO : Input is above threshold: 4 existing threshold E-surfaces across 1/1 graph groups
  1494. 211.82 s > [2026-09-02 09:05:22.363] @process::amplitude INFO : overlap structure of group 0: [2: [4(3,4), 9(3,5)], 2: [9(3,5), 11(5,6)], 2: [4(3,4), 8(4,6)], 2: [8(4,6), 11(5,6)]]
  1495. 211.82 s > Error:
  1496. 211.82 s > 0: IR profiling requested arbitrary precision but received a quad-precision result
  1497. 211.82 s >
  1498. 211.82 s > Location:
  1499. 211.82 s > crates/gammalooprs/src/integrands/process/ir.rs:2123
  1500. 211.82 s >
  1501. 211.82 s > ━━━━━━━━━━━━━━━━━━━━━━━━━━━━━━━━━━ BACKTRACE ━━━━━━━━━━━━━━━━━━━━━━━━━━━━━━━━━━━
  1502. 211.82 s > 1: <color_eyre[bb06c27fa12d52c3]::config::EyreHook>::into_eyre_hook::{closure#0}<unknown>
  1503. 211.82 s > at <unknown source file>:<unknown line>
  1504. 211.82 s > 2: eyre[9f660d63ab6a72c5]::capture_handler<unknown>
  1505. 211.82 s > at <unknown source file>:<unknown line>
  1506. 211.82 s > 3: eyre[9f660d63ab6a72c5]::private::format_err<unknown>
  1507. 211.82 s > at <unknown source file>:<unknown line>
  1508. 211.82 s > 4: gammalooprs[1b273202b0029755]::integrands::process::ir::evaluate_profile_momentum_point_arb::<gammalooprs[1b273202b0029755]::integrands::process::amplitude::AmplitudeIntegrand><unknown>
  1509. 211.82 s > at <unknown source file>:<unknown line>
  1510. 211.82 s > 5: <gammalooprs[1b273202b0029755]::integrands::process::amplitude::AmplitudeIntegrand>::test_single_ir_limit_impl<unknown>
  1511. 211.82 s > at <unknown source file>:<unknown line>
  1512. 211.82 s > 6: gammalooprs[1b273202b0029755]::integrands::process::ir::run_ir_profile::<gammalooprs[1b273202b0029755]::integrands::process::amplitude::AmplitudeIntegrand, <gammalooprs[1b273202b0029755]::integrands::process::amplitude::AmplitudeIntegrand>::enumerate_ir_limits, <gammalooprs[1b273202b0029755]::integrands::process::amplitude::AmplitudeIntegrand>::graph_cut_definitions, <gammalooprs[1b273202b0029755]::integrands::process::amplitude::AmplitudeIntegrand>::test_single_ir_limit_impl><unknown>
  1513. 211.82 s > at <unknown source file>:<unknown line>
  1514. 211.82 s > 7: <gammalooprs[1b273202b0029755]::integrands::process::amplitude::AmplitudeIntegrand>::test_ir<unknown>
  1515. 211.82 s > at <unknown source file>:<unknown line>
  1516. 211.82 s > 8: <gammaloop_api[9fdde70dfc7501ea]::commands::profile::Profile>::run<unknown>
  1517. 211.82 s > at <unknown source file>:<unknown line>
  1518. 211.82 s > 9: test_runs[928b8788563090d0]::profile_bulk::box_4e_bulk_profile_passes<unknown>
  1519. 211.82 s > at <unknown source file>:<unknown line>
  1520. 211.82 s > 10: <test_runs[928b8788563090d0]::profile_bulk::box_4e_bulk_profile_passes::{closure#0} as core[8c5ac2f034688f9a]::ops::function::FnOnce<()>>::call_once<unknown>
  1521. 211.82 s > at <unknown source file>:<unknown line>
  1522. 211.82 s > 11: test[7974841f8dbd3561]::__rust_begin_short_backtrace::<core[8c5ac2f034688f9a]::result::Result<(), alloc[93e694a8365d93dd]::string::String>, fn() -> core[8c5ac2f034688f9a]::result::Result<(), alloc[93e694a8365d93dd]::string::String>><unknown>
  1523. 211.82 s > at <unknown source file>:<unknown line>
  1524. 211.82 s > 12: test[7974841f8dbd3561]::run_test::{closure#0}<unknown>
  1525. 211.82 s > at <unknown source file>:<unknown line>
  1526. 211.82 s > 13: std[5167731717db2e51]::sys::backtrace::__rust_begin_short_backtrace::<test[7974841f8dbd3561]::run_test::{closure#1}, ()><unknown>
  1527. 211.82 s > at <unknown source file>:<unknown line>
  1528. 211.82 s > 14: <std[5167731717db2e51]::thread::lifecycle::spawn_unchecked<test[7974841f8dbd3561]::run_test::{closure#1}, ()>::{closure#1} as core[8c5ac2f034688f9a]::ops::function::FnOnce<()>>::call_once::{shim:vtable#0}<unknown>
  1529. 211.82 s > at <unknown source file>:<unknown line>
  1530. 211.82 s > 15: <std[5167731717db2e51]::sys::thread::unix::Thread>::new::thread_start<unknown>
  1531. 211.82 s > at <unknown source file>:<unknown line>
  1532. 211.82 s > 16: start_thread<unknown>
  1533. 211.82 s > at <unknown source file>:<unknown line>
  1534. 211.82 s > 17: __clone3<unknown>
  1535. 211.82 s > at <unknown source file>:<unknown line>
  1536. 211.82 s >
  1537. 211.82 s > Run with COLORBT_SHOW_HIDDEN=1 environment variable to disable frame filtering.
  1538. 211.82 s > Run with RUST_BACKTRACE=full to include source snippets.
  1539. 211.82 s > Warning: SpanTrace capture is Unsupported.
  1540. 211.82 s > Ensure that you've setup a tracing-error ErrorLayer and the semver versions are compatible
  1541. 211.82 s >
  1542. 211.82 s > 3. gammaloop-integration-tests::test_runs::profile_bulk::dotted_bubble_amp_bulk_profile_passes
  1543. 211.82 s > failure: test failure with exit code 101
  1544. 211.82 s > Error:
  1545. 211.82 s > 0: IR profiling requested arbitrary precision but received a quad-precision result
  1546. 211.82 s >
  1547. 211.82 s > Location:
  1548. 211.82 s > crates/gammalooprs/src/integrands/process/ir.rs:2123
  1549. 211.82 s >
  1550. 211.82 s > ━━━━━━━━━━━━━━━━━━━━━━━━━━━━━━━━━━ BACKTRACE ━━━━━━━━━━━━━━━━━━━━━━━━━━━━━━━━━━━
  1551. 211.82 s > 1: <color_eyre[bb06c27fa12d52c3]::config::EyreHook>::into_eyre_hook::{closure#0}<unknown>
  1552. 211.82 s > at <unknown source file>:<unknown line>
  1553. 211.82 s > 2: eyre[9f660d63ab6a72c5]::capture_handler<unknown>
  1554. 211.82 s > at <unknown source file>:<unknown line>
  1555. 211.82 s > 3: eyre[9f660d63ab6a72c5]::private::format_err<unknown>
  1556. 211.82 s > at <unknown source file>:<unknown line>
  1557. 211.82 s > 4: gammalooprs[1b273202b0029755]::integrands::process::ir::evaluate_profile_momentum_point_arb::<gammalooprs[1b273202b0029755]::integrands::process::amplitude::AmplitudeIntegrand><unknown>
  1558. 211.82 s > at <unknown source file>:<unknown line>
  1559. 211.82 s > 5: <gammalooprs[1b273202b0029755]::integrands::process::amplitude::AmplitudeIntegrand>::test_single_ir_limit_impl<unknown>
  1560. 211.82 s > at <unknown source file>:<unknown line>
  1561. 211.82 s > 6: gammalooprs[1b273202b0029755]::integrands::process::ir::run_ir_profile::<gammalooprs[1b273202b0029755]::integrands::process::amplitude::AmplitudeIntegrand, <gammalooprs[1b273202b0029755]::integrands::process::amplitude::AmplitudeIntegrand>::enumerate_ir_limits, <gammalooprs[1b273202b0029755]::integrands::process::amplitude::AmplitudeIntegrand>::graph_cut_definitions, <gammalooprs[1b273202b0029755]::integrands::process::amplitude::AmplitudeIntegrand>::test_single_ir_limit_impl><unknown>
  1562. 211.82 s > at <unknown source file>:<unknown line>
  1563. 211.82 s > 7: <gammalooprs[1b273202b0029755]::integrands::process::amplitude::AmplitudeIntegrand>::test_ir<unknown>
  1564. 211.82 s > at <unknown source file>:<unknown line>
  1565. 211.82 s > 8: <gammaloop_api[9fdde70dfc7501ea]::commands::profile::Profile>::run<unknown>
  1566. 211.82 s > at <unknown source file>:<unknown line>
  1567. 211.82 s > 9: test_runs[928b8788563090d0]::profile_bulk::dotted_bubble_amp_bulk_profile_passes<unknown>
  1568. 211.82 s > at <unknown source file>:<unknown line>
  1569. 211.82 s > 10: <test_runs[928b8788563090d0]::profile_bulk::dotted_bubble_amp_bulk_profile_passes::{closure#0} as core[8c5ac2f034688f9a]::ops::function::FnOnce<()>>::call_once<unknown>
  1570. 211.82 s > at <unknown source file>:<unknown line>
  1571. 211.82 s > 11: test[7974841f8dbd3561]::__rust_begin_short_backtrace::<core[8c5ac2f034688f9a]::result::Result<(), alloc[93e694a8365d93dd]::string::String>, fn() -> core[8c5ac2f034688f9a]::result::Result<(), alloc[93e694a8365d93dd]::string::String>><unknown>
  1572. 211.82 s > at <unknown source file>:<unknown line>
  1573. 211.82 s > 12: test[7974841f8dbd3561]::run_test::{closure#0}<unknown>
  1574. 211.82 s > at <unknown source file>:<unknown line>
  1575. 211.82 s > 13: std[5167731717db2e51]::sys::backtrace::__rust_begin_short_backtrace::<test[7974841f8dbd3561]::run_test::{closure#1}, ()><unknown>
  1576. 211.82 s > at <unknown source file>:<unknown line>
  1577. 211.82 s > 14: <std[5167731717db2e51]::thread::lifecycle::spawn_unchecked<test[7974841f8dbd3561]::run_test::{closure#1}, ()>::{closure#1} as core[8c5ac2f034688f9a]::ops::function::FnOnce<()>>::call_once::{shim:vtable#0}<unknown>
  1578. 211.82 s > at <unknown source file>:<unknown line>
  1579. 211.82 s > 15: <std[5167731717db2e51]::sys::thread::unix::Thread>::new::thread_start<unknown>
  1580. 211.82 s > at <unknown source file>:<unknown line>
  1581. 211.82 s > 16: start_thread<unknown>
  1582. 211.82 s > at <unknown source file>:<unknown line>
  1583. 211.82 s > 17: __clone3<unknown>
  1584. 211.82 s > at <unknown source file>:<unknown line>
  1585. 211.82 s >
  1586. 211.82 s > Run with COLORBT_SHOW_HIDDEN=1 environment variable to disable frame filtering.
  1587. 211.82 s > Run with RUST_BACKTRACE=full to include source snippets.
  1588. 211.82 s > Warning: SpanTrace capture is Unsupported.
  1589. 211.82 s > Ensure that you've setup a tracing-error ErrorLayer and the semver versions are compatible
  1590. 211.82 s > system-out
  1591. 211.82 s > running 1 test
  1592. 211.82 s > test profile_bulk::dotted_bubble_amp_bulk_profile_passes ... FAILED
  1593. 211.82 s >
  1594. 211.82 s > failures:
  1595. 211.82 s >
  1596. 211.82 s > failures:
  1597. 211.82 s > profile_bulk::dotted_bubble_amp_bulk_profile_passes
  1598. 211.82 s >
  1599. 211.82 s > test result: FAILED. 0 passed; 1 failed; 0 ignored; 0 measured; 82 filtered out; finished in 0.30s
  1600. 211.82 s > system-err
  1601. 211.82 s > [2026-09-02 09:05:22.301] @gammaloop_api::se... INFO : Running command import model ./assets/models/json/scalars/scalars_2p_3p.json
  1602. 211.82 s > [2026-09-02 09:05:22.301] @import::model INFO : Loading JSON model scalars_2p_3p-default from /build/source/assets/models/json/scalars/scalars_2p_3p
  1603. 211.82 s > [2026-09-02 09:05:22.303] @gammaloop_api::se... INFO : Running command import graphs ./tests/resources/graphs/dotted_bubble_amp.dot
  1604. 211.82 s > [2026-09-02 09:05:22.303] @commands::import INFO : Loading graphs from '/build/source/tests/resources/graphs/dotted_bubble_amp.dot'
  1605. 211.82 s > [2026-09-02 09:05:22.308] @gammaloop_api::se... INFO : Running command generate
  1606. 211.82 s > [2026-09-02 09:05:22.411] @commands::generate INFO :
  1607. 211.82 s > Integrand generation summary
  1608. 211.82 s > peak RAM 62.93 MiB | cores 1
  1609. 211.82 s > ╭───────────┬───────────────────┬─────────┬────────────┬────────────┬────────────────┬─────────────╮
  1610. 211.82 s > │ integrand │ graph │ # evals │ expr build │ spenso │ symbolica eval │ compile │
  1611. 211.82 s > ├───────────┼───────────────────┼─────────┼────────────┼────────────┼────────────────┼─────────────┤
  1612. 211.82 s > │ default │ dotted_bubble_amp │ 8 │ 29ms (61%) │ 1ms (2.9%) │ 17ms (36%) │ 0ms (0.00%) │
  1613. 211.82 s > ├───────────┼───────────────────┼─────────┼────────────┼────────────┼────────────────┼─────────────┤
  1614. 211.82 s > │ Total │ │ 8 │ 29ms (61%) │ 1ms (2.9%) │ 17ms (36%) │ 0ms (0.00%) │
  1615. 211.82 s > ╰───────────┴───────────────────┴─────────┴────────────┴────────────┴────────────────┴─────────────╯
  1616. 211.82 s > [2026-09-02 09:05:22.413] @process::amplitude INFO : Input is above threshold: 1 existing threshold E-surfaces across 1/1 graph groups
  1617. 211.82 s > [2026-09-02 09:05:22.413] @process::amplitude INFO : overlap structure of group 0: [1: [1(1,3)]]
  1618. 211.82 s > Error:
  1619. 211.82 s > 0: IR profiling requested arbitrary precision but received a quad-precision result
  1620. 211.82 s >
  1621. 211.82 s > Location:
  1622. 211.82 s > crates/gammalooprs/src/integrands/process/ir.rs:2123
  1623. 211.82 s >
  1624. 211.82 s > ━━━━━━━━━━━━━━━━━━━━━━━━━━━━━━━━━━ BACKTRACE ━━━━━━━━━━━━━━━━━━━━━━━━━━━━━━━━━━━
  1625. 211.82 s > 1: <color_eyre[bb06c27fa12d52c3]::config::EyreHook>::into_eyre_hook::{closure#0}<unknown>
  1626. 211.82 s > at <unknown source file>:<unknown line>
  1627. 211.82 s > 2: eyre[9f660d63ab6a72c5]::capture_handler<unknown>
  1628. 211.82 s > at <unknown source file>:<unknown line>
  1629. 211.82 s > 3: eyre[9f660d63ab6a72c5]::private::format_err<unknown>
  1630. 211.82 s > at <unknown source file>:<unknown line>
  1631. 211.82 s > 4: gammalooprs[1b273202b0029755]::integrands::process::ir::evaluate_profile_momentum_point_arb::<gammalooprs[1b273202b0029755]::integrands::process::amplitude::AmplitudeIntegrand><unknown>
  1632. 211.82 s > at <unknown source file>:<unknown line>
  1633. 211.82 s > 5: <gammalooprs[1b273202b0029755]::integrands::process::amplitude::AmplitudeIntegrand>::test_single_ir_limit_impl<unknown>
  1634. 211.82 s > at <unknown source file>:<unknown line>
  1635. 211.82 s > 6: gammalooprs[1b273202b0029755]::integrands::process::ir::run_ir_profile::<gammalooprs[1b273202b0029755]::integrands::process::amplitude::AmplitudeIntegrand, <gammalooprs[1b273202b0029755]::integrands::process::amplitude::AmplitudeIntegrand>::enumerate_ir_limits, <gammalooprs[1b273202b0029755]::integrands::process::amplitude::AmplitudeIntegrand>::graph_cut_definitions, <gammalooprs[1b273202b0029755]::integrands::process::amplitude::AmplitudeIntegrand>::test_single_ir_limit_impl><unknown>
  1636. 211.82 s > at <unknown source file>:<unknown line>
  1637. 211.82 s > 7: <gammalooprs[1b273202b0029755]::integrands::process::amplitude::AmplitudeIntegrand>::test_ir<unknown>
  1638. 211.82 s > at <unknown source file>:<unknown line>
  1639. 211.82 s > 8: <gammaloop_api[9fdde70dfc7501ea]::commands::profile::Profile>::run<unknown>
  1640. 211.82 s > at <unknown source file>:<unknown line>
  1641. 211.82 s > 9: test_runs[928b8788563090d0]::profile_bulk::dotted_bubble_amp_bulk_profile_passes<unknown>
  1642. 211.82 s > at <unknown source file>:<unknown line>
  1643. 211.82 s > 10: <test_runs[928b8788563090d0]::profile_bulk::dotted_bubble_amp_bulk_profile_passes::{closure#0} as core[8c5ac2f034688f9a]::ops::function::FnOnce<()>>::call_once<unknown>
  1644. 211.82 s > at <unknown source file>:<unknown line>
  1645. 211.82 s > 11: test[7974841f8dbd3561]::__rust_begin_short_backtrace::<core[8c5ac2f034688f9a]::result::Result<(), alloc[93e694a8365d93dd]::string::String>, fn() -> core[8c5ac2f034688f9a]::result::Result<(), alloc[93e694a8365d93dd]::string::String>><unknown>
  1646. 211.82 s > at <unknown source file>:<unknown line>
  1647. 211.82 s > 12: test[7974841f8dbd3561]::run_test::{closure#0}<unknown>
  1648. 211.82 s > at <unknown source file>:<unknown line>
  1649. 211.82 s > 13: std[5167731717db2e51]::sys::backtrace::__rust_begin_short_backtrace::<test[7974841f8dbd3561]::run_test::{closure#1}, ()><unknown>
  1650. 211.82 s > at <unknown source file>:<unknown line>
  1651. 211.82 s > 14: <std[5167731717db2e51]::thread::lifecycle::spawn_unchecked<test[7974841f8dbd3561]::run_test::{closure#1}, ()>::{closure#1} as core[8c5ac2f034688f9a]::ops::function::FnOnce<()>>::call_once::{shim:vtable#0}<unknown>
  1652. 211.82 s > at <unknown source file>:<unknown line>
  1653. 211.82 s > 15: <std[5167731717db2e51]::sys::thread::unix::Thread>::new::thread_start<unknown>
  1654. 211.82 s > at <unknown source file>:<unknown line>
  1655. 211.82 s > 16: start_thread<unknown>
  1656. 211.82 s > at <unknown source file>:<unknown line>
  1657. 211.82 s > 17: __clone3<unknown>
  1658. 211.82 s > at <unknown source file>:<unknown line>
  1659. 211.82 s >
  1660. 211.82 s > Run with COLORBT_SHOW_HIDDEN=1 environment variable to disable frame filtering.
  1661. 211.82 s > Run with RUST_BACKTRACE=full to include source snippets.
  1662. 211.82 s > Warning: SpanTrace capture is Unsupported.
  1663. 211.82 s > Ensure that you've setup a tracing-error ErrorLayer and the semver versions are compatible
  1664. 211.82 s >
  1665. 211.82 s > 4. gammaloop-integration-tests::test_runs::profile_bulk::double_dotted_bubble_amp_bulk_profile_passes
  1666. 211.82 s > failure: test failure with exit code 101
  1667. 211.82 s > Error:
  1668. 211.82 s > 0: IR profiling requested arbitrary precision but received a quad-precision result
  1669. 211.82 s >
  1670. 211.82 s > Location:
  1671. 211.82 s > crates/gammalooprs/src/integrands/process/ir.rs:2123
  1672. 211.82 s >
  1673. 211.82 s > ━━━━━━━━━━━━━━━━━━━━━━━━━━━━━━━━━━ BACKTRACE ━━━━━━━━━━━━━━━━━━━━━━━━━━━━━━━━━━━
  1674. 211.82 s > 1: <color_eyre[bb06c27fa12d52c3]::config::EyreHook>::into_eyre_hook::{closure#0}<unknown>
  1675. 211.82 s > at <unknown source file>:<unknown line>
  1676. 211.82 s > 2: eyre[9f660d63ab6a72c5]::capture_handler<unknown>
  1677. 211.82 s > at <unknown source file>:<unknown line>
  1678. 211.82 s > 3: eyre[9f660d63ab6a72c5]::private::format_err<unknown>
  1679. 211.82 s > at <unknown source file>:<unknown line>
  1680. 211.82 s > 4: gammalooprs[1b273202b0029755]::integrands::process::ir::evaluate_profile_momentum_point_arb::<gammalooprs[1b273202b0029755]::integrands::process::amplitude::AmplitudeIntegrand><unknown>
  1681. 211.82 s > at <unknown source file>:<unknown line>
  1682. 211.82 s > 5: <gammalooprs[1b273202b0029755]::integrands::process::amplitude::AmplitudeIntegrand>::test_single_ir_limit_impl<unknown>
  1683. 211.82 s > at <unknown source file>:<unknown line>
  1684. 211.82 s > 6: gammalooprs[1b273202b0029755]::integrands::process::ir::run_ir_profile::<gammalooprs[1b273202b0029755]::integrands::process::amplitude::AmplitudeIntegrand, <gammalooprs[1b273202b0029755]::integrands::process::amplitude::AmplitudeIntegrand>::enumerate_ir_limits, <gammalooprs[1b273202b0029755]::integrands::process::amplitude::AmplitudeIntegrand>::graph_cut_definitions, <gammalooprs[1b273202b0029755]::integrands::process::amplitude::AmplitudeIntegrand>::test_single_ir_limit_impl><unknown>
  1685. 211.82 s > at <unknown source file>:<unknown line>
  1686. 211.82 s > 7: <gammalooprs[1b273202b0029755]::integrands::process::amplitude::AmplitudeIntegrand>::test_ir<unknown>
  1687. 211.82 s > at <unknown source file>:<unknown line>
  1688. 211.82 s > 8: <gammaloop_api[9fdde70dfc7501ea]::commands::profile::Profile>::run<unknown>
  1689. 211.82 s > at <unknown source file>:<unknown line>
  1690. 211.82 s > 9: test_runs[928b8788563090d0]::profile_bulk::double_dotted_bubble_amp_bulk_profile_passes<unknown>
  1691. 211.82 s > at <unknown source file>:<unknown line>
  1692. 211.82 s > 10: <test_runs[928b8788563090d0]::profile_bulk::double_dotted_bubble_amp_bulk_profile_passes::{closure#0} as core[8c5ac2f034688f9a]::ops::function::FnOnce<()>>::call_once<unknown>
  1693. 211.82 s > at <unknown source file>:<unknown line>
  1694. 211.82 s > 11: test[7974841f8dbd3561]::__rust_begin_short_backtrace::<core[8c5ac2f034688f9a]::result::Result<(), alloc[93e694a8365d93dd]::string::String>, fn() -> core[8c5ac2f034688f9a]::result::Result<(), alloc[93e694a8365d93dd]::string::String>><unknown>
  1695. 211.82 s > at <unknown source file>:<unknown line>
  1696. 211.82 s > 12: test[7974841f8dbd3561]::run_test::{closure#0}<unknown>
  1697. 211.82 s > at <unknown source file>:<unknown line>
  1698. 211.82 s > 13: std[5167731717db2e51]::sys::backtrace::__rust_begin_short_backtrace::<test[7974841f8dbd3561]::run_test::{closure#1}, ()><unknown>
  1699. 211.82 s > at <unknown source file>:<unknown line>
  1700. 211.82 s > 14: <std[5167731717db2e51]::thread::lifecycle::spawn_unchecked<test[7974841f8dbd3561]::run_test::{closure#1}, ()>::{closure#1} as core[8c5ac2f034688f9a]::ops::function::FnOnce<()>>::call_once::{shim:vtable#0}<unknown>
  1701. 211.82 s > at <unknown source file>:<unknown line>
  1702. 211.82 s > 15: <std[5167731717db2e51]::sys::thread::unix::Thread>::new::thread_start<unknown>
  1703. 211.82 s > at <unknown source file>:<unknown line>
  1704. 211.82 s > 16: start_thread<unknown>
  1705. 211.82 s > at <unknown source file>:<unknown line>
  1706. 211.82 s > 17: __clone3<unknown>
  1707. 211.82 s > at <unknown source file>:<unknown line>
  1708. 211.82 s >
  1709. 211.82 s > Run with COLORBT_SHOW_HIDDEN=1 environment variable to disable frame filtering.
  1710. 211.82 s > Run with RUST_BACKTRACE=full to include source snippets.
  1711. 211.82 s > Warning: SpanTrace capture is Unsupported.
  1712. 211.82 s > Ensure that you've setup a tracing-error ErrorLayer and the semver versions are compatible
  1713. 211.82 s > system-out
  1714. 211.82 s > running 1 test
  1715. 211.82 s > test profile_bulk::double_dotted_bubble_amp_bulk_profile_passes ... FAILED
  1716. 211.82 s >
  1717. 211.82 s > failures:
  1718. 211.82 s >
  1719. 211.82 s > failures:
  1720. 211.82 s > profile_bulk::double_dotted_bubble_amp_bulk_profile_passes
  1721. 211.82 s >
  1722. 211.82 s > test result: FAILED. 0 passed; 1 failed; 0 ignored; 0 measured; 82 filtered out; finished in 0.43s
  1723. 211.82 s > system-err
  1724. 211.82 s > [2026-09-02 09:05:22.510] @gammaloop_api::se... INFO : Running command import model ./assets/models/json/scalars/scalars_2p_3p.json
  1725. 211.82 s > [2026-09-02 09:05:22.510] @import::model INFO : Loading JSON model scalars_2p_3p-default from /build/source/assets/models/json/scalars/scalars_2p_3p
  1726. 211.82 s > [2026-09-02 09:05:22.511] @gammaloop_api::se... INFO : Running command import graphs ./tests/resources/graphs/double_dotted_bubble_amp.dot
  1727. 211.82 s > [2026-09-02 09:05:22.511] @commands::import INFO : Loading graphs from '/build/source/tests/resources/graphs/double_dotted_bubble_amp.dot'
  1728. 211.82 s > [2026-09-02 09:05:22.516] @gammaloop_api::se... INFO : Running command generate
  1729. 211.82 s > [2026-09-02 09:05:22.627] @commands::generate INFO :
  1730. 211.82 s > Integrand generation summary
  1731. 211.82 s > peak RAM 63.84 MiB | cores 1
  1732. 211.82 s > ╭───────────┬──────────────────────────┬─────────┬────────────┬────────────┬────────────────┬─────────────╮
  1733. 211.82 s > │ integrand │ graph │ # evals │ expr build │ spenso │ symbolica eval │ compile │
  1734. 211.82 s > ├───────────┼──────────────────────────┼─────────┼────────────┼────────────┼────────────────┼─────────────┤
  1735. 211.82 s > │ default │ double_dotted_bubble_amp │ 11 │ 40ms (56%) │ 2ms (3.9%) │ 28ms (40%) │ 0ms (0.00%) │
  1736. 211.82 s > ├───────────┼──────────────────────────┼─────────┼────────────┼────────────┼────────────────┼─────────────┤
  1737. 211.82 s > │ Total │ │ 11 │ 40ms (56%) │ 2ms (3.9%) │ 28ms (40%) │ 0ms (0.00%) │
  1738. 211.82 s > ╰───────────┴──────────────────────────┴─────────┴────────────┴────────────┴────────────────┴─────────────╯
  1739. 211.82 s > [2026-09-02 09:05:22.628] @process::amplitude INFO : Input is above threshold: 1 existing threshold E-surfaces across 1/1 graph groups
  1740. 211.82 s > [2026-09-02 09:05:22.629] @process::amplitude INFO : overlap structure of group 0: [1: [1(1,4)]]
  1741. 211.82 s > Error:
  1742. 211.82 s > 0: IR profiling requested arbitrary precision but received a quad-precision result
  1743. 211.82 s >
  1744. 211.82 s > Location:
  1745. 211.82 s > crates/gammalooprs/src/integrands/process/ir.rs:2123
  1746. 211.82 s >
  1747. 211.82 s > ━━━━━━━━━━━━━━━━━━━━━━━━━━━━━━━━━━ BACKTRACE ━━━━━━━━━━━━━━━━━━━━━━━━━━━━━━━━━━━
  1748. 211.82 s > 1: <color_eyre[bb06c27fa12d52c3]::config::EyreHook>::into_eyre_hook::{closure#0}<unknown>
  1749. 211.82 s > at <unknown source file>:<unknown line>
  1750. 211.82 s > 2: eyre[9f660d63ab6a72c5]::capture_handler<unknown>
  1751. 211.82 s > at <unknown source file>:<unknown line>
  1752. 211.82 s > 3: eyre[9f660d63ab6a72c5]::private::format_err<unknown>
  1753. 211.82 s > at <unknown source file>:<unknown line>
  1754. 211.82 s > 4: gammalooprs[1b273202b0029755]::integrands::process::ir::evaluate_profile_momentum_point_arb::<gammalooprs[1b273202b0029755]::integrands::process::amplitude::AmplitudeIntegrand><unknown>
  1755. 211.82 s > at <unknown source file>:<unknown line>
  1756. 211.82 s > 5: <gammalooprs[1b273202b0029755]::integrands::process::amplitude::AmplitudeIntegrand>::test_single_ir_limit_impl<unknown>
  1757. 211.82 s > at <unknown source file>:<unknown line>
  1758. 211.82 s > 6: gammalooprs[1b273202b0029755]::integrands::process::ir::run_ir_profile::<gammalooprs[1b273202b0029755]::integrands::process::amplitude::AmplitudeIntegrand, <gammalooprs[1b273202b0029755]::integrands::process::amplitude::AmplitudeIntegrand>::enumerate_ir_limits, <gammalooprs[1b273202b0029755]::integrands::process::amplitude::AmplitudeIntegrand>::graph_cut_definitions, <gammalooprs[1b273202b0029755]::integrands::process::amplitude::AmplitudeIntegrand>::test_single_ir_limit_impl><unknown>
  1759. 211.82 s > at <unknown source file>:<unknown line>
  1760. 211.82 s > 7: <gammalooprs[1b273202b0029755]::integrands::process::amplitude::AmplitudeIntegrand>::test_ir<unknown>
  1761. 211.82 s > at <unknown source file>:<unknown line>
  1762. 211.82 s > 8: <gammaloop_api[9fdde70dfc7501ea]::commands::profile::Profile>::run<unknown>
  1763. 211.82 s > at <unknown source file>:<unknown line>
  1764. 211.82 s > 9: test_runs[928b8788563090d0]::profile_bulk::double_dotted_bubble_amp_bulk_profile_passes<unknown>
  1765. 211.82 s > at <unknown source file>:<unknown line>
  1766. 211.82 s > 10: <test_runs[928b8788563090d0]::profile_bulk::double_dotted_bubble_amp_bulk_profile_passes::{closure#0} as core[8c5ac2f034688f9a]::ops::function::FnOnce<()>>::call_once<unknown>
  1767. 211.82 s > at <unknown source file>:<unknown line>
  1768. 211.82 s > 11: test[7974841f8dbd3561]::__rust_begin_short_backtrace::<core[8c5ac2f034688f9a]::result::Result<(), alloc[93e694a8365d93dd]::string::String>, fn() -> core[8c5ac2f034688f9a]::result::Result<(), alloc[93e694a8365d93dd]::string::String>><unknown>
  1769. 211.82 s > at <unknown source file>:<unknown line>
  1770. 211.82 s > 12: test[7974841f8dbd3561]::run_test::{closure#0}<unknown>
  1771. 211.82 s > at <unknown source file>:<unknown line>
  1772. 211.82 s > 13: std[5167731717db2e51]::sys::backtrace::__rust_begin_short_backtrace::<test[7974841f8dbd3561]::run_test::{closure#1}, ()><unknown>
  1773. 211.82 s > at <unknown source file>:<unknown line>
  1774. 211.82 s > 14: <std[5167731717db2e51]::thread::lifecycle::spawn_unchecked<test[7974841f8dbd3561]::run_test::{closure#1}, ()>::{closure#1} as core[8c5ac2f034688f9a]::ops::function::FnOnce<()>>::call_once::{shim:vtable#0}<unknown>
  1775. 211.82 s > at <unknown source file>:<unknown line>
  1776. 211.82 s > 15: <std[5167731717db2e51]::sys::thread::unix::Thread>::new::thread_start<unknown>
  1777. 211.82 s > at <unknown source file>:<unknown line>
  1778. 211.82 s > 16: start_thread<unknown>
  1779. 211.82 s > at <unknown source file>:<unknown line>
  1780. 211.82 s > 17: __clone3<unknown>
  1781. 211.82 s > at <unknown source file>:<unknown line>
  1782. 211.82 s >
  1783. 211.82 s > Run with COLORBT_SHOW_HIDDEN=1 environment variable to disable frame filtering.
  1784. 211.82 s > Run with RUST_BACKTRACE=full to include source snippets.
  1785. 211.82 s > Warning: SpanTrace capture is Unsupported.
  1786. 211.82 s > Ensure that you've setup a tracing-error ErrorLayer and the semver versions are compatible
  1787. 211.82 s >
  1788. 211.82 s > 5. gammaloop-integration-tests::test_runs::profile_bulk::scalar_self_energy_amp_bulk_profile_passes
  1789. 211.82 s > failure: test failure with exit code 101
  1790. 211.82 s > Error:
  1791. 211.82 s > 0: IR profiling requested arbitrary precision but received a quad-precision result
  1792. 211.82 s >
  1793. 211.82 s > Location:
  1794. 211.82 s > crates/gammalooprs/src/integrands/process/ir.rs:2123
  1795. 211.82 s >
  1796. 211.82 s > ━━━━━━━━━━━━━━━━━━━━━━━━━━━━━━━━━━ BACKTRACE ━━━━━━━━━━━━━━━━━━━━━━━━━━━━━━━━━━━
  1797. 211.82 s > 1: <color_eyre[bb06c27fa12d52c3]::config::EyreHook>::into_eyre_hook::{closure#0}<unknown>
  1798. 211.82 s > at <unknown source file>:<unknown line>
  1799. 211.82 s > 2: eyre[9f660d63ab6a72c5]::capture_handler<unknown>
  1800. 211.82 s > at <unknown source file>:<unknown line>
  1801. 211.82 s > 3: eyre[9f660d63ab6a72c5]::private::format_err<unknown>
  1802. 211.82 s > at <unknown source file>:<unknown line>
  1803. 211.82 s > 4: gammalooprs[1b273202b0029755]::integrands::process::ir::evaluate_profile_momentum_point_arb::<gammalooprs[1b273202b0029755]::integrands::process::amplitude::AmplitudeIntegrand><unknown>
  1804. 211.82 s > at <unknown source file>:<unknown line>
  1805. 211.82 s > 5: <gammalooprs[1b273202b0029755]::integrands::process::amplitude::AmplitudeIntegrand>::test_single_ir_limit_impl<unknown>
  1806. 211.82 s > at <unknown source file>:<unknown line>
  1807. 211.82 s > 6: gammalooprs[1b273202b0029755]::integrands::process::ir::run_ir_profile::<gammalooprs[1b273202b0029755]::integrands::process::amplitude::AmplitudeIntegrand, <gammalooprs[1b273202b0029755]::integrands::process::amplitude::AmplitudeIntegrand>::enumerate_ir_limits, <gammalooprs[1b273202b0029755]::integrands::process::amplitude::AmplitudeIntegrand>::graph_cut_definitions, <gammalooprs[1b273202b0029755]::integrands::process::amplitude::AmplitudeIntegrand>::test_single_ir_limit_impl><unknown>
  1808. 211.82 s > at <unknown source file>:<unknown line>
  1809. 211.82 s > 7: <gammalooprs[1b273202b0029755]::integrands::process::amplitude::AmplitudeIntegrand>::test_ir<unknown>
  1810. 211.82 s > at <unknown source file>:<unknown line>
  1811. 211.82 s > 8: <gammaloop_api[9fdde70dfc7501ea]::commands::profile::Profile>::run<unknown>
  1812. 211.82 s > at <unknown source file>:<unknown line>
  1813. 211.82 s > 9: test_runs[928b8788563090d0]::profile_bulk::scalar_self_energy_amp_bulk_profile_passes<unknown>
  1814. 211.82 s > at <unknown source file>:<unknown line>
  1815. 211.82 s > 10: <test_runs[928b8788563090d0]::profile_bulk::scalar_self_energy_amp_bulk_profile_passes::{closure#0} as core[8c5ac2f034688f9a]::ops::function::FnOnce<()>>::call_once<unknown>
  1816. 211.82 s > at <unknown source file>:<unknown line>
  1817. 211.82 s > 11: test[7974841f8dbd3561]::__rust_begin_short_backtrace::<core[8c5ac2f034688f9a]::result::Result<(), alloc[93e694a8365d93dd]::string::String>, fn() -> core[8c5ac2f034688f9a]::result::Result<(), alloc[93e694a8365d93dd]::string::String>><unknown>
  1818. 211.82 s > at <unknown source file>:<unknown line>
  1819. 211.82 s > 12: test[7974841f8dbd3561]::run_test::{closure#0}<unknown>
  1820. 211.82 s > at <unknown source file>:<unknown line>
  1821. 211.82 s > 13: std[5167731717db2e51]::sys::backtrace::__rust_begin_short_backtrace::<test[7974841f8dbd3561]::run_test::{closure#1}, ()><unknown>
  1822. 211.82 s > at <unknown source file>:<unknown line>
  1823. 211.82 s > 14: <std[5167731717db2e51]::thread::lifecycle::spawn_unchecked<test[7974841f8dbd3561]::run_test::{closure#1}, ()>::{closure#1} as core[8c5ac2f034688f9a]::ops::function::FnOnce<()>>::call_once::{shim:vtable#0}<unknown>
  1824. 211.82 s > at <unknown source file>:<unknown line>
  1825. 211.82 s > 15: <std[5167731717db2e51]::sys::thread::unix::Thread>::new::thread_start<unknown>
  1826. 211.82 s > at <unknown source file>:<unknown line>
  1827. 211.82 s > 16: start_thread<unknown>
  1828. 211.82 s > at <unknown source file>:<unknown line>
  1829. 211.82 s > 17: __clone3<unknown>
  1830. 211.82 s > at <unknown source file>:<unknown line>
  1831. 211.82 s >
  1832. 211.82 s > Run with COLORBT_SHOW_HIDDEN=1 environment variable to disable frame filtering.
  1833. 211.82 s > Run with RUST_BACKTRACE=full to include source snippets.
  1834. 211.82 s > Warning: SpanTrace capture is Unsupported.
  1835. 211.82 s > Ensure that you've setup a tracing-error ErrorLayer and the semver versions are compatible
  1836. 211.82 s > system-out
  1837. 211.82 s > running 1 test
  1838. 211.82 s > test profile_bulk::scalar_self_energy_amp_bulk_profile_passes ... FAILED
  1839. 211.82 s >
  1840. 211.82 s > failures:
  1841. 211.82 s >
  1842. 211.82 s > failures:
  1843. 211.82 s > profile_bulk::scalar_self_energy_amp_bulk_profile_passes
  1844. 211.82 s >
  1845. 211.82 s > test result: FAILED. 0 passed; 1 failed; 0 ignored; 0 measured; 82 filtered out; finished in 1.02s
  1846. 211.82 s > system-err
  1847. 211.82 s > [2026-09-02 09:05:22.831] @gammaloop_api::se... INFO : Running command import model ./assets/models/json/scalars/scalars.json
  1848. 211.82 s > [2026-09-02 09:05:22.831] @import::model INFO : Loading JSON model scalars-default from /build/source/assets/models/json/scalars/scalars
  1849. 211.82 s > [2026-09-02 09:05:22.837] @gammalooprs::model INFO : The following 2 external parameters were forced to zero by the restriction card:
  1850. 211.82 s > width_scalar_1, width_scalar_2
  1851. 211.82 s > [2026-09-02 09:05:22.838] @gammaloop_api::se... INFO : Running command import graphs ./tests/resources/graphs/scalar_self_energy_amp.dot
  1852. 211.82 s > [2026-09-02 09:05:22.838] @commands::import INFO : Loading graphs from '/build/source/tests/resources/graphs/scalar_self_energy_amp.dot'
  1853. 211.82 s > [2026-09-02 09:05:22.845] @gammaloop_api::se... INFO : Running command generate
  1854. 211.82 s > [2026-09-02 09:05:23.445] @commands::generate INFO :
  1855. 211.82 s > Integrand generation summary
  1856. 211.82 s > peak RAM 71.12 MiB | cores 1
  1857. 211.82 s > ╭───────────┬────────────────────────┬─────────┬─────────────┬────────────┬────────────────┬─────────────╮
  1858. 211.82 s > │ integrand │ graph │ # evals │ expr build │ spenso │ symbolica eval │ compile │
  1859. 211.82 s > ├───────────┼────────────────────────┼─────────┼─────────────┼────────────┼────────────────┼─────────────┤
  1860. 211.82 s > │ default │ scalar_self_energy_amp │ 6 │ 506ms (95%) │ 9ms (1.9%) │ 14ms (2.8%) │ 0ms (0.00%) │
  1861. 211.82 s > ├───────────┼────────────────────────┼─────────┼─────────────┼────────────┼────────────────┼─────────────┤
  1862. 211.82 s > │ Total │ │ 6 │ 506ms (95%) │ 9ms (1.9%) │ 14ms (2.8%) │ 0ms (0.00%) │
  1863. 211.82 s > ╰───────────┴────────────────────────┴─────────┴─────────────┴────────────┴────────────────┴─────────────╯
  1864. 211.82 s > [2026-09-02 09:05:23.447] @process::amplitude INFO : Input is above threshold: 2 existing threshold E-surfaces across 1/1 graph groups
  1865. 211.82 s > [2026-09-02 09:05:23.447] @process::amplitude INFO : overlap structure of group 0: [2: [2(1,5), 4(2,3,5)]]
  1866. 211.82 s > Error:
  1867. 211.82 s > 0: IR profiling requested arbitrary precision but received a quad-precision result
  1868. 211.82 s >
  1869. 211.82 s > Location:
  1870. 211.82 s > crates/gammalooprs/src/integrands/process/ir.rs:2123
  1871. 211.82 s >
  1872. 211.82 s > ━━━━━━━━━━━━━━━━━━━━━━━━━━━━━━━━━━ BACKTRACE ━━━━━━━━━━━━━━━━━━━━━━━━━━━━━━━━━━━
  1873. 211.82 s > 1: <color_eyre[bb06c27fa12d52c3]::config::EyreHook>::into_eyre_hook::{closure#0}<unknown>
  1874. 211.82 s > at <unknown source file>:<unknown line>
  1875. 211.82 s > 2: eyre[9f660d63ab6a72c5]::capture_handler<unknown>
  1876. 211.82 s > at <unknown source file>:<unknown line>
  1877. 211.82 s > 3: eyre[9f660d63ab6a72c5]::private::format_err<unknown>
  1878. 211.82 s > at <unknown source file>:<unknown line>
  1879. 211.82 s > 4: gammalooprs[1b273202b0029755]::integrands::process::ir::evaluate_profile_momentum_point_arb::<gammalooprs[1b273202b0029755]::integrands::process::amplitude::AmplitudeIntegrand><unknown>
  1880. 211.82 s > at <unknown source file>:<unknown line>
  1881. 211.82 s > 5: <gammalooprs[1b273202b0029755]::integrands::process::amplitude::AmplitudeIntegrand>::test_single_ir_limit_impl<unknown>
  1882. 211.82 s > at <unknown source file>:<unknown line>
  1883. 211.82 s > 6: gammalooprs[1b273202b0029755]::integrands::process::ir::run_ir_profile::<gammalooprs[1b273202b0029755]::integrands::process::amplitude::AmplitudeIntegrand, <gammalooprs[1b273202b0029755]::integrands::process::amplitude::AmplitudeIntegrand>::enumerate_ir_limits, <gammalooprs[1b273202b0029755]::integrands::process::amplitude::AmplitudeIntegrand>::graph_cut_definitions, <gammalooprs[1b273202b0029755]::integrands::process::amplitude::AmplitudeIntegrand>::test_single_ir_limit_impl><unknown>
  1884. 211.82 s > at <unknown source file>:<unknown line>
  1885. 211.82 s > 7: <gammalooprs[1b273202b0029755]::integrands::process::amplitude::AmplitudeIntegrand>::test_ir<unknown>
  1886. 211.82 s > at <unknown source file>:<unknown line>
  1887. 211.82 s > 8: <gammaloop_api[9fdde70dfc7501ea]::commands::profile::Profile>::run<unknown>
  1888. 211.82 s > at <unknown source file>:<unknown line>
  1889. 211.82 s > 9: test_runs[928b8788563090d0]::profile_bulk::scalar_self_energy_amp_bulk_profile_passes<unknown>
  1890. 211.82 s > at <unknown source file>:<unknown line>
  1891. 211.82 s > 10: <test_runs[928b8788563090d0]::profile_bulk::scalar_self_energy_amp_bulk_profile_passes::{closure#0} as core[8c5ac2f034688f9a]::ops::function::FnOnce<()>>::call_once<unknown>
  1892. 211.82 s > at <unknown source file>:<unknown line>
  1893. 211.82 s > 11: test[7974841f8dbd3561]::__rust_begin_short_backtrace::<core[8c5ac2f034688f9a]::result::Result<(), alloc[93e694a8365d93dd]::string::String>, fn() -> core[8c5ac2f034688f9a]::result::Result<(), alloc[93e694a8365d93dd]::string::String>><unknown>
  1894. 211.82 s > at <unknown source file>:<unknown line>
  1895. 211.82 s > 12: test[7974841f8dbd3561]::run_test::{closure#0}<unknown>
  1896. 211.82 s > at <unknown source file>:<unknown line>
  1897. 211.82 s > 13: std[5167731717db2e51]::sys::backtrace::__rust_begin_short_backtrace::<test[7974841f8dbd3561]::run_test::{closure#1}, ()><unknown>
  1898. 211.82 s > at <unknown source file>:<unknown line>
  1899. 211.82 s > 14: <std[5167731717db2e51]::thread::lifecycle::spawn_unchecked<test[7974841f8dbd3561]::run_test::{closure#1}, ()>::{closure#1} as core[8c5ac2f034688f9a]::ops::function::FnOnce<()>>::call_once::{shim:vtable#0}<unknown>
  1900. 211.82 s > at <unknown source file>:<unknown line>
  1901. 211.82 s > 15: <std[5167731717db2e51]::sys::thread::unix::Thread>::new::thread_start<unknown>
  1902. 211.82 s > at <unknown source file>:<unknown line>
  1903. 211.82 s > 16: start_thread<unknown>
  1904. 211.82 s > at <unknown source file>:<unknown line>
  1905. 211.82 s > 17: __clone3<unknown>
  1906. 211.82 s > at <unknown source file>:<unknown line>
  1907. 211.82 s >
  1908. 211.82 s > Run with COLORBT_SHOW_HIDDEN=1 environment variable to disable frame filtering.
  1909. 211.82 s > Run with RUST_BACKTRACE=full to include source snippets.
  1910. 211.82 s > Warning: SpanTrace capture is Unsupported.
  1911. 211.82 s > Ensure that you've setup a tracing-error ErrorLayer and the semver versions are compatible
  1912. 211.82 s >
  1913. 211.82 s > 6. gammaloop-integration-tests::test_runs::profile_bulk::massless_triangle_bulk_profile_passes
  1914. 211.82 s > failure: test failure with exit code 101
  1915. 211.82 s > Error:
  1916. 211.82 s > 0: IR profiling requested arbitrary precision but received a quad-precision result
  1917. 211.82 s >
  1918. 211.82 s > Location:
  1919. 211.82 s > crates/gammalooprs/src/integrands/process/ir.rs:2123
  1920. 211.82 s >
  1921. 211.82 s > ━━━━━━━━━━━━━━━━━━━━━━━━━━━━━━━━━━ BACKTRACE ━━━━━━━━━━━━━━━━━━━━━━━━━━━━━━━━━━━
  1922. 211.82 s > 1: <color_eyre[bb06c27fa12d52c3]::config::EyreHook>::into_eyre_hook::{closure#0}<unknown>
  1923. 211.82 s > at <unknown source file>:<unknown line>
  1924. 211.82 s > 2: eyre[9f660d63ab6a72c5]::capture_handler<unknown>
  1925. 211.82 s > at <unknown source file>:<unknown line>
  1926. 211.82 s > 3: eyre[9f660d63ab6a72c5]::private::format_err<unknown>
  1927. 211.82 s > at <unknown source file>:<unknown line>
  1928. 211.82 s > 4: gammalooprs[1b273202b0029755]::integrands::process::ir::evaluate_profile_momentum_point_arb::<gammalooprs[1b273202b0029755]::integrands::process::amplitude::AmplitudeIntegrand><unknown>
  1929. 211.82 s > at <unknown source file>:<unknown line>
  1930. 211.82 s > 5: <gammalooprs[1b273202b0029755]::integrands::process::amplitude::AmplitudeIntegrand>::test_single_ir_limit_impl<unknown>
  1931. 211.82 s > at <unknown source file>:<unknown line>
  1932. 211.82 s > 6: gammalooprs[1b273202b0029755]::integrands::process::ir::run_ir_profile::<gammalooprs[1b273202b0029755]::integrands::process::amplitude::AmplitudeIntegrand, <gammalooprs[1b273202b0029755]::integrands::process::amplitude::AmplitudeIntegrand>::enumerate_ir_limits, <gammalooprs[1b273202b0029755]::integrands::process::amplitude::AmplitudeIntegrand>::graph_cut_definitions, <gammalooprs[1b273202b0029755]::integrands::process::amplitude::AmplitudeIntegrand>::test_single_ir_limit_impl><unknown>
  1933. 211.82 s > at <unknown source file>:<unknown line>
  1934. 211.82 s > 7: <gammalooprs[1b273202b0029755]::integrands::process::amplitude::AmplitudeIntegrand>::test_ir<unknown>
  1935. 211.82 s > at <unknown source file>:<unknown line>
  1936. 211.82 s > 8: <gammaloop_api[9fdde70dfc7501ea]::commands::profile::Profile>::run<unknown>
  1937. 211.82 s > at <unknown source file>:<unknown line>
  1938. 211.82 s > 9: test_runs[928b8788563090d0]::profile_bulk::massless_triangle_bulk_profile_passes<unknown>
  1939. 211.82 s > at <unknown source file>:<unknown line>
  1940. 211.82 s > 10: <test_runs[928b8788563090d0]::profile_bulk::massless_triangle_bulk_profile_passes::{closure#0} as core[8c5ac2f034688f9a]::ops::function::FnOnce<()>>::call_once<unknown>
  1941. 211.82 s > at <unknown source file>:<unknown line>
  1942. 211.82 s > 11: test[7974841f8dbd3561]::__rust_begin_short_backtrace::<core[8c5ac2f034688f9a]::result::Result<(), alloc[93e694a8365d93dd]::string::String>, fn() -> core[8c5ac2f034688f9a]::result::Result<(), alloc[93e694a8365d93dd]::string::String>><unknown>
  1943. 211.82 s > at <unknown source file>:<unknown line>
  1944. 211.82 s > 12: test[7974841f8dbd3561]::run_test::{closure#0}<unknown>
  1945. 211.82 s > at <unknown source file>:<unknown line>
  1946. 211.82 s > 13: std[5167731717db2e51]::sys::backtrace::__rust_begin_short_backtrace::<test[7974841f8dbd3561]::run_test::{closure#1}, ()><unknown>
  1947. 211.82 s > at <unknown source file>:<unknown line>
  1948. 211.82 s > 14: <std[5167731717db2e51]::thread::lifecycle::spawn_unchecked<test[7974841f8dbd3561]::run_test::{closure#1}, ()>::{closure#1} as core[8c5ac2f034688f9a]::ops::function::FnOnce<()>>::call_once::{shim:vtable#0}<unknown>
  1949. 211.82 s > at <unknown source file>:<unknown line>
  1950. 211.82 s > 15: <std[5167731717db2e51]::sys::thread::unix::Thread>::new::thread_start<unknown>
  1951. 211.82 s > at <unknown source file>:<unknown line>
  1952. 211.82 s > 16: start_thread<unknown>
  1953. 211.82 s > at <unknown source file>:<unknown line>
  1954. 211.82 s > 17: __clone3<unknown>
  1955. 211.82 s > at <unknown source file>:<unknown line>
  1956. 211.82 s >
  1957. 211.82 s > Run with COLORBT_SHOW_HIDDEN=1 environment variable to disable frame filtering.
  1958. 211.82 s > Run with RUST_BACKTRACE=full to include source snippets.
  1959. 211.82 s > Warning: SpanTrace capture is Unsupported.
  1960. 211.82 s > Ensure that you've setup a tracing-error ErrorLayer and the semver versions are compatible
  1961. 211.82 s > system-out
  1962. 211.82 s > running 1 test
  1963. 211.82 s > test profile_bulk::massless_triangle_bulk_profile_passes ... FAILED
  1964. 211.82 s >
  1965. 211.82 s > failures:
  1966. 211.82 s >
  1967. 211.82 s > failures:
  1968. 211.82 s > profile_bulk::massless_triangle_bulk_profile_passes
  1969. 211.82 s >
  1970. 211.82 s > test result: FAILED. 0 passed; 1 failed; 0 ignored; 0 measured; 82 filtered out; finished in 1.99s
  1971. 211.82 s > system-err
  1972. 211.82 s > [2026-09-02 09:05:23.733] @gammaloop_api::se... INFO : Running command import model scalars
  1973. 211.82 s > [2026-09-02 09:05:23.733] @import::model INFO : Loading built-in JSON model scalars-default
  1974. 211.82 s > [2026-09-02 09:05:23.742] @gammalooprs::model INFO : The following 2 external parameters were forced to zero by the restriction card:
  1975. 211.82 s > width_scalar_1, width_scalar_2
  1976. 211.82 s > [2026-09-02 09:05:23.743] @gammaloop_api::se... INFO : Running command import graphs ./tests/resources/graphs/massless_triangle.dot
  1977. 211.82 s > [2026-09-02 09:05:23.743] @commands::import INFO : Loading graphs from '/build/source/tests/resources/graphs/massless_triangle.dot'
  1978. 211.82 s > [2026-09-02 09:05:23.756] @gammaloop_api::se... INFO : Running command generate
  1979. 211.82 s > [2026-09-02 09:05:24.306] @commands::generate INFO :
  1980. 211.82 s > Integrand generation summary
  1981. 211.82 s > peak RAM 67.21 MiB | cores 1
  1982. 211.82 s > ╭───────────┬─────────────────────┬─────────┬─────────────┬─────────────┬────────────────┬─────────────╮
  1983. 211.82 s > │ integrand │ graph │ # evals │ expr build │ spenso │ symbolica eval │ compile │
  1984. 211.82 s > ├───────────┼─────────────────────┼─────────┼─────────────┼─────────────┼────────────────┼─────────────┤
  1985. 211.82 s > │ default │ massless_triangle_0 │ 9 │ 339ms (80%) │ 4ms (0.98%) │ 83ms (19%) │ 0ms (0.00%) │
  1986. 211.82 s > ├───────────┼─────────────────────┼─────────┼─────────────┼─────────────┼────────────────┼─────────────┤
  1987. 211.82 s > │ Total │ │ 9 │ 339ms (80%) │ 4ms (0.98%) │ 83ms (19%) │ 0ms (0.00%) │
  1988. 211.82 s > ╰───────────┴─────────────────────┴─────────┴─────────────┴─────────────┴────────────────┴─────────────╯
  1989. 211.82 s > [2026-09-02 09:05:24.308] @process::amplitude INFO : Input is above threshold: 2 existing threshold E-surfaces across 1/1 graph groups
  1990. 211.82 s > [2026-09-02 09:05:24.308] @process::amplitude INFO : overlap structure of group 0: [2: [0(1,5), 1(1,3)]]
  1991. 211.82 s > Error:
  1992. 211.82 s > 0: IR profiling requested arbitrary precision but received a quad-precision result
  1993. 211.82 s >
  1994. 211.82 s > Location:
  1995. 211.82 s > crates/gammalooprs/src/integrands/process/ir.rs:2123
  1996. 211.82 s >
  1997. 211.82 s > ━━━━━━━━━━━━━━━━━━━━━━━━━━━━━━━━━━ BACKTRACE ━━━━━━━━━━━━━━━━━━━━━━━━━━━━━━━━━━━
  1998. 211.83 s > 1: <color_eyre[bb06c27fa12d52c3]::config::EyreHook>::into_eyre_hook::{closure#0}<unknown>
  1999. 211.83 s > at <unknown source file>:<unknown line>
  2000. 211.83 s > 2: eyre[9f660d63ab6a72c5]::capture_handler<unknown>
  2001. 211.83 s > at <unknown source file>:<unknown line>
  2002. 211.83 s > 3: eyre[9f660d63ab6a72c5]::private::format_err<unknown>
  2003. 211.83 s > at <unknown source file>:<unknown line>
  2004. 211.83 s > 4: gammalooprs[1b273202b0029755]::integrands::process::ir::evaluate_profile_momentum_point_arb::<gammalooprs[1b273202b0029755]::integrands::process::amplitude::AmplitudeIntegrand><unknown>
  2005. 211.83 s > at <unknown source file>:<unknown line>
  2006. 211.83 s > 5: <gammalooprs[1b273202b0029755]::integrands::process::amplitude::AmplitudeIntegrand>::test_single_ir_limit_impl<unknown>
  2007. 211.83 s > at <unknown source file>:<unknown line>
  2008. 211.83 s > 6: gammalooprs[1b273202b0029755]::integrands::process::ir::run_ir_profile::<gammalooprs[1b273202b0029755]::integrands::process::amplitude::AmplitudeIntegrand, <gammalooprs[1b273202b0029755]::integrands::process::amplitude::AmplitudeIntegrand>::enumerate_ir_limits, <gammalooprs[1b273202b0029755]::integrands::process::amplitude::AmplitudeIntegrand>::graph_cut_definitions, <gammalooprs[1b273202b0029755]::integrands::process::amplitude::AmplitudeIntegrand>::test_single_ir_limit_impl><unknown>
  2009. 211.83 s > at <unknown source file>:<unknown line>
  2010. 211.83 s > 7: <gammalooprs[1b273202b0029755]::integrands::process::amplitude::AmplitudeIntegrand>::test_ir<unknown>
  2011. 211.83 s > at <unknown source file>:<unknown line>
  2012. 211.83 s > 8: <gammaloop_api[9fdde70dfc7501ea]::commands::profile::Profile>::run<unknown>
  2013. 211.83 s > at <unknown source file>:<unknown line>
  2014. 211.83 s > 9: test_runs[928b8788563090d0]::profile_bulk::massless_triangle_bulk_profile_passes<unknown>
  2015. 211.83 s > at <unknown source file>:<unknown line>
  2016. 211.83 s > 10: <test_runs[928b8788563090d0]::profile_bulk::massless_triangle_bulk_profile_passes::{closure#0} as core[8c5ac2f034688f9a]::ops::function::FnOnce<()>>::call_once<unknown>
  2017. 211.83 s > at <unknown source file>:<unknown line>
  2018. 211.83 s > 11: test[7974841f8dbd3561]::__rust_begin_short_backtrace::<core[8c5ac2f034688f9a]::result::Result<(), alloc[93e694a8365d93dd]::string::String>, fn() -> core[8c5ac2f034688f9a]::result::Result<(), alloc[93e694a8365d93dd]::string::String>><unknown>
  2019. 211.83 s > at <unknown source file>:<unknown line>
  2020. 211.83 s > 12: test[7974841f8dbd3561]::run_test::{closure#0}<unknown>
  2021. 211.83 s > at <unknown source file>:<unknown line>
  2022. 211.83 s > 13: std[5167731717db2e51]::sys::backtrace::__rust_begin_short_backtrace::<test[7974841f8dbd3561]::run_test::{closure#1}, ()><unknown>
  2023. 211.83 s > at <unknown source file>:<unknown line>
  2024. 211.83 s > 14: <std[5167731717db2e51]::thread::lifecycle::spawn_unchecked<test[7974841f8dbd3561]::run_test::{closure#1}, ()>::{closure#1} as core[8c5ac2f034688f9a]::ops::function::FnOnce<()>>::call_once::{shim:vtable#0}<unknown>
  2025. 211.83 s > at <unknown source file>:<unknown line>
  2026. 211.83 s > 15: <std[5167731717db2e51]::sys::thread::unix::Thread>::new::thread_start<unknown>
  2027. 211.83 s > at <unknown source file>:<unknown line>
  2028. 211.83 s > 16: start_thread<unknown>
  2029. 211.83 s > at <unknown source file>:<unknown line>
  2030. 211.83 s > 17: __clone3<unknown>
  2031. 211.83 s > at <unknown source file>:<unknown line>
  2032. 211.83 s >
  2033. 211.83 s > Run with COLORBT_SHOW_HIDDEN=1 environment variable to disable frame filtering.
  2034. 211.83 s > Run with RUST_BACKTRACE=full to include source snippets.
  2035. 211.83 s > Warning: SpanTrace capture is Unsupported.
  2036. 211.83 s > Ensure that you've setup a tracing-error ErrorLayer and the semver versions are compatible
  2037. 211.83 s >
  2038. 211.83 s > 7. gammaloop-integration-tests::uv::dod2_bubble_uv
  2039. 211.83 s > failure: test failure with exit code 101
  2040. 211.83 s > system-out
  2041. 211.83 s > running 1 test
  2042. 211.83 s > test dod2_bubble_uv has been running for over 60 seconds
  2043. 211.83 s > +-------------+-----------------+---------+--------+----------+-----------------------------------------------------------------------------------------------------------------------+-------+
  2044. 211.83 s > | case | check | graph | status | sigma | threshold | error |
  2045. 211.83 s > +-------------+-----------------+---------+--------+----------+-----------------------------------------------------------------------------------------------------------------------+-------+
  2046. 211.83 s > | dod2_bubble | uv_profile | - | FAIL | - | - | - |
  2047. 211.83 s > +-------------+-----------------+---------+--------+----------+-----------------------------------------------------------------------------------------------------------------------+-------+
  2048. 211.83 s > | dod2_bubble | m_uv.inspect | inspect | pass | - | best inspect relative delta 1.000e0 >= 1000*accuracy 1.000e-7 (accuracy=1.000e-10, exponent=+8.0, seed=0, probes=10) | - |
  2049. 211.83 s > +-------------+-----------------+---------+--------+----------+-----------------------------------------------------------------------------------------------------------------------+-------+
  2050. 211.83 s > | dod2_bubble | m_uv.integrated | GL0 | pass | 0.0sigma | compatible within 2sigma | - |
  2051. 211.83 s > +-------------+-----------------+---------+--------+----------+-----------------------------------------------------------------------------------------------------------------------+-------+
  2052. 211.83 s > | dod2_bubble | rls.inspect | inspect | pass | - | best inspect relative delta 2.822e-3 >= 1000*accuracy 1.000e-7 (accuracy=1.000e-10, exponent=+2.0, seed=1, probes=10) | - |
  2053. 211.83 s > +-------------+-----------------+---------+--------+----------+-----------------------------------------------------------------------------------------------------------------------+-------+
  2054. 211.83 s > | dod2_bubble | rls.integrated | GL0 | pass | 0.0sigma | compatible within 2sigma | - |
  2055. 211.83 s > +-------------+-----------------+---------+--------+----------+-----------------------------------------------------------------------------------------------------------------------+-------+
  2056. 211.83 s > | dod2_bubble | mu_r.inspect | inspect | pass | - | best inspect relative delta 6.951e-1 >= 1000*accuracy 1.000e-7 (accuracy=1.000e-10, exponent=+0.0, seed=0, probes=10) | - |
  2057. 211.83 s > +-------------+-----------------+---------+--------+----------+-----------------------------------------------------------------------------------------------------------------------+-------+
  2058. 211.83 s > | dod2_bubble | target | - | pass | - | 2sigma | - |
  2059. 211.83 s > +-------------+-----------------+---------+--------+----------+-----------------------------------------------------------------------------------------------------------------------+-------+
  2060. 211.83 s > test dod2_bubble_uv ... FAILED
  2061. 211.83 s >
  2062. 211.83 s > failures:
  2063. 211.83 s >
  2064. 211.83 s > failures:
  2065. 211.83 s > dod2_bubble_uv
  2066. 211.83 s >
  2067. 211.83 s > test result: FAILED. 0 passed; 1 failed; 0 ignored; 0 measured; 24 filtered out; finished in 67.45s
  2068. 211.83 s > system-err
  2069. 211.83 s > [2026-09-02 09:05:26.215] @gammaloop_api::se... INFO : Running command run generate
  2070. 211.83 s > [2026-09-02 09:05:26.215] @gammaloop_api::se... INFO : Starting command block generate
  2071. 211.83 s > [2026-09-02 09:05:26.216] @gammaloop_api::se... INFO : Running command import model scalars-default.json
  2072. 211.83 s > [2026-09-02 09:05:26.216] @import::model INFO : Loading built-in JSON model scalars-default
  2073. 211.83 s > [2026-09-02 09:05:26.219] @gammalooprs::model INFO : The following 2 external parameters were forced to zero by the restriction card:
  2074. 211.83 s > width_scalar_1, width_scalar_2
  2075. 211.83 s > [2026-09-02 09:05:26.220] @gammaloop_api::se... INFO : Running command remove processes
  2076. 211.83 s > [2026-09-02 09:05:26.220] @gammaloop_api::se... INFO : Running command set global kv global.generation.uv.generate_integrated=true
  2077. 211.83 s > [2026-09-02 09:05:26.220] @gammaloop_api::se... INFO : Running command import graphs ./tests/resources/graphs/scalar/dod2_bubble.dot -p bubble_dod2 -i scalar_bubble_below_thres
  2078. 211.83 s > [2026-09-02 09:05:26.220] @commands::import INFO : Loading graphs from '/build/source/tests/resources/graphs/scalar/dod2_bubble.dot'
  2079. 211.83 s > [2026-09-02 09:05:26.223] @gammaloop_api::se... INFO : Running command generate existing -p bubble_dod2 -i scalar_bubble_below_thres
  2080. 211.83 s > [2026-09-02 09:05:26.223] @approx::local_4d [{#uv, #inspect, #integrated}] DEBUG : Rescaled momenta expanded
  2081. 211.83 s > field value
  2082. 211.83 s > res n-terms: 1, byte size: 3,expr:
  2083. 211.83 s > 1
  2084. 211.83 s > [2026-09-02 09:05:26.224] @approx::local_4d [{#uv, #inspect, #integrated}] DEBUG : Rescaled momenta expanded
  2085. 211.83 s > field value
  2086. 211.83 s > res n-terms: 1, byte size: 585,expr:
  2087. 211.83 s > -SCALAR_COUPLING²·q₀(αᵉ².¹)·q₀(αᵉ³.¹)·q₂(αᵉ².¹)·q₂(αᵉ³.¹)
  2088. 211.83 s > /(t²·denom(3,-q₀-q₂/t,mass_scalar_2²,-mass_scalar_2²+2·(q₀.q₂)/t+(q₂.q₂)/t²+(q₀.q₀))
  2089. 211.83 s > ·denom(2,q₂/t,mass_scalar_2²,-mass_scalar_2²+(q₂.q₂)/t²))
  2090. 211.83 s > [2026-09-02 09:05:26.229] @approx::final_integrand[{#generation, #profile, #uv, #graph, #summary}] DEBUG : Computed global numerator
  2091. 211.83 s > field value
  2092. 211.83 s > global_num n-terms: 1, byte size: 4,expr:
  2093. 211.83 s > 1/2
  2094. 211.83 s > span build_3d{span_context=true graph=GL0 current=subgraph=0, topo_order=0, dod=0}
  2095. 211.83 s > [2026-09-02 09:05:26.232] @uv::approx [{#generation, #uv, #fourd}] DEBUG : Computing 4D
  2096. 211.83 s > field value
  2097. 211.83 s > simple subgraph(S_11,S_y)*Approx(subgraph(S_y,0)) of GL0
  2098. 211.83 s > span compute_4d{span_context=true graph=GL0 current=subgraph=y, topo_order=1, dod=2 given=subgraph=0, topo_order=0, dod=0 reduced=SubSet { set: BitVec<usize, bitvec::order::Lsb0> { addr: 0x7fffec027530, head: 000000, bits: 6, capacity: 64 } [0, 0, 1, 1, 1, 1], id: PhantomData<linnet::half_edge::involution::Hedge> }}
  2099. 211.83 s > [2026-09-02 09:05:26.232] @approx::local_4d [{#uv, #algebra, #integrated, #start}] DEBUG :
  2100. 211.83 s > field value
  2101. 211.83 s > integrand n-terms: 1, byte size: 409,expr:
  2102. 211.83 s > SCALAR_COUPLING²·(q₀(αᵉ³.¹)+q₃(αᵉ³.¹))·q₀(αᵉ².¹)·q₀(αᵉ³.¹)·q₂(αᵉ².¹)
  2103. 211.83 s > /(denom(2,q₂,mass_scalar_2²,-mass_scalar_2²+(q₂.q₂))·denom(3,q₃,mass_scalar_2²,-mass_scalar_2²+(q₃.q₃)))
  2104. 211.83 s > reduced y
  2105. 211.83 s > span grow{span_context=true current=subgraph=y, topo_order=1, dod=2 given=subgraph=0, topo_order=0, dod=0}
  2106. 211.83 s > [2026-09-02 09:05:26.232] @approx::local_4d [{#uv, #inspect, #integrated}] DEBUG : Rescaled momenta expanded
  2107. 211.83 s > field value
  2108. 211.83 s > res n-terms: 1, byte size: 585,expr:
  2109. 211.83 s > -SCALAR_COUPLING²·q₀(αᵉ².¹)·q₀(αᵉ³.¹)·q₂(αᵉ².¹)·q₂(αᵉ³.¹)
  2110. 211.83 s > /(t²·denom(3,-q₀-q₂/t,mass_scalar_2²,-mass_scalar_2²+2·(q₀.q₂)/t+(q₂.q₂)/t²+(q₀.q₀))
  2111. 211.83 s > ·denom(2,q₂/t,mass_scalar_2²,-mass_scalar_2²+(q₂.q₂)/t²))
  2112. 211.83 s > span t{span_context=true current=subgraph=y, topo_order=1, dod=2 given=subgraph=0, topo_order=0, dod=0}
  2113. 211.83 s > [2026-09-02 09:05:26.232] @approx::local_4d [{#uv, #integrated, #rescaled}] DEBUG : Rescaled expanded
  2114. 211.83 s > field value
  2115. 211.83 s > n_loops 1
  2116. 211.83 s > res n-terms: 1, byte size: 707,expr:
  2117. 211.83 s > -SCALAR_COUPLING²·q₀(αᵉ².¹)·q₀(αᵉ³.¹)·q₂(αᵉ².¹)·q₂(αᵉ³.¹)
  2118. 211.83 s > /(t²·denom(3,-q₂,mUVexp²+t²·mass_scalar_2²,-mUV²+t²·(-mass_scalar_2²+2·(q₀.q₂)/t+(q₂.q₂)/t²+(q₀.q₀))+t²·mUVexp²)
  2119. 211.83 s > ·denom(2,q₂,mUVexp²+t²·mass_scalar_2²,-mUV²+t²·(-mass_scalar_2²+(q₂.q₂)/t²)+t²·mUVexp²))
  2120. 211.83 s > span t{span_context=true current=subgraph=y, topo_order=1, dod=2 given=subgraph=0, topo_order=0, dod=0}
  2121. 211.83 s > [2026-09-02 09:05:26.233] @approx::local_4d [{#uv, #integrated, #series}] DEBUG : Series expanded
  2122. 211.83 s > field value
  2123. 211.83 s > res n-terms: 3, byte size: 1896,expr:
  2124. 211.83 s > (1/2·SCALAR_COUPLING²·(2·mUVexp²-2·mass_scalar_2²)/(denom(2,q₂,mUVexp²,-mUV²+(q₂.q₂))²·denom(3,-q₂,mUVexp²,-mUV²+(q₂.q₂)))
  2125. 211.83 s > -SCALAR_COUPLING²
  2126. 211.83 s > ·(-1/2·(2·mUVexp²-2·mass_scalar_2²+2·(q₀.q₀))/denom(3,-q₂,mUVexp²,-mUV²+(q₂.q₂))
  2127. 211.83 s > +4·(q₀.q₂)²/denom(3,-q₂,mUVexp²,-mUV²+(q₂.q₂))²
  2128. 211.83 s > )/(denom(2,q₂,mUVexp²,-mUV²+(q₂.q₂))·denom(3,-q₂,mUVexp²,-mUV²+(q₂.q₂)))
  2129. 211.83 s > )·q₀(αᵉ².¹)·q₀(αᵉ³.¹)·q₂(αᵉ².¹)·q₂(αᵉ³.¹)
  2130. 211.83 s > +2·SCALAR_COUPLING²·(q₀.q₂)·q₀(αᵉ².¹)·q₀(αᵉ³.¹)·q₂(αᵉ².¹)·q₂(αᵉ³.¹)
  2131. 211.83 s > /(t·denom(2,q₂,mUVexp²,-mUV²+(q₂.q₂))·denom(3,-q₂,mUVexp²,-mUV²+(q₂.q₂))²)
  2132. 211.83 s > -SCALAR_COUPLING²·q₀(αᵉ².¹)·q₀(αᵉ³.¹)·q₂(αᵉ².¹)·q₂(αᵉ³.¹)
  2133. 211.83 s > /(t²·denom(2,q₂,mUVexp²,-mUV²+(q₂.q₂))·denom(3,-q₂,mUVexp²,-mUV²+(q₂.q₂)))
  2134. 211.83 s > span t{span_context=true current=subgraph=y, topo_order=1, dod=2 given=subgraph=0, topo_order=0, dod=0}
  2135. 211.83 s > [2026-09-02 09:05:26.233] @approx::local_4d [{#uv, #integrated, #series}] DEBUG : Evaluated at t = 1
  2136. 211.83 s > field value
  2137. 211.83 s > res n-terms: 3, byte size: 1880,expr:
  2138. 211.83 s > (1/2·SCALAR_COUPLING²·(2·mUVexp²-2·mass_scalar_2²)/(denom(2,q₂,mUVexp²,-mUV²+(q₂.q₂))²·denom(3,-q₂,mUVexp²,-mUV²+(q₂.q₂)))
  2139. 211.83 s > -SCALAR_COUPLING²
  2140. 211.83 s > ·(-1/2·(2·mUVexp²-2·mass_scalar_2²+2·(q₀.q₀))/denom(3,-q₂,mUVexp²,-mUV²+(q₂.q₂))
  2141. 211.83 s > +4·(q₀.q₂)²/denom(3,-q₂,mUVexp²,-mUV²+(q₂.q₂))²
  2142. 211.83 s > )/(denom(2,q₂,mUVexp²,-mUV²+(q₂.q₂))·denom(3,-q₂,mUVexp²,-mUV²+(q₂.q₂)))
  2143. 211.83 s > )·q₀(αᵉ².¹)·q₀(αᵉ³.¹)·q₂(αᵉ².¹)·q₂(αᵉ³.¹)
  2144. 211.83 s > -SCALAR_COUPLING²·q₀(αᵉ².¹)·q₀(αᵉ³.¹)·q₂(αᵉ².¹)·q₂(αᵉ³.¹)
  2145. 211.83 s > /(denom(2,q₂,mUVexp²,-mUV²+(q₂.q₂))·denom(3,-q₂,mUVexp²,-mUV²+(q₂.q₂)))
  2146. 211.83 s > +2·SCALAR_COUPLING²·(q₀.q₂)·q₀(αᵉ².¹)·q₀(αᵉ³.¹)·q₂(αᵉ².¹)·q₂(αᵉ³.¹)
  2147. 211.83 s > /(denom(2,q₂,mUVexp²,-mUV²+(q₂.q₂))·denom(3,-q₂,mUVexp²,-mUV²+(q₂.q₂))²)
  2148. 211.83 s > span t{span_context=true current=subgraph=y, topo_order=1, dod=2 given=subgraph=0, topo_order=0, dod=0}
  2149. 211.83 s > [2026-09-02 09:05:26.235] @approx::local_4d [{#uv, #collect, #integrated}] DEBUG : After gamma chain collection
  2150. 211.83 s > field value
  2151. 211.83 s > expr n-terms: 3, byte size: 1880,expr:
  2152. 211.83 s > (1/2·SCALAR_COUPLING²·(2·mUVexp²-2·mass_scalar_2²)/(denom(2,q₂,mUVexp²,-mUV²+(q₂.q₂))²·denom(3,-q₂,mUVexp²,-mUV²+(q₂.q₂)))
  2153. 211.83 s > -SCALAR_COUPLING²
  2154. 211.83 s > ·(-1/2·(2·mUVexp²-2·mass_scalar_2²+2·(q₀.q₀))/denom(3,-q₂,mUVexp²,-mUV²+(q₂.q₂))
  2155. 211.83 s > +4·(q₀.q₂)²/denom(3,-q₂,mUVexp²,-mUV²+(q₂.q₂))²
  2156. 211.83 s > )/(denom(2,q₂,mUVexp²,-mUV²+(q₂.q₂))·denom(3,-q₂,mUVexp²,-mUV²+(q₂.q₂)))
  2157. 211.83 s > )·q₀(αᵉ².¹)·q₀(αᵉ³.¹)·q₂(αᵉ².¹)·q₂(αᵉ³.¹)
  2158. 211.83 s > -SCALAR_COUPLING²·q₀(αᵉ².¹)·q₀(αᵉ³.¹)·q₂(αᵉ².¹)·q₂(αᵉ³.¹)
  2159. 211.83 s > /(denom(2,q₂,mUVexp²,-mUV²+(q₂.q₂))·denom(3,-q₂,mUVexp²,-mUV²+(q₂.q₂)))
  2160. 211.83 s > +2·SCALAR_COUPLING²·(q₀.q₂)·q₀(αᵉ².¹)·q₀(αᵉ³.¹)·q₂(αᵉ².¹)·q₂(αᵉ³.¹)
  2161. 211.83 s > /(denom(2,q₂,mUVexp²,-mUV²+(q₂.q₂))·denom(3,-q₂,mUVexp²,-mUV²+(q₂.q₂))²)
  2162. 211.83 s > span t{span_context=true current=subgraph=y, topo_order=1, dod=2 given=subgraph=0, topo_order=0, dod=0}
  2163. 211.83 s > [2026-09-02 09:05:26.236] @approx::local_4d [{#profile, #uv, #collect, #integrated, #start, #trace}] DEBUG : After gamma schoonschip
  2164. 211.83 s > field value
  2165. 211.83 s > expr n-terms: 3, byte size: 1631,expr:
  2166. 211.83 s > (1/2·SCALAR_COUPLING²·(2·mUVexp²-2·mass_scalar_2²)/(denom(2,q₂,mUVexp²,-mUV²+(q₂.q₂))²·denom(3,-q₂,mUVexp²,-mUV²+(q₂.q₂)))
  2167. 211.83 s > -SCALAR_COUPLING²
  2168. 211.83 s > ·(-1/2·(2·mUVexp²-2·mass_scalar_2²+2·(q₀.q₀))/denom(3,-q₂,mUVexp²,-mUV²+(q₂.q₂))
  2169. 211.83 s > +4·(q₀.q₂)²/denom(3,-q₂,mUVexp²,-mUV²+(q₂.q₂))²
  2170. 211.83 s > )/(denom(2,q₂,mUVexp²,-mUV²+(q₂.q₂))·denom(3,-q₂,mUVexp²,-mUV²+(q₂.q₂)))
  2171. 211.83 s > )·(q₀.q₂)²
  2172. 211.83 s > -SCALAR_COUPLING²·(q₀.q₂)²/(denom(2,q₂,mUVexp²,-mUV²+(q₂.q₂))·denom(3,-q₂,mUVexp²,-mUV²+(q₂.q₂)))
  2173. 211.83 s > +2·SCALAR_COUPLING²·(q₀.q₂)·(q₀.q₂)²
  2174. 211.83 s > /(denom(2,q₂,mUVexp²,-mUV²+(q₂.q₂))·denom(3,-q₂,mUVexp²,-mUV²+(q₂.q₂))²)
  2175. 211.83 s > span t{span_context=true current=subgraph=y, topo_order=1, dod=2 given=subgraph=0, topo_order=0, dod=0}
  2176. 211.83 s > [2026-09-02 09:05:26.237] @approx::local_4d [{#profile, #uv, #collect, #integrated, #start, #trace}] DEBUG : After gamma collection
  2177. 211.83 s > field value
  2178. 211.83 s > expr n-terms: 1, byte size: 1347,expr:
  2179. 211.83 s > SCALAR_COUPLING²
  2180. 211.83 s > ·(-denom(2,q₂,mUVexp²,-mUV²+(q₂.q₂))·denom(3,-q₂,mUVexp²,-mUV²+(q₂.q₂))²
  2181. 211.83 s > +1/2·(2·mUVexp²-2·mass_scalar_2²)·denom(3,-q₂,mUVexp²,-mUV²+(q₂.q₂))²
  2182. 211.83 s > -(-1/2·(2·mUVexp²-2·mass_scalar_2²+2·(q₀.q₀))·denom(3,-q₂,mUVexp²,-mUV²+(q₂.q₂))+4·(q₀.q₂)²)
  2183. 211.83 s > ·denom(2,q₂,mUVexp²,-mUV²+(q₂.q₂))
  2184. 211.83 s > +2·(q₀.q₂)·denom(2,q₂,mUVexp²,-mUV²+(q₂.q₂))·denom(3,-q₂,mUVexp²,-mUV²+(q₂.q₂))
  2185. 211.83 s > )·(q₀.q₂)²/(denom(2,q₂,mUVexp²,-mUV²+(q₂.q₂))²·denom(3,-q₂,mUVexp²,-mUV²+(q₂.q₂))³)
  2186. 211.83 s > span t{span_context=true current=subgraph=y, topo_order=1, dod=2 given=subgraph=0, topo_order=0, dod=0}
  2187. 211.83 s > [2026-09-02 09:05:26.238] @approx::local_4d [{#profile, #uv, #gamma, #integrated, #start, #trace, #vakint}] DEBUG : After gamma simplification
  2188. 211.83 s > ... omitted 3263 more lines; see full nextest output above
  2189. 211.83 s >
  2190. 211.83 s > 8. gammaloop-integration-tests::uv::sunrise_scalar_1_uv
  2191. 211.83 s > failure: test failure with exit code 101
  2192. 211.83 s > system-out
  2193. 211.83 s > running 1 test
  2194. 211.83 s > test sunrise_scalar_1_uv has been running for over 60 seconds
  2195. 211.83 s > +------------------+------------------------+--------------+--------+----------+----------------------------------------------------------------------------------------------------------------------+-------+
  2196. 211.83 s > | case | check | graph | status | sigma | threshold | error |
  2197. 211.83 s > +------------------+------------------------+--------------+--------+----------+----------------------------------------------------------------------------------------------------------------------+-------+
  2198. 211.83 s > | sunrise_scalar_1 | uv_profile | - | FAIL | - | - | - |
  2199. 211.83 s > +------------------+------------------------+--------------+--------+----------+----------------------------------------------------------------------------------------------------------------------+-------+
  2200. 211.83 s > | sunrise_scalar_1 | m_uv.inspect | inspect | pass | - | best inspect relative delta 1.624e0 >= 1000*accuracy 1.000e-3 (accuracy=1.000e-6, exponent=+1.0, seed=1, probes=10) | - |
  2201. 211.83 s > +------------------+------------------------+--------------+--------+----------+----------------------------------------------------------------------------------------------------------------------+-------+
  2202. 211.83 s > | sunrise_scalar_1 | m_uv.integrated | sunrise | pass | 0.1sigma | compatible within 2sigma | - |
  2203. 211.83 s > +------------------+------------------------+--------------+--------+----------+----------------------------------------------------------------------------------------------------------------------+-------+
  2204. 211.83 s > | sunrise_scalar_1 | rls.inspect | inspect | pass | - | best inspect relative delta 8.682e-1 >= 1000*accuracy 1.000e-3 (accuracy=1.000e-6, exponent=+1.0, seed=1, probes=10) | - |
  2205. 211.83 s > +------------------+------------------------+--------------+--------+----------+----------------------------------------------------------------------------------------------------------------------+-------+
  2206. 211.83 s > | sunrise_scalar_1 | rls.integrated | sunrise | pass | 0.0sigma | compatible within 2sigma | - |
  2207. 211.83 s > +------------------+------------------------+--------------+--------+----------+----------------------------------------------------------------------------------------------------------------------+-------+
  2208. 211.83 s > | sunrise_scalar_1 | mu_r.inspect | inspect | pass | - | best inspect relative delta 1.752e0 >= 1000*accuracy 1.000e-3 (accuracy=1.000e-6, exponent=+1.0, seed=1, probes=10) | - |
  2209. 211.83 s > +------------------+------------------------+--------------+--------+----------+----------------------------------------------------------------------------------------------------------------------+-------+
  2210. 211.83 s > | sunrise_scalar_1 | integrated.relerr | integrated | pass | - | relative error 9.20% <= 10.00% | - |
  2211. 211.83 s > +------------------+------------------------+--------------+--------+----------+----------------------------------------------------------------------------------------------------------------------+-------+
  2212. 211.83 s > | sunrise_scalar_1 | m_uv.integrated.relerr | m_uv-shifted | pass | - | relative error 5.89% <= 10.00% | - |
  2213. 211.83 s > +------------------+------------------------+--------------+--------+----------+----------------------------------------------------------------------------------------------------------------------+-------+
  2214. 211.83 s > | sunrise_scalar_1 | target | - | pass | - | 2sigma | - |
  2215. 211.83 s > +------------------+------------------------+--------------+--------+----------+----------------------------------------------------------------------------------------------------------------------+-------+
  2216. 211.83 s > test sunrise_scalar_1_uv ... FAILED
  2217. 211.83 s >
  2218. 211.83 s > failures:
  2219. 211.83 s >
  2220. 211.83 s > failures:
  2221. 211.83 s > sunrise_scalar_1_uv
  2222. 211.83 s >
  2223. 211.83 s > test result: FAILED. 0 passed; 1 failed; 0 ignored; 0 measured; 24 filtered out; finished in 127.80s
  2224. 211.83 s > system-err
  2225. 211.83 s > [2026-09-02 09:05:32.145] @gammaloop_api::se... INFO : Running command run generate
  2226. 211.83 s > [2026-09-02 09:05:32.145] @gammaloop_api::se... INFO : Starting command block generate
  2227. 211.83 s > [2026-09-02 09:05:32.145] @gammaloop_api::se... INFO : Running command import model scalars-default.json
  2228. 211.83 s > [2026-09-02 09:05:32.145] @import::model INFO : Loading built-in JSON model scalars-default
  2229. 211.83 s > [2026-09-02 09:05:32.152] @gammalooprs::model INFO : The following 2 external parameters were forced to zero by the restriction card:
  2230. 211.83 s > width_scalar_1, width_scalar_2
  2231. 211.83 s > [2026-09-02 09:05:32.152] @gammaloop_api::se... INFO : Running command remove processes
  2232. 211.83 s > [2026-09-02 09:05:32.152] @gammaloop_api::se... INFO : Running command set global kv global.generation.uv.generate_integrated=true
  2233. 211.83 s > [2026-09-02 09:05:32.153] @gammaloop_api::se... INFO : Running command import graphs ./tests/resources/graphs/scalar_sunrise.dot -p sunrise_scalar_1 -i scalar_sunrise
  2234. 211.83 s > [2026-09-02 09:05:32.153] @commands::import INFO : Loading graphs from '/build/source/tests/resources/graphs/scalar_sunrise.dot'
  2235. 211.83 s > [2026-09-02 09:05:32.158] @gammaloop_api::se... INFO : Running command generate existing -p sunrise_scalar_1 -i scalar_sunrise
  2236. 211.83 s > [2026-09-02 09:05:32.159] @approx::local_4d [{#uv, #inspect, #integrated}] DEBUG : Rescaled momenta expanded
  2237. 211.83 s > field value
  2238. 211.83 s > res n-terms: 1, byte size: 3,expr:
  2239. 211.83 s > 1
  2240. 211.83 s > [2026-09-02 09:05:32.160] @approx::local_4d [{#uv, #inspect, #integrated}] DEBUG : Rescaled momenta expanded
  2241. 211.83 s > field value
  2242. 211.83 s > res n-terms: 1, byte size: 611,expr:
  2243. 211.83 s > 1/(denom(0,q₀/t,mass_scalar_1²,-mass_scalar_1²+(q₀.q₀)/t²)
  2244. 211.83 s > ·denom(1,-q₂+q₃-q₀/t,mass_scalar_1²,
  2245. 211.83 s > -mass_scalar_1²+2·(q₀.q₂)/t-2·(q₀.q₃)/t+(q₀.q₀)/t²+(q₂.q₂)
  2246. 211.83 s > -2·(q₂.q₃)+(q₃.q₃)
  2247. 211.83 s > ))
  2248. 211.83 s > [2026-09-02 09:05:32.186] @approx::local_4d [{#uv, #inspect, #integrated}] DEBUG : Rescaled momenta expanded
  2249. 211.83 s > field value
  2250. 211.83 s > res n-terms: 1, byte size: 611,expr:
  2251. 211.83 s > 1/(denom(1,q₁/t,mass_scalar_1²,-mass_scalar_1²+(q₁.q₁)/t²)
  2252. 211.83 s > ·denom(2,-q₀+q₃-q₁/t,mass_scalar_1²,
  2253. 211.83 s > -mass_scalar_1²+2·(q₀.q₁)/t-2·(q₁.q₃)/t+(q₁.q₁)/t²+(q₀.q₀)
  2254. 211.83 s > -2·(q₀.q₃)+(q₃.q₃)
  2255. 211.83 s > ))
  2256. 211.83 s > [2026-09-02 09:05:32.203] @approx::local_4d [{#uv, #inspect, #integrated}] DEBUG : Rescaled momenta expanded
  2257. 211.83 s > field value
  2258. 211.83 s > res n-terms: 1, byte size: 777,expr:
  2259. 211.83 s > 1/(denom(0,q₀/t,mass_scalar_1²,-mass_scalar_1²+(q₀.q₀)/t²)·denom(1,q₁/t,mass_scalar_1²,-mass_scalar_1²+(q₁.q₁)/t²)
  2260. 211.83 s > ·denom(2,q₄-q₀/t-q₁/t,mass_scalar_1²,
  2261. 211.83 s > -mass_scalar_1²-2·(q₀.q₄)/t-2·(q₁.q₄)/t+(q₀.q₀)/t²+2·(q₀.q₁)/t²
  2262. 211.83 s > +(q₁.q₁)/t²+(q₄.q₄)
  2263. 211.83 s > ))
  2264. 211.83 s > [2026-09-02 09:05:32.226] @approx::local_4d [{#uv, #inspect, #integrated}] DEBUG : Rescaled momenta expanded
  2265. 211.83 s > field value
  2266. 211.83 s > res n-terms: 1, byte size: 611,expr:
  2267. 211.83 s > 1/(denom(0,q₀/t,mass_scalar_1²,-mass_scalar_1²+(q₀.q₀)/t²)
  2268. 211.83 s > ·denom(2,-q₁+q₃-q₀/t,mass_scalar_1²,
  2269. 211.83 s > -mass_scalar_1²+2·(q₀.q₁)/t-2·(q₀.q₃)/t+(q₀.q₀)/t²+(q₁.q₁)
  2270. 211.83 s > -2·(q₁.q₃)+(q₃.q₃)
  2271. 211.83 s > ))
  2272. 211.83 s > [2026-09-02 09:05:32.226] @approx::final_integrand[{#generation, #profile, #uv, #graph, #summary}] DEBUG : Computed global numerator
  2273. 211.83 s > field value
  2274. 211.83 s > global_num n-terms: 1, byte size: 3,expr:
  2275. 211.83 s > 1
  2276. 211.83 s > span build_3d{span_context=true graph=sunrise current=subgraph=0, topo_order=0, dod=0}
  2277. 211.83 s > [2026-09-02 09:05:32.252] @uv::approx [{#generation, #uv, #fourd}] DEBUG : Computing 4D
  2278. 211.83 s > field value
  2279. 211.83 s > simple subgraph(S_47,S_y)*Approx(subgraph(S_y,0)) of sunrise
  2280. 211.83 s > span compute_4d{span_context=true graph=sunrise current=subgraph=y, topo_order=1, dod=0 given=subgraph=0, topo_order=0, dod=0 reduced=SubSet { set: BitVec<usize, bitvec::order::Lsb0> { addr: 0x7fffec01df50, head: 000000, bits: 8, capacity: 64 } [0, 0, 1, 1, 1, 1, 0, 0], id: PhantomData<linnet::half_edge::involution::Hedge> }}
  2281. 211.83 s > [2026-09-02 09:05:32.253] @approx::local_4d [{#uv, #algebra, #integrated, #start}] DEBUG :
  2282. 211.83 s > field value
  2283. 211.83 s > integrand n-terms: 1, byte size: 217,expr:
  2284. 211.83 s > 1/(denom(0,q₀,mass_scalar_1²,-mass_scalar_1²+(q₀.q₀))·denom(1,q₁,mass_scalar_1²,-mass_scalar_1²+(q₁.q₁)))
  2285. 211.83 s > reduced y
  2286. 211.83 s > span grow{span_context=true current=subgraph=y, topo_order=1, dod=0 given=subgraph=0, topo_order=0, dod=0}
  2287. 211.83 s > [2026-09-02 09:05:32.253] @approx::local_4d [{#uv, #inspect, #integrated}] DEBUG : Rescaled momenta expanded
  2288. 211.83 s > field value
  2289. 211.83 s > res n-terms: 1, byte size: 611,expr:
  2290. 211.83 s > 1/(denom(0,q₀/t,mass_scalar_1²,-mass_scalar_1²+(q₀.q₀)/t²)
  2291. 211.83 s > ·denom(1,-q₂+q₃-q₀/t,mass_scalar_1²,
  2292. 211.83 s > -mass_scalar_1²+2·(q₀.q₂)/t-2·(q₀.q₃)/t+(q₀.q₀)/t²+(q₂.q₂)
  2293. 211.83 s > -2·(q₂.q₃)+(q₃.q₃)
  2294. 211.83 s > ))
  2295. 211.83 s > span t{span_context=true current=subgraph=y, topo_order=1, dod=0 given=subgraph=0, topo_order=0, dod=0}
  2296. 211.83 s > [2026-09-02 09:05:32.253] @approx::local_4d [{#uv, #integrated, #rescaled}] DEBUG : Rescaled expanded
  2297. 211.83 s > field value
  2298. 211.83 s > n_loops 1
  2299. 211.83 s > res n-terms: 1, byte size: 723,expr:
  2300. 211.83 s > 1/(denom(0,q₀,mUVexp²+t²·mass_scalar_1²,-mUV²+t²·(-mass_scalar_1²+(q₀.q₀)/t²)+t²·mUVexp²)
  2301. 211.83 s > ·denom(1,-q₀,mUVexp²+t²·mass_scalar_1²,
  2302. 211.83 s > -mUV²
  2303. 211.83 s > +t²
  2304. 211.83 s > ·(-mass_scalar_1²+2·(q₀.q₂)/t-2·(q₀.q₃)/t+(q₀.q₀)/t²+(q₂.q₂)
  2305. 211.83 s > -2·(q₂.q₃)+(q₃.q₃)
  2306. 211.83 s > )
  2307. 211.83 s > +t²·mUVexp²
  2308. 211.83 s > ))
  2309. 211.83 s > span t{span_context=true current=subgraph=y, topo_order=1, dod=0 given=subgraph=0, topo_order=0, dod=0}
  2310. 211.83 s > [2026-09-02 09:05:32.254] @approx::local_4d [{#uv, #integrated, #series}] DEBUG : Series expanded
  2311. 211.83 s > field value
  2312. 211.83 s > res n-terms: 1, byte size: 223,expr:
  2313. 211.83 s > 1/(denom(0,q₀,mUVexp²,-mUV²+(q₀.q₀))·denom(1,-q₀,mUVexp²,-mUV²+(q₀.q₀)))
  2314. 211.83 s > span t{span_context=true current=subgraph=y, topo_order=1, dod=0 given=subgraph=0, topo_order=0, dod=0}
  2315. 211.83 s > [2026-09-02 09:05:32.254] @approx::local_4d [{#uv, #integrated, #series}] DEBUG : Evaluated at t = 1
  2316. 211.83 s > field value
  2317. 211.83 s > res n-terms: 1, byte size: 223,expr:
  2318. 211.83 s > 1/(denom(0,q₀,mUVexp²,-mUV²+(q₀.q₀))·denom(1,-q₀,mUVexp²,-mUV²+(q₀.q₀)))
  2319. 211.83 s > span t{span_context=true current=subgraph=y, topo_order=1, dod=0 given=subgraph=0, topo_order=0, dod=0}
  2320. 211.83 s > [2026-09-02 09:05:32.254] @approx::local_4d [{#uv, #collect, #integrated}] DEBUG : After gamma chain collection
  2321. 211.83 s > field value
  2322. 211.83 s > expr n-terms: 1, byte size: 223,expr:
  2323. 211.83 s > 1/(denom(0,q₀,mUVexp²,-mUV²+(q₀.q₀))·denom(1,-q₀,mUVexp²,-mUV²+(q₀.q₀)))
  2324. 211.83 s > span t{span_context=true current=subgraph=y, topo_order=1, dod=0 given=subgraph=0, topo_order=0, dod=0}
  2325. 211.83 s > [2026-09-02 09:05:32.280] @approx::local_4d [{#profile, #uv, #collect, #integrated, #start, #trace}] DEBUG : After gamma schoonschip
  2326. 211.83 s > field value
  2327. 211.83 s > expr n-terms: 1, byte size: 223,expr:
  2328. 211.83 s > 1/(denom(0,q₀,mUVexp²,-mUV²+(q₀.q₀))·denom(1,-q₀,mUVexp²,-mUV²+(q₀.q₀)))
  2329. 211.83 s > span t{span_context=true current=subgraph=y, topo_order=1, dod=0 given=subgraph=0, topo_order=0, dod=0}
  2330. 211.83 s > [2026-09-02 09:05:32.281] @approx::local_4d [{#profile, #uv, #collect, #integrated, #start, #trace}] DEBUG : After gamma collection
  2331. 211.83 s > field value
  2332. 211.83 s > expr n-terms: 1, byte size: 223,expr:
  2333. 211.83 s > 1/(denom(0,q₀,mUVexp²,-mUV²+(q₀.q₀))·denom(1,-q₀,mUVexp²,-mUV²+(q₀.q₀)))
  2334. 211.83 s > span t{span_context=true current=subgraph=y, topo_order=1, dod=0 given=subgraph=0, topo_order=0, dod=0}
  2335. 211.83 s > [2026-09-02 09:05:32.281] @approx::local_4d [{#profile, #uv, #gamma, #integrated, #start, #trace, #vakint}] DEBUG : After gamma simplification
  2336. 211.83 s > field value
  2337. 211.83 s > expr n-terms: 1, byte size: 223,expr:
  2338. 211.83 s > 1/(denom(0,q₀,mUVexp²,-mUV²+(q₀.q₀))·denom(1,-q₀,mUVexp²,-mUV²+(q₀.q₀)))
  2339. 211.83 s > span t{span_context=true current=subgraph=y, topo_order=1, dod=0 given=subgraph=0, topo_order=0, dod=0}
  2340. 211.83 s > [2026-09-02 09:05:32.295] @approx::local_4d [{#profile, #uv, #integrated, #schoonschip, #start, #trace, #vakint}] DEBUG : After Schoonschip net
  2341. 211.83 s > field value
  2342. 211.83 s > expr n-terms: 1, byte size: 223,expr:
  2343. 211.83 s > 1/(denom(0,q₀,mUVexp²,-mUV²+(q₀.q₀))·denom(1,-q₀,mUVexp²,-mUV²+(q₀.q₀)))
  2344. 211.83 s > ... omitted 20090 more lines; see full nextest output above
  2345. 211.83 s >
  2346. 211.83 s > 9. gammaloop-integration-tests::uv::se1l_uv
  2347. 211.83 s > failure: test failure with exit code 101
  2348. 211.83 s > system-out
  2349. 211.83 s > running 1 test
  2350. 211.83 s > test se1l_uv has been running for over 60 seconds
  2351. 211.83 s > +------+-----------------+---------+--------+----------+-----------------------------------------------------------------------------------------------------------------------+-------+
  2352. 211.83 s > | case | check | graph | status | sigma | threshold | error |
  2353. 211.83 s > +------+-----------------+---------+--------+----------+-----------------------------------------------------------------------------------------------------------------------+-------+
  2354. 211.83 s > | se1l | uv_profile | - | FAIL | - | - | - |
  2355. 211.83 s > +------+-----------------+---------+--------+----------+-----------------------------------------------------------------------------------------------------------------------+-------+
  2356. 211.83 s > | se1l | m_uv.inspect | inspect | pass | - | best inspect relative delta 1.097e-1 >= 1000*accuracy 1.000e-7 (accuracy=1.000e-10, exponent=+2.0, seed=1, probes=10) | - |
  2357. 211.83 s > +------+-----------------+---------+--------+----------+-----------------------------------------------------------------------------------------------------------------------+-------+
  2358. 211.83 s > | se1l | m_uv.integrated | se1l | pass | 0.1sigma | compatible within 2sigma | - |
  2359. 211.83 s > +------+-----------------+---------+--------+----------+-----------------------------------------------------------------------------------------------------------------------+-------+
  2360. 211.83 s > | se1l | rls.inspect | inspect | pass | - | best inspect relative delta 4.499e-2 >= 1000*accuracy 1.000e-7 (accuracy=1.000e-10, exponent=+2.0, seed=1, probes=10) | - |
  2361. 211.83 s > +------+-----------------+---------+--------+----------+-----------------------------------------------------------------------------------------------------------------------+-------+
  2362. 211.83 s > | se1l | rls.integrated | se1l | pass | 0.0sigma | compatible within 2sigma | - |
  2363. 211.83 s > +------+-----------------+---------+--------+----------+-----------------------------------------------------------------------------------------------------------------------+-------+
  2364. 211.83 s > | se1l | mu_r.inspect | inspect | pass | - | best inspect relative delta 1.424e-1 >= 1000*accuracy 1.000e-7 (accuracy=1.000e-10, exponent=+2.0, seed=1, probes=10) | - |
  2365. 211.83 s > +------+-----------------+---------+--------+----------+-----------------------------------------------------------------------------------------------------------------------+-------+
  2366. 211.83 s > | se1l | target | - | pass | - | 2sigma | - |
  2367. 211.83 s > +------+-----------------+---------+--------+----------+-----------------------------------------------------------------------------------------------------------------------+-------+
  2368. 211.83 s > test se1l_uv ... FAILED
  2369. 211.83 s >
  2370. 211.83 s > failures:
  2371. 211.83 s >
  2372. 211.83 s > failures:
  2373. 211.83 s > se1l_uv
  2374. 211.83 s >
  2375. 211.83 s > test result: FAILED. 0 passed; 1 failed; 0 ignored; 0 measured; 24 filtered out; finished in 130.52s
  2376. 211.83 s > system-err
  2377. 211.83 s > [2026-09-02 09:05:31.370] @gammaloop_api::se... INFO : Running command run generate
  2378. 211.83 s > [2026-09-02 09:05:31.370] @gammaloop_api::se... INFO : Starting command block generate
  2379. 211.83 s > [2026-09-02 09:05:31.370] @gammaloop_api::se... INFO : Running command import model sm-default
  2380. 211.83 s > [2026-09-02 09:05:31.370] @import::model INFO : Loading built-in JSON model sm-default
  2381. 211.83 s > [2026-09-02 09:05:31.410] @gammalooprs::model INFO : The following 11 external parameters were forced to zero by the restriction card:
  2382. 211.83 s > lamWS, AWS, rhoWS, etaWS, ymc, yme, ymm, MC, Me, MM, WTau
  2383. 211.83 s > [2026-09-02 09:05:31.410] @gammalooprs::model INFO : The following 34 vertex rules were removed by the restriction card:
  2384. 211.83 s > V_82 -> (c~, d, G+) | V_83 -> (t~, d, G+) | V_84 -> (c~, s, G+) | V_85 -> (t~, s, G+) | V_86 -> (u~, b, G+) | V_87 -> (c~, b, G+) | V_90 -> (c~, d, W+) | V_91 -> (t~, d, W+) | V_92 -> (u~, s, W+) | V_94 -> (t~, s, W+) | V_95 -> (u~, b, W+) | V_96 -> (c~, b, W+) | V_101 -> (e+, e-, G0) | V_102 -> (mu+, mu-, G0) | V_104 -> (e+, e-, H) | V_105 -> (mu+, mu-, H) | V_110 -> (ve~, e-, G+) | V_111 -> (vm~, mu-, G+) | V_116 -> (b~, u, G-) | V_117 -> (d~, c, G-) | V_118 -> (s~, c, G-) | V_119 -> (b~, c, G-) | V_120 -> (d~, t, G-) | V_121 -> (s~, t, G-) | V_124 -> (s~, u, W-) | V_125 -> (b~, u, W-) | V_126 -> (d~, c, W-) | V_128 -> (b~, c, W-) | V_129 -> (d~, t, W-) | V_130 -> (s~, t, W-) | V_138 -> (c~, c, G0) | V_140 -> (c~, c, H) | V_145 -> (e+, ve, G-) | V_146 -> (mu+, vm, G-)
  2385. 211.83 s > [2026-09-02 09:05:31.410] @gammalooprs::model INFO : The following 36 couplings were removed by the restriction card:
  2386. 211.83 s > GC_13, GC_14, GC_16, GC_17, GC_18, GC_19, GC_20, GC_22, GC_23, GC_24, GC_25, GC_26, GC_28, GC_29, GC_42, GC_43, GC_44, GC_46, GC_47, GC_48, GC_84, GC_85, GC_86, GC_87, GC_88, GC_89, GC_90, GC_91, GC_92, GC_93, GC_101, GC_102, GC_103, GC_105, GC_106, GC_107
  2387. 211.83 s > [2026-09-02 09:05:31.410] @gammaloop_api::se... INFO : Running command remove processes
  2388. 211.83 s > [2026-09-02 09:05:31.411] @gammaloop_api::se... INFO : Running command set global kv global.generation.uv.generate_integrated=true
  2389. 211.83 s > [2026-09-02 09:05:31.411] @gammaloop_api::se... INFO : Running command import graphs ./tests/resources/graphs/uv_tests/se1l.dot -p se1l -i se1l
  2390. 211.83 s > [2026-09-02 09:05:31.411] @commands::import INFO : Loading graphs from '/build/source/tests/resources/graphs/uv_tests/se1l.dot'
  2391. 211.83 s > [2026-09-02 09:05:31.417] @gammaloop_api::se... INFO : Running command generate existing -p se1l -i se1l
  2392. 211.83 s > [2026-09-02 09:05:32.937] @commands::generate INFO :
  2393. 211.83 s > Integrand generation summary
  2394. 211.83 s > peak RAM 89.36 MiB | cores 1
  2395. 211.83 s > ╭───────────┬───────┬─────────┬─────────────┬─────────────┬────────────────┬─────────────╮
  2396. 211.83 s > │ integrand │ graph │ # evals │ expr build │ spenso │ symbolica eval │ compile │
  2397. 211.83 s > ├───────────┼───────┼─────────┼─────────────┼─────────────┼────────────────┼─────────────┤
  2398. 211.83 s > │ se1l │ se1l │ 5 │ 1.37s (93%) │ 35ms (2.4%) │ 60ms (4.1%) │ 0ms (0.00%) │
  2399. 211.83 s > ├───────────┼───────┼─────────┼─────────────┼─────────────┼────────────────┼─────────────┤
  2400. 211.83 s > │ Total │ │ 5 │ 1.37s (93%) │ 35ms (2.4%) │ 60ms (4.1%) │ 0ms (0.00%) │
  2401. 211.83 s > ╰───────────┴───────┴─────────┴─────────────┴─────────────┴────────────────┴─────────────╯
  2402. 211.83 s > [2026-09-02 09:05:32.938] @gammaloop_api::se... INFO : Running command set process -p se1l -i se1l kv general.m_uv=0.2
  2403. 211.83 s > [2026-09-02 09:05:32.939] @gammaloop_api::se... INFO : Running command set process -p se1l -i se1l kv general.mu_r=0.2
  2404. 211.83 s > [2026-09-02 09:05:32.940] @gammaloop_api::se... INFO : Running command set process -p se1l -i se1l kv general.renormalization_localization_scale=0.2
  2405. 211.83 s > [2026-09-02 09:05:32.944] @gammaloop_api::se... INFO : Running command duplicate integrand -p se1l -i se1l --output_process_name se1l --output_integrand_name se1l_muv_shifted
  2406. 211.83 s > [2026-09-02 09:05:32.945] @gammaloop_api::se... INFO : Running command set process -p se1l -i se1l_muv_shifted kv general.m_uv=0.5
  2407. 211.83 s > [2026-09-02 09:05:32.946] @gammaloop_api::se... INFO : Running command duplicate integrand -p se1l -i se1l --output_process_name se1l --output_integrand_name se1l_rls_shifted
  2408. 211.83 s > [2026-09-02 09:05:32.951] @gammaloop_api::se... INFO : Running command set process -p se1l -i se1l_rls_shifted kv general.renormalization_localization_scale=1
  2409. 211.83 s > [2026-09-02 09:05:32.952] @gammaloop_api::se... INFO : Running command duplicate integrand -p se1l -i se1l --output_process_name se1l --output_integrand_name se1l_mur_shifted
  2410. 211.83 s > [2026-09-02 09:05:32.957] @gammaloop_api::se... INFO : Running command set process -p se1l -i se1l_mur_shifted kv general.mu_r=0.8
  2411. 211.83 s > [2026-09-02 09:05:32.969] @process::amplitude WARNING : External state 0 ('g', PDG 21, helicity +) is off shell: p^2 = +2.5e5, expected m^2 = +0e0 (|Δ| = +2.5e5). Fixed-helicity spinor/vector/tensor external states may be ill-defined at this kinematic point.
  2412. 211.83 s > field value
  2413. 211.83 s > span warm_up{integrand.name=se1l}
  2414. 211.83 s > [2026-09-02 09:05:32.969] @process::amplitude WARNING : External state 1 ('g', PDG 21, helicity -) is off shell: p^2 = +2.5e5, expected m^2 = +0e0 (|Δ| = +2.5e5). Fixed-helicity spinor/vector/tensor external states may be ill-defined at this kinematic point.
  2415. 211.83 s > field value
  2416. 211.83 s > span warm_up{integrand.name=se1l}
  2417. 211.83 s > [2026-09-02 09:05:32.969] @process::amplitude INFO : Input is above threshold: 1 existing threshold E-surfaces across 1/1 graph groups
  2418. 211.83 s > field value
  2419. 211.83 s > existing_esurfaces 1
  2420. 211.83 s > group_count 1
  2421. 211.83 s > groups_above_threshold 1
  2422. 211.83 s > integrand se1l
  2423. 211.83 s > span warm_up{integrand.name=se1l}
  2424. 211.83 s > threshold_status above threshold
  2425. 211.83 s > [2026-09-02 09:05:32.969] @process::amplitude INFO : overlap structure of group 0: [1: [0(2,3)]]
  2426. 211.83 s > field value
  2427. 211.83 s > span warm_up{integrand.name=se1l}
  2428. 211.83 s > [2026-09-02 09:05:33.312] @commands::profile INFO :
  2429. 211.83 s > ╭───────┬──────┬──────────┬───────┬─────┬──────────┬───────────╮
  2430. 211.83 s > │ fixed │ → ∞ │ slope │ r2 │ DOD │ bare DOD │ inspect │
  2431. 211.83 s > ├───────┼──────┼──────────┼───────┼─────┼──────────┼───────────┤
  2432. 211.83 s > │ {} │ {e3} │ 1.639236 │ 0.904 │ 2 │ 2 │ arb retry │
  2433. 211.83 s > │ {} │ {e2} │ 1.698834 │ 0.902 │ 2 │ 2 │ arb retry │
  2434. 211.83 s > ╰───────┴──────┴──────────┴───────┴─────┴──────────┴───────────╯
  2435. 211.83 s > [2026-09-02 09:05:33.312] @commands::profile INFO :
  2436. 211.83 s > ╭───────┬──────┬─────────────┬──────────┬───────┬─────┬──────────┬───────────╮
  2437. 211.83 s > │ fixed │ → ∞ │ orientation │ slope │ r2 │ DOD │ bare DOD │ inspect │
  2438. 211.83 s > ├───────┼──────┼─────────────┼──────────┼───────┼─────┼──────────┼───────────┤
  2439. 211.83 s > │ {} │ {e3} │ 00-+ │ 0.343429 │ 0.145 │ 0 │ 2 │ arb retry │
  2440. 211.83 s > │ {} │ {e3} │ 00+- │ 0.342577 │ 0.135 │ 0 │ 2 │ arb retry │
  2441. 211.83 s > │ {} │ {e2} │ 00-+ │ 0.385975 │ 0.161 │ 0 │ 2 │ arb retry │
  2442. 211.83 s > │ {} │ {e2} │ 00+- │ 0.384920 │ 0.192 │ 0 │ 2 │ arb retry │
  2443. 211.83 s > ╰───────┴──────┴─────────────┴──────────┴───────┴─────┴──────────┴───────────╯
  2444. 211.83 s > [2026-09-02 09:05:33.325] @gammaloop_api::se... INFO : Running command set process kv integrator.target_relative_accuracy=0.001 integrator.n_increase=0 integrator.n_start=50000 integrator.n_max=400000 integrator.seed=1337
  2445. 211.83 s > [2026-09-02 09:05:33.326] @commands::integrate INFO : Created workspace directory at /build/source/tests/artifacts/se1l/integration_workspace_se1l
  2446. 211.83 s > [2026-09-02 09:05:33.603] @commands::integrate INFO : No integration state found, starting new integration
  2447. 211.83 s > [2026-09-02 09:05:33.603] @commands::integrate INFO : Gammaloop now integrates se1l@se1l, se1l@se1l_muv_shifted, se1l@se1l_rls_shifted
  2448. 211.83 s > [2026-09-02 09:05:33.603] @process::amplitude WARNING : External state 0 ('g', PDG 21, helicity +) is off shell: p^2 = +2.5e5, expected m^2 = +0e0 (|Δ| = +2.5e5). Fixed-helicity spinor/vector/tensor external states may be ill-defined at this kinematic point.
  2449. 211.83 s > field value
  2450. 211.83 s > span warm_up{integrand.name=se1l}
  2451. 211.83 s > [2026-09-02 09:05:33.603] @process::amplitude WARNING : External state 1 ('g', PDG 21, helicity -) is off shell: p^2 = +2.5e5, expected m^2 = +0e0 (|Δ| = +2.5e5). Fixed-helicity spinor/vector/tensor external states may be ill-defined at this kinematic point.
  2452. 211.83 s > field value
  2453. 211.83 s > span warm_up{integrand.name=se1l}
  2454. 211.83 s > [2026-09-02 09:05:33.604] @process::amplitude INFO : Input is above threshold: 1 existing threshold E-surfaces across 1/1 graph groups
  2455. 211.83 s > field value
  2456. 211.83 s > existing_esurfaces 1
  2457. 211.83 s > group_count 1
  2458. 211.83 s > groups_above_threshold 1
  2459. 211.83 s > integrand se1l
  2460. 211.83 s > span warm_up{integrand.name=se1l}
  2461. 211.83 s > threshold_status above threshold
  2462. 211.83 s > [2026-09-02 09:05:33.604] @process::amplitude INFO : overlap structure of group 0: [1: [0(2,3)]]
  2463. 211.83 s > field value
  2464. 211.83 s > span warm_up{integrand.name=se1l}
  2465. 211.83 s > [2026-09-02 09:05:33.615] @process::amplitude WARNING : External state 0 ('g', PDG 21, helicity +) is off shell: p^2 = +2.5e5, expected m^2 = +0e0 (|Δ| = +2.5e5). Fixed-helicity spinor/vector/tensor external states may be ill-defined at this kinematic point.
  2466. 211.83 s > field value
  2467. 211.83 s > span warm_up{integrand.name=se1l_muv_shifted}
  2468. 211.83 s > [2026-09-02 09:05:33.615] @process::amplitude WARNING : External state 1 ('g', PDG 21, helicity -) is off shell: p^2 = +2.5e5, expected m^2 = +0e0 (|Δ| = +2.5e5). Fixed-helicity spinor/vector/tensor external states may be ill-defined at this kinematic point.
  2469. 211.83 s > field value
  2470. 211.83 s > span warm_up{integrand.name=se1l_muv_shifted}
  2471. 211.83 s > [2026-09-02 09:05:33.615] @process::amplitude INFO : Input is above threshold: 1 existing threshold E-surfaces across 1/1 graph groups
  2472. 211.83 s > field value
  2473. 211.83 s > existing_esurfaces 1
  2474. 211.83 s > group_count 1
  2475. 211.83 s > groups_above_threshold 1
  2476. 211.83 s > integrand se1l_muv_shifted
  2477. 211.83 s > span warm_up{integrand.name=se1l_muv_shifted}
  2478. 211.83 s > threshold_status above threshold
  2479. 211.83 s > [2026-09-02 09:05:33.616] @process::amplitude INFO : overlap structure of group 0: [1: [0(2,3)]]
  2480. 211.83 s > field value
  2481. 211.83 s > span warm_up{integrand.name=se1l_muv_shifted}
  2482. 211.83 s > [2026-09-02 09:05:33.648] @process::amplitude WARNING : External state 0 ('g', PDG 21, helicity +) is off shell: p^2 = +2.5e5, expected m^2 = +0e0 (|Δ| = +2.5e5). Fixed-helicity spinor/vector/tensor external states may be ill-defined at this kinematic point.
  2483. 211.83 s > field value
  2484. 211.83 s > span warm_up{integrand.name=se1l_rls_shifted}
  2485. 211.83 s > [2026-09-02 09:05:33.648] @process::amplitude WARNING : External state 1 ('g', PDG 21, helicity -) is off shell: p^2 = +2.5e5, expected m^2 = +0e0 (|Δ| = +2.5e5). Fixed-helicity spinor/vector/tensor external states may be ill-defined at this kinematic point.
  2486. 211.83 s > field value
  2487. 211.83 s > span warm_up{integrand.name=se1l_rls_shifted}
  2488. 211.83 s > [2026-09-02 09:05:33.649] @process::amplitude INFO : Input is above threshold: 1 existing threshold E-surfaces across 1/1 graph groups
  2489. 211.83 s > field value
  2490. 211.83 s > existing_esurfaces 1
  2491. 211.83 s > group_count 1
  2492. 211.83 s > groups_above_threshold 1
  2493. 211.83 s > integrand se1l_rls_shifted
  2494. 211.83 s > span warm_up{integrand.name=se1l_rls_shifted}
  2495. 211.83 s > threshold_status above threshold
  2496. 211.83 s > ... omitted 1410 more lines; see full nextest output above
  2497. 211.83 s > =========================================
  2498. 211.83 s For full logs, run:
  2499. 211.83 s nix log /nix/store/gyvajj13r9n4dqbd2ss93zqm2svy6ai2-gammaloop-nextest-integration.drv
  2500. 211.93 s [0 built (1 failed), 0.0Run failed.