1. 0.08 s $ /nix/store/9ypz3flqsrl5xl495mm8h645gadjsxi1-coreutils-9.11/bin/timeout --kill-after=15s 7200s /nix/store/23zk8sgzamrbmj1fday15szf7f2279s8-nix-2.34.7/bin/nix --extra-experimental-features nix-command --extra-experimental-features flakes flake clone git+https://github.com/alphal00p/gammaloop --dest /tmp/nix-ci-worker/stable-pwd/repo/
  2. 0.09 s Cloning into '/tmp/nix-ci-worker/stable-pwd/repo'...
  3. 1.90 s remote: Enumerating objects: 57328 remote: Enumerating objects: 66524, done.
  4. 2.03 s remote: Counting objects: 0% (1/9196) remote: Counting objects: 1% (92/9196) remote: Counting objects: 2% (184/9196) remote: Counting objects: 3% (276/9196) remote: Counting objects: 4% (368/9196) remote: Counting objects: 5% (460/9196) remote: Counting objects: 6% (552/9196) remote: Counting objects: 7% (644/9196) remote: Counting objects: 8% (736/9196) remote: Counting objects: 9% (828/9196) remote: Counting objects: 10% (920/9196) remote: Counting objects: 11% (1012/9196) remote: Counting objects: 12% (1104/9196) remote: Counting objects: 13% (1196/9196) remote: Counting objects: 14% (1288/9196) remote: Counting objects: 15% (1380/9196) remote: Counting objects: 16% (1472/9196) remote: Counting objects: 17% (1564/9196) remote: Counting objects: 18% (1656/9196) remote: Counting objects: 19% (1748/9196) remote: Counting objects: 20% (1840/9196) remote: Counting objects: 21% (1932/9196) remote: Counting objects: 22% (2024/9196) remote: Counting objects: 23% (2116/9196) remote: Counting objects: 24% (2208/9196) remote: Counting objects: 25% (2299/9196) remote: Counting objects: 26% (2391/9196) remote: Counting objects: 27% (2483/9196) remote: Counting objects: 28% (2575/9196) remote: Counting objects: 29% (2667/9196) remote: Counting objects: 30% (2759/9196) remote: Counting objects: 31% (2851/9196) remote: Counting objects: 32% (2943/9196) remote: Counting objects: 33% (3035/9196) remote: Counting objects: 34% (3127/9196) remote: Counting objects: 35% (3219/9196) remote: Counting objects: 36% (3311/9196) remote: Counting objects: 37% (3403/9196) remote: Counting objects: 38% (3495/9196) remote: Counting objects: 39% (3587/9196) remote: Counting objects: 40% (3679/9196) remote: Counting objects: 41% (3771/9196) remote: Counting objects: 42% (3863/9196) remote: Counting objects: 43% (3955/9196) remote: Counting objects: 44% (4047/9196) remote: Counting objects: 45% (4139/9196) remote: Counting objects: 46% (4231/9196) remote: Counting objects: 47% (4323/9196) remote: Counting objects: 48% (4415/9196) remote: Counting objects: 49% (4507/9196) remote: Counting objects: 50% (4598/9196) remote: Counting objects: 51% (4690/9196) remote: Counting objects: 52% (4782/9196) remote: Counting objects: 53% (4874/9196) remote: Counting objects: 54% (4966/9196) remote: Counting objects: 55% (5058/9196) remote: Counting objects: 56% (5150/9196) remote: Counting objects: 57% (5242/9196) remote: Counting objects: 58% (5334/9196) remote: Counting objects: 59% (5426/9196) remote: Counting objects: 60% (5518/9196) remote: Counting objects: 61% (5610/9196) remote: Counting objects: 62% (5702/9196) remote: Counting objects: 63% (5794/9196) remote: Counting objects: 64% (5886/9196) remote: Counting objects: 65% (5978/9196) remote: Counting objects: 66% (6070/9196) remote: Counting objects: 67% (6162/9196) remote: Counting objects: 68% (6254/9196) remote: Counting objects: 69% (6346/9196) remote: Counting objects: 70% (6438/9196) remote: Counting objects: 71% (6530/9196) remote: Counting objects: 72% (6622/9196) remote: Counting objects: 73% (6714/9196) remote: Counting objects: 74% (6806/9196) remote: Counting objects: 75% (6897/9196) remote: Counting objects: 76% (6989/9196) remote: Counting objects: 77% (7081/9196) remote: Counting objects: 78% (7173/9196) remote: Counting objects: 79% (7265/9196) remote: Counting objects: 80% (7357/9196) remote: Counting objects: 81% (7449/9196) remote: Counting objects: 82% (7541/9196) remote: Counting objects: 83% (7633/9196) remote: Counting objects: 84% (7725/9196) remote: Counting objects: 85% (7817/9196) remote: Counting objects: 86% (7909/9196) remote: Counting objects: 87% (8001/9196) remote: Counting objects: 88% (8093/9196) remote: Counting objects: 89% (8185/9196) remote: Counting objects: 90% (8277/9196) remote: Counting objects: 91% (8369/9196) remote: Counting objects: 92% (8461/9196) remote: Counting objects: 93% (8553/9196) remote: Counting objects: 94% (8645/9196) remote: Counting objects: 95% (8737/9196) remote: Counting objects: 96% (8829/9196) remote: Counting objects: 97% (8921/9196) remote: Counting objects: 98% (9013/9196) remote: Counting objects: 99% (9105/9196) remote: Counting objects: 100% (9196/9196) remote: Counting objects: 100% (9196/9196), done.
  5. 4.94 s remote: Compressing objects: 0% (1/2242) remote: Compressing objects: 1% (23/2242) remote: Compressing objects: 2% (45/2242) remote: Compressing objects: 3% (68/2242) remote: Compressing objects: 4% (90/2242) remote: Compressing objects: 5% (113/2242) remote: Compressing objects: 6% (135/2242) remote: Compressing objects: 7% (157/2242) remote: Compressing objects: 8% (180/2242) remote: Compressing objects: 9% (202/2242) remote: Compressing objects: 10% (225/2242) remote: Compressing objects: 11% (247/2242) remote: Compressing objects: 12% (270/2242) remote: Compressing objects: 13% (292/2242) remote: Compressing objects: 14% (314/2242) remote: Compressing objects: 15% (337/2242) remote: Compressing objects: 16% (359/2242) remote: Compressing objects: 17% (382/2242) remote: Compressing objects: 18% (404/2242) remote: Compressing objects: 19% (426/2242) remote: Compressing objects: 20% (449/2242) remote: Compressing objects: 21% (471/2242) remote: Compressing objects: 21% (482/2242) remote: Compressing objects: 22% (494/2242) remote: Compressing objects: 23% (516/2242) remote: Compressing objects: 24% (539/2242) remote: Compressing objects: 25% (561/2242) remote: Compressing objects: 25% (581/2242) remote: Compressing objects: 26% (583/2242) remote: Compressing objects: 27% (606/2242) remote: Compressing objects: 28% (628/2242) remote: Compressing objects: 29% (651/2242) remote: Compressing objects: 30% (673/2242) remote: Compressing objects: 31% (696/2242) remote: Compressing objects: 32% (718/2242) remote: Compressing objects: 33% (740/2242) remote: Compressing objects: 34% (763/2242) remote: Compressing objects: 35% (785/2242) remote: Compressing objects: 36% (808/2242) remote: Compressing objects: 37% (830/2242) remote: Compressing objects: 38% (852/2242) remote: Compressing objects: 39% (875/2242) remote: Compressing objects: 40% (897/2242) remote: Compressing objects: 41% (920/2242) remote: Compressing objects: 42% (942/2242) remote: Compressing objects: 43% (965/2242) remote: Compressing objects: 44% (987/2242) remote: Compressing objects: 45% (1009/2242) remote: Compressing objects: 46% (1032/2242) remote: Compressing objects: 47% (1054/2242) remote: Compressing objects: 48% (1077/2242) remote: Compressing objects: 49% (1099/2242) remote: Compressing objects: 50% (1121/2242) remote: Compressing objects: 51% (1144/2242) remote: Compressing objects: 52% (1166/2242) remote: Compressing objects: 53% (1189/2242) remote: Compressing objects: 54% (1211/2242) remote: Compressing objects: 55% (1234/2242) remote: Compressing objects: 56% (1256/2242) remote: Compressing objects: 57% (1278/2242) remote: Compressing objects: 58% (1301/2242) remote: Compressing objects: 59% (1323/2242) remote: Compressing objects: 60% (1346/2242) remote: Compressing objects: 61% (1368/2242) remote: Compressing objects: 62% (1391/2242) remote: Compressing objects: 63% (1413/2242) remote: Compressing objects: 64% (1435/2242) remote: Compressing objects: 65% (1458/2242) remote: Compressing objects: 66% (1480/2242) remote: Compressing objects: 67% (1503/2242) remote: Compressing objects: 68% (1525/2242) remote: Compressing objects: 69% (1547/2242) remote: Compressing objects: 70% (1570/2242) remote: Compressing objects: 71% (1592/2242) remote: Compressing objects: 72% (1615/2242) remote: Compressing objects: 73% (1637/2242) remote: Compressing objects: 74% (1660/2242) remote: Compressing objects: 75% (1682/2242) remote: Compressing objects: 76% (1704/2242) remote: Compressing objects: 77% (1727/2242) remote: Compressing objects: 78% (1749/2242) remote: Compressing objects: 79% (1772/2242) remote: Compressing objects: 80% (1794/2242) remote: Compressing objects: 81% (1817/2242) remote: Compressing objects: 82% (1839/2242) remote: Compressing objects: 83% (1861/2242) remote: Compressing objects: 84% (1884/2242) remote: Compressing objects: 85% (1906/2242) remote: Compressing objects: 86% (1929/2242) remote: Compressing objects: 87% (1951/2242) remote: Compressing objects: 87% (1953/2242) remote: Compressing objects: 88% (1973/2242) remote: Compressing objects: 89% (1996/2242) remote: Compressing objects: 90% (2018/2242) remote: Compressing objects: 91% (2041/2242) remote: Compressing objects: 92% (2063/2242) remote: Compressing objects: 93% (2086/2242) remote: Compressing objects: 94% (2108/2242) remote: Compressing objects: 95% (2130/2242) remote: Compressing objects: 96% (2153/2242) remote: Compressing objects: 97% (2175/2242) remote: Compressing objects: 98% (2198/2242) remote: Compressing objects: 99% (2220/2242) remote: Compressing objects: 100% (2242/2242) remote: Compressing objects: 100% (2242/2242), done.
  6. 8.52 s Receiving objects: 0% (1/66524) Receiving objects: 1% (666/66524) Receiving objects: 2% (1331/66524) Receiving objects: 3% (1996/66524) Receiving objects: 4% (2661/66524) Receiving objects: 5% (3327/66524) Receiving objects: 6% (3992/66524) Receiving objects: 7% (4657/66524) Receiving objects: 8% (5322/66524) Receiving objects: 9% (5988/66524) Receiving objects: 10% (6653/66524) Receiving objects: 11% (7318/66524), 14.21 MiB | 28.41 MiB/s Receiving objects: 12% (7983/66524), 14.21 MiB | 28.41 MiB/s Receiving objects: 13% (8649/66524), 14.21 MiB | 28.41 MiB/s Receiving objects: 14% (9314/66524), 14.21 MiB | 28.41 MiB/s Receiving objects: 15% (9979/66524), 14.21 MiB | 28.41 MiB/s Receiving objects: 16% (10644/66524), 14.21 MiB | 28.41 MiB/s Receiving objects: 17% (11310/66524), 14.21 MiB | 28.41 MiB/s Receiving objects: 18% (11975/66524), 14.21 MiB | 28.41 MiB/s Receiving objects: 19% (12640/66524), 14.21 MiB | 28.41 MiB/s Receiving objects: 20% (13305/66524), 14.21 MiB | 28.41 MiB/s Receiving objects: 21% (13971/66524), 14.21 MiB | 28.41 MiB/s Receiving objects: 22% (14636/66524), 14.21 MiB | 28.41 MiB/s Receiving objects: 23% (15301/66524), 14.21 MiB | 28.41 MiB/s Receiving objects: 24% (15966/66524), 14.21 MiB | 28.41 MiB/s Receiving objects: 25% (16631/66524), 14.21 MiB | 28.41 MiB/s Receiving objects: 26% (17297/66524), 14.21 MiB | 28.41 MiB/s Receiving objects: 27% (17962/66524), 14.21 MiB | 28.41 MiB/s Receiving objects: 28% (18627/66524), 14.21 MiB | 28.41 MiB/s Receiving objects: 29% (19292/66524), 14.21 MiB | 28.41 MiB/s Receiving objects: 30% (19958/66524), 14.21 MiB | 28.41 MiB/s Receiving objects: 31% (20623/66524), 14.21 MiB | 28.41 MiB/s Receiving objects: 32% (21288/66524), 14.21 MiB | 28.41 MiB/s Receiving objects: 33% (21953/66524), 14.21 MiB | 28.41 MiB/s Receiving objects: 34% (22619/66524), 14.21 MiB | 28.41 MiB/s Receiving objects: 35% (23284/66524), 14.21 MiB | 28.41 MiB/s Receiving objects: 36% (23949/66524), 14.21 MiB | 28.41 MiB/s Receiving objects: 37% (24614/66524), 14.21 MiB | 28.41 MiB/s Receiving objects: 38% (25280/66524), 14.21 MiB | 28.41 MiB/s Receiving objects: 38% (25633/66524), 14.21 MiB | 28.41 MiB/s Receiving objects: 39% (25945/66524), 26.44 MiB | 26.43 MiB/s Receiving objects: 40% (26610/66524), 26.44 MiB | 26.43 MiB/s Receiving objects: 41% (27275/66524), 26.44 MiB | 26.43 MiB/s Receiving objects: 42% (27941/66524), 26.44 MiB | 26.43 MiB/s Receiving objects: 43% (28606/66524), 26.44 MiB | 26.43 MiB/s Receiving objects: 44% (29271/66524), 26.44 MiB | 26.43 MiB/s Receiving objects: 45% (29936/66524), 26.44 MiB | 26.43 MiB/s Receiving objects: 46% (30602/66524), 26.44 MiB | 26.43 MiB/s Receiving objects: 47% (31267/66524), 26.44 MiB | 26.43 MiB/s Receiving objects: 48% (31932/66524), 26.44 MiB | 26.43 MiB/s Receiving objects: 49% (32597/66524), 26.44 MiB | 26.43 MiB/s Receiving objects: 50% (33262/66524), 26.44 MiB | 26.43 MiB/s Receiving objects: 51% (33928/66524), 26.44 MiB | 26.43 MiB/s Receiving objects: 52% (34593/66524), 26.44 MiB | 26.43 MiB/s Receiving objects: 53% (35258/66524), 26.44 MiB | 26.43 MiB/s Receiving objects: 54% (35923/66524), 26.44 MiB | 26.43 MiB/s Receiving objects: 55% (36589/66524), 26.44 MiB | 26.43 MiB/s Receiving objects: 56% (37254/66524), 39.00 MiB | 26.00 MiB/s Receiving objects: 57% (37919/66524), 39.00 MiB | 26.00 MiB/s Receiving objects: 58% (38584/66524), 39.00 MiB | 26.00 MiB/s Receiving objects: 59% (39250/66524), 39.00 MiB | 26.00 MiB/s Receiving objects: 60% (39915/66524), 39.00 MiB | 26.00 MiB/s Receiving objects: 61% (40580/66524), 39.00 MiB | 26.00 MiB/s Receiving objects: 62% (41245/66524), 39.00 MiB | 26.00 MiB/s Receiving objects: 63% (41911/66524), 39.00 MiB | 26.00 MiB/s Receiving objects: 64% (42576/66524), 39.00 MiB | 26.00 MiB/s Receiving objects: 65% (43241/66524), 39.00 MiB | 26.00 MiB/s Receiving objects: 66% (43906/66524), 39.00 MiB | 26.00 MiB/s Receiving objects: 66% (44522/66524), 39.00 MiB | 26.00 MiB/s Receiving objects: 67% (44572/66524), 53.62 MiB | 26.81 MiB/s Receiving objects: 68% (45237/66524), 53.62 MiB | 26.81 MiB/s Receiving objects: 69% (45902/66524), 53.62 MiB | 26.81 MiB/s Receiving objects: 70% (46567/66524), 53.62 MiB | 26.81 MiB/s Receiving objects: 71% (47233/66524), 53.62 MiB | 26.81 MiB/s Receiving objects: 72% (47898/66524), 53.62 MiB | 26.81 MiB/s Receiving objects: 73% (48563/66524), 53.62 MiB | 26.81 MiB/s Receiving objects: 74% (49228/66524), 67.66 MiB | 27.06 MiB/s Receiving objects: 75% (49893/66524), 67.66 MiB | 27.06 MiB/s Receiving objects: 76% (50559/66524), 67.66 MiB | 27.06 MiB/s Receiving objects: 77% (51224/66524), 67.66 MiB | 27.06 MiB/s Receiving objects: 78% (51889/66524), 67.66 MiB | 27.06 MiB/s Receiving objects: 79% (52554/66524), 67.66 MiB | 27.06 MiB/s Receiving objects: 80% (53220/66524), 67.66 MiB | 27.06 MiB/s Receiving objects: 81% (53885/66524), 67.66 MiB | 27.06 MiB/s Receiving objects: 82% (54550/66524), 67.66 MiB | 27.06 MiB/s Receiving objects: 83% (55215/66524), 67.66 MiB | 27.06 MiB/s Receiving objects: 84% (55881/66524), 67.66 MiB | 27.06 MiB/s Receiving objects: 85% (56546/66524), 67.66 MiB | 27.06 MiB/s Receiving objects: 86% (57211/66524), 67.66 MiB | 27.06 MiB/s Receiving objects: 87% (57876/66524), 67.66 MiB | 27.06 MiB/s Receiving objects: 88% (58542/66524), 67.66 MiB | 27.06 MiB/s Receiving objects: 89% (59207/66524), 67.66 MiB | 27.06 MiB/s Receiving objects: 90% (59872/66524), 67.66 MiB | 27.06 MiB/s Receiving objects: 91% (60537/66524), 67.66 MiB | 27.06 MiB/s Receiving objects: 91% (60547/66524), 67.66 MiB | 27.06 MiB/s Receiving objects: 92% (61203/66524), 83.21 MiB | 27.73 MiB/s Receiving objects: 93% (61868/66524), 83.21 MiB | 27.73 MiB/s Receiving objects: 94% (62533/66524), 83.21 MiB | 27.73 MiB/s Receiving objects: 95% (63198/66524), 83.21 MiB | 27.73 MiB/s Receiving objects: 96% (63864/66524), 83.21 MiB | 27.73 MiB/s Receiving objects: 97% (64529/66524), 83.21 MiB | 27.73 MiB/s Receiving objects: 98% (65194/66524), 83.21 MiB | 27.73 MiB/s Receiving objects: 99% (65859/66524), 83.21 MiB | 27.73 MiB/s remote: Total 66524 (delta 7382), reused 7363 (delta 6666), pack-reused 57328 (from 1)
  7. 8.53 s Receiving objects: 100% (66524/66524), 97.95 MiB | 27.68 MiB/s Receiving objects: 100% (66524/66524), 99.37 MiB | 27.81 MiB/s, done.
  8. 9.53 s Resolving deltas: 0% (0/46479) Resolving deltas: 1% (465/46479) Resolving deltas: 2% (931/46479) Resolving deltas: 3% (1395/46479) Resolving deltas: 4% (1860/46479) Resolving deltas: 5% (2325/46479) Resolving deltas: 6% (2789/46479) Resolving deltas: 7% (3254/46479) Resolving deltas: 8% (3720/46479) Resolving deltas: 9% (4184/46479) Resolving deltas: 10% (4648/46479) Resolving deltas: 11% (5113/46479) Resolving deltas: 12% (5578/46479) Resolving deltas: 13% (6043/46479) Resolving deltas: 14% (6508/46479) Resolving deltas: 15% (6973/46479) Resolving deltas: 16% (7437/46479) Resolving deltas: 17% (7902/46479) Resolving deltas: 18% (8367/46479) Resolving deltas: 19% (8832/46479) Resolving deltas: 20% (9296/46479) Resolving deltas: 21% (9763/46479) Resolving deltas: 22% (10226/46479) Resolving deltas: 23% (10691/46479) Resolving deltas: 24% (11155/46479) Resolving deltas: 25% (11620/46479) Resolving deltas: 26% (12085/46479) Resolving deltas: 27% (12550/46479) Resolving deltas: 28% (13015/46479) Resolving deltas: 29% (13479/46479) Resolving deltas: 30% (13944/46479) Resolving deltas: 31% (14409/46479) Resolving deltas: 32% (14874/46479) Resolving deltas: 33% (15340/46479) Resolving deltas: 34% (15803/46479) Resolving deltas: 35% (16269/46479) Resolving deltas: 36% (16733/46479) Resolving deltas: 37% (17198/46479) Resolving deltas: 38% (17663/46479) Resolving deltas: 39% (18130/46479) Resolving deltas: 40% (18593/46479) Resolving deltas: 41% (19058/46479) Resolving deltas: 42% (19522/46479) Resolving deltas: 43% (19986/46479) Resolving deltas: 44% (20451/46479) Resolving deltas: 45% (20919/46479) Resolving deltas: 46% (21381/46479) Resolving deltas: 47% (21846/46479) Resolving deltas: 48% (22310/46479) Resolving deltas: 49% (22776/46479) Resolving deltas: 50% (23240/46479) Resolving deltas: 51% (23705/46479) Resolving deltas: 52% (24170/46479) Resolving deltas: 53% (24634/46479) Resolving deltas: 54% (25101/46479) Resolving deltas: 55% (25564/46479) Resolving deltas: 56% (26030/46479) Resolving deltas: 57% (26494/46479) Resolving deltas: 58% (26958/46479) Resolving deltas: 59% (27423/46479) Resolving deltas: 60% (27888/46479) Resolving deltas: 61% (28353/46479) Resolving deltas: 62% (28817/46479) Resolving deltas: 63% (29282/46479) Resolving deltas: 64% (29747/46479) Resolving deltas: 65% (30212/46479) Resolving deltas: 66% (30677/46479) Resolving deltas: 67% (31141/46479) Resolving deltas: 68% (31606/46479) Resolving deltas: 69% (32071/46479) Resolving deltas: 70% (32536/46479) Resolving deltas: 71% (33001/46479) Resolving deltas: 72% (33465/46479) Resolving deltas: 73% (33930/46479) Resolving deltas: 74% (34395/46479) Resolving deltas: 75% (34860/46479) Resolving deltas: 76% (35325/46479) Resolving deltas: 77% (35789/46479) Resolving deltas: 78% (36254/46479) Resolving deltas: 79% (36720/46479) Resolving deltas: 80% (37184/46479) Resolving deltas: 81% (37648/46479) Resolving deltas: 82% (38114/46479) Resolving deltas: 83% (38578/46479) Resolving deltas: 84% (39043/46479) Resolving deltas: 85% (39508/46479) Resolving deltas: 86% (39972/46479) Resolving deltas: 87% (40437/46479) Resolving deltas: 88% (40902/46479) Resolving deltas: 89% (41367/46479) Resolving deltas: 90% (41832/46479) Resolving deltas: 91% (42296/46479) Resolving deltas: 92% (42761/46479) Resolving deltas: 93% (43226/46479) Resolving deltas: 94% (43692/46479) Resolving deltas: 95% (44156/46479) Resolving deltas: 96% (44620/46479) Resolving deltas: 97% (45085/46479) Resolving deltas: 98% (45550/46479) Resolving deltas: 99% (46015/46479) Resolving deltas: 99% (46122/46479) Resolving deltas: 100% (46479/46479) Resolving deltas: 100% (46479/46479), done.
  9. 9.92 s Fetching commit 21b5487d2e568713832af8be542a7570e3bff6a6 for docs ...
  10. 9.92 s $ /nix/store/bcnisk3ydfgv26v2gw3zlky24g00yww2-git-2.54.0/bin/git fetch origin 21b5487d2e568713832af8be542a7570e3bff6a6
  11. 10.53 s From https://github.com/alphal00p/gammaloop
  12. 10.53 s * branch 21b5487d2e568713832af8be542a7570e3bff6a6 -> FETCH_HEAD
  13. 10.57 s $ /nix/store/9ypz3flqsrl5xl495mm8h645gadjsxi1-coreutils-9.11/bin/timeout --kill-after=15s 7200s /nix/store/bcnisk3ydfgv26v2gw3zlky24g00yww2-git-2.54.0/bin/git -c advice.detachedHead=false checkout 21b5487d2e568713832af8be542a7570e3bff6a6
  14. 10.83 s HEAD is now at 21b5487d2 fix nix develop error
  15. 10.85 s $ /nix/store/9ypz3flqsrl5xl495mm8h645gadjsxi1-coreutils-9.11/bin/timeout --kill-after=15s 7200s /nix/store/23zk8sgzamrbmj1fday15szf7f2279s8-nix-2.34.7/bin/nix --extra-experimental-features nix-command --extra-experimental-features flakes --log-format internal-json run .#packages.x86_64-linux.nix-ci-check-gammaloop-doctest --print-build-logs
  16. 11.21 s stdenv.isDarwin is deprecated, use stdenv.hostPlatform.isDarwin instead
  17. 15.17 s
  18. 15.56 s Downloading cached boehm-gc from https://cache.nix-ci.com
  19. 15.58 s Downloading cached busybox from https://cache.nix-ci.com
  20. 15.58 s Downloading cached aws-c-common from https://cache.nix-ci.com
  21. 15.58 s Downloading cached editline-1.17.1-unstable-2025-05 from https://cache.nix-ci.com
  22. 15.58 s Downloading cached libarchive-3.8.9-lib from https://cache.nix-ci.com
  23. 15.58 s Downloading cached libcpuid from https://cache.nix-ci.com
  24. 15.58 s Downloading cached libseccomp-2.6.1-lib from https://cache.nix-ci.com
  25. 15.58 s Downloading cached libsodium-1.0.22-unstable-2026-07 from https://cache.nix-ci.com
  26. 15.58 s Downloading cached lowdown-3.0.1-lib from https://cache.nix-ci.com
  27. 15.58 s Downloading cached icu4c from https://cache.nix-ci.com
  28. 15.58 s Downloading cached llhttp from https://cache.nix-ci.com
  29. 15.58 s Downloading cached s2n-tls from https://cache.nix-ci.com
  30. 15.58 s Downloading cached hwloc-2.14.0-lib from https://cache.nix-ci.com
  31. 15.71 s Downloaded cached boehm-gc (312 KiB) in 151ms
  32. 15.71 s Progress: 0 of 1 built, 1 of 39 downloaded from cache (12 downloading)
  33. 15.73 s Downloaded cached busybox (230 KiB) in 146ms
  34. 15.73 s Progress: 0 of 1 built, 2 of 39 downloaded from cache (11 downloading)
  35. 15.74 s Downloaded cached editline-1.17.1-unstable-2025-05 (58 KiB) in 157ms
  36. 15.74 s Downloaded cached llhttp (89 KiB) in 157ms
  37. 15.74 s Progress: 0 of 1 built, 3 of 39 downloaded from cache (10 downloading)
  38. 15.74 s Downloaded cached libseccomp-2.6.1-lib (189 KiB) in 158ms
  39. 15.74 s Downloaded cached lowdown-3.0.1-lib (341 KiB) in 160ms
  40. 15.74 s Progress: 0 of 1 built, 4 of 39 downloaded from cache (9 downloading)
  41. 15.74 s Downloading cached libgit2-1.9.7-lib from https://cache.nix-ci.com
  42. 15.74 s Downloaded cached libcpuid (326 KiB) in 161ms
  43. 15.74 s Progress: 0 of 1 built, 5 of 39 downloaded from cache (9 downloading)
  44. 15.74 s Progress: 0 of 1 built, 6 of 39 downloaded from cache (8 downloading)
  45. 15.74 s Downloaded cached hwloc-2.14.0-lib (458 KiB) in 161ms
  46. 15.74 s Progress: 0 of 1 built, 7 of 39 downloaded from cache (7 downloading)
  47. 15.74 s Progress: 0 of 1 built, 8 of 39 downloaded from cache (6 downloading)
  48. 15.74 s Downloading cached onetbb from https://cache.nix-ci.com
  49. 15.74 s Downloaded cached libsodium-1.0.22-unstable-2026-07 (669 KiB) in 161ms
  50. 15.74 s Progress: 0 of 1 built, 9 of 39 downloaded from cache (6 downloading)
  51. 15.74 s Downloaded cached s2n-tls (1.3 MiB) in 161ms
  52. 15.74 s Progress: 0 of 1 built, 10 of 39 downloaded from cache (5 downloading)
  53. 15.74 s Downloaded cached aws-c-common (1.1 MiB) in 164ms
  54. 15.74 s Progress: 0 of 1 built, 11 of 39 downloaded from cache (4 downloading)
  55. 15.74 s Downloading cached aws-c-cal from https://cache.nix-ci.com
  56. 15.74 s Downloading cached aws-c-compression from https://cache.nix-ci.com
  57. 15.74 s Downloading cached aws-c-sdkutils from https://cache.nix-ci.com
  58. 15.75 s Downloading cached aws-checksums from https://cache.nix-ci.com
  59. 15.75 s Downloaded cached libarchive-3.8.9-lib (961 KiB) in 174ms
  60. 15.75 s Progress: 0 of 1 built, 12 of 39 downloaded from cache (7 downloading)
  61. 15.87 s Downloaded cached aws-checksums (86 KiB) in 127ms
  62. 15.87 s Progress: 0 of 1 built, 13 of 39 downloaded from cache (6 downloading)
  63. 15.88 s Downloaded cached aws-c-compression (31 KiB) in 130ms
  64. 15.88 s Downloaded cached aws-c-sdkutils (155 KiB) in 131ms
  65. 15.88 s Progress: 0 of 1 built, 14 of 39 downloaded from cache (5 downloading)
  66. 15.88 s Progress: 0 of 1 built, 15 of 39 downloaded from cache (4 downloading)
  67. 15.88 s Downloaded cached aws-c-cal (158 KiB) in 132ms
  68. 15.88 s Progress: 0 of 1 built, 16 of 39 downloaded from cache (3 downloading)
  69. 15.88 s Downloading cached aws-c-io from https://cache.nix-ci.com
  70. 15.88 s Downloaded cached onetbb (626 KiB) in 137ms
  71. 15.88 s Progress: 0 of 1 built, 17 of 39 downloaded from cache (3 downloading)
  72. 15.88 s Downloaded cached libgit2-1.9.7-lib (1.6 MiB) in 140ms
  73. 15.88 s Downloading cached libblake3 from https://cache.nix-ci.com
  74. 15.88 s Progress: 0 of 1 built, 18 of 39 downloaded from cache (3 downloading)
  75. 15.89 s Downloaded cached icu4c (39.5 MiB) in 309ms
  76. 15.89 s Progress: 0 of 1 built, 19 of 39 downloaded from cache (2 downloading)
  77. 15.89 s Downloading cached boost from https://cache.nix-ci.com
  78. 15.99 s Downloaded cached libblake3 (117 KiB) in 105ms
  79. 15.99 s Progress: 0 of 1 built, 20 of 39 downloaded from cache (2 downloading)
  80. 15.99 s Downloaded cached aws-c-io (648 KiB) in 111ms
  81. 15.99 s Progress: 0 of 1 built, 21 of 39 downloaded from cache (1 downloading)
  82. 15.99 s Downloading cached aws-c-event-stream from https://cache.nix-ci.com
  83. 15.99 s Downloading cached aws-c-http from https://cache.nix-ci.com
  84. 16.03 s Downloaded cached boost (14.5 MiB) in 137ms
  85. 16.03 s Progress: 0 of 1 built, 22 of 39 downloaded from cache (2 downloading)
  86. 16.03 s Downloading cached nix-util from https://cache.nix-ci.com
  87. 16.13 s Downloaded cached aws-c-event-stream (176 KiB) in 143ms
  88. 16.13 s Progress: 0 of 1 built, 23 of 39 downloaded from cache (2 downloading)
  89. 16.13 s Downloaded cached aws-c-http (641 KiB) in 144ms
  90. 16.13 s Progress: 0 of 1 built, 24 of 39 downloaded from cache (1 downloading)
  91. 16.13 s Downloading cached aws-c-auth from https://cache.nix-ci.com
  92. 16.13 s Downloading cached aws-c-mqtt from https://cache.nix-ci.com
  93. 16.14 s Downloaded cached nix-util (2.4 MiB) in 112ms
  94. 16.14 s Progress: 0 of 1 built, 25 of 39 downloaded from cache (2 downloading)
  95. 16.14 s Downloading cached nix-nswrapper from https://cache.nix-ci.com
  96. 16.15 s Downloaded cached aws-c-auth (387 KiB) in 15ms
  97. 16.15 s Progress: 0 of 1 built, 26 of 39 downloaded from cache (2 downloading)
  98. 16.15 s Downloading cached aws-c-s3 from https://cache.nix-ci.com
  99. 16.15 s Downloaded cached nix-nswrapper (131 KiB) in 11ms
  100. 16.15 s Progress: 0 of 1 built, 27 of 39 downloaded from cache (2 downloading)
  101. 16.15 s Downloaded cached aws-c-mqtt (557 KiB) in 18ms
  102. 16.15 s Progress: 0 of 1 built, 28 of 39 downloaded from cache (1 downloading)
  103. 16.17 s Downloaded cached aws-c-s3 (384 KiB) in 15ms
  104. 16.17 s Progress: 0 of 1 built, 29 of 39 downloaded from cache
  105. 16.17 s Downloading cached aws-crt-cpp from https://cache.nix-ci.com
  106. 16.18 s Downloaded cached aws-crt-cpp (979 KiB) in 13ms
  107. 16.18 s Progress: 0 of 1 built, 30 of 39 downloaded from cache
  108. 16.18 s Downloading cached nix-store from https://cache.nix-ci.com
  109. 16.21 s Downloaded cached nix-store (5.8 MiB) in 30ms
  110. 16.21 s Progress: 0 of 1 built, 31 of 39 downloaded from cache
  111. 16.21 s Downloading cached nix-fetchers from https://cache.nix-ci.com
  112. 16.21 s Downloading cached nix-main from https://cache.nix-ci.com
  113. 16.23 s Downloaded cached nix-main (393 KiB) in 15ms
  114. 16.23 s Progress: 0 of 1 built, 32 of 39 downloaded from cache (1 downloading)
  115. 16.23 s Downloaded cached nix-fetchers (1.5 MiB) in 18ms
  116. 16.23 s Progress: 0 of 1 built, 33 of 39 downloaded from cache
  117. 16.23 s Downloading cached nix-expr from https://cache.nix-ci.com
  118. 16.25 s Downloaded cached nix-expr (3.3 MiB) in 24ms
  119. 16.25 s Progress: 0 of 1 built, 34 of 39 downloaded from cache
  120. 16.25 s Downloading cached nix-flake from https://cache.nix-ci.com
  121. 16.27 s Downloaded cached nix-flake (956 KiB) in 14ms
  122. 16.27 s Progress: 0 of 1 built, 35 of 39 downloaded from cache
  123. 16.27 s Downloading cached nix-cmd from https://cache.nix-ci.com
  124. 16.28 s Downloaded cached nix-cmd (1 MiB) in 14ms
  125. 16.28 s Progress: 0 of 1 built, 36 of 39 downloaded from cache
  126. 16.28 s Downloading cached nix from https://cache.nix-ci.com
  127. 16.31 s Downloaded cached nix (3.9 MiB) in 24ms
  128. 16.31 s Progress: 0 of 1 built, 37 of 39 downloaded from cache
  129. 16.31 s Downloading cached nix from https://cache.nix-ci.com
  130. 16.32 s Downloaded cached nix (8848 B) in 12ms
  131. 16.32 s Progress: 0 of 1 built, 38 of 39 downloaded from cache
  132. 16.32 s Downloading cached nix-ci-check-gammaloop-doctest from https://cache.nix-ci.com
  133. 16.33 s Downloaded cached nix-ci-check-gammaloop-doctest (1008 B) in 5ms
  134. 16.33 s Progress: 0 of 1 built, 39 of 39 downloaded from cache
  135. 17.04 s evaluating derivation 'gevaluation warning: stdenv.isDarwin is deprecated, use stdenv.hostPlatform.isDarwin instead
  136. 20.03 s copying '/nix/store/rdcn evaluating derivation 'g querying gammaloop-works querying info about miss querying gammaloop-works [0/1 built, 0.0 KiB DL] [1/0/1 built, 0.0 KiB DLgammaloop-workspace-doctest> Running phase: unpackPhase
  137. 20.04 s gammaloop-workspace-doctest> unpacking source archive /nix/store/5afz06g4vsphrihpxicbxvm3sk5psnll-source
  138. 20.17 s gammaloop-workspace-doctest> source root is source
  139. 20.21 s gammaloop-workspace-doctest> Running phase: patchPhase
  140. 20.22 s gammaloop-workspace-doctest> Executing configureCargoCommonVars
  141. 20.22 s gammaloop-workspace-doctest> decompressing cargo artifacts from /nix/store/72wdcnp633ang33qg6wvb90brvf1679y-gammaloop-workspace-deps-deps-0.1.0/target.tar.zst to target
  142. 23.36 s gammaloop-workspace-doctest> Running phase: updateAutotoolsGnuConfigScriptsPhase
  143. 23.43 s gammaloop-workspace-doctest> Running phase: configurePhase
  144. 23.44 s gammaloop-workspace-doctest> will append /build/source/.cargo-home/config.toml with contents of /nix/store/29aa708jkn8wd8vjwja1a5gh8k8wpi2b-vendor-cargo-deps/config.toml
  145. 23.44 s gammaloop-workspace-doctest> default configurePhase, nothing to do
  146. 23.44 s gammaloop-workspace-doctest> Running phase: buildPhase
  147. 23.45 s gammaloop-workspace-doctest> +++ command cargo --version
  148. 23.46 s gammaloop-workspace-doctest> cargo 1.98.0 (797e8a9bc 2026-08-05)
  149. 23.49 s gammaloop-workspace-doctest> +++ command cargo test --profile ci-optim --doc --locked --workspace --features gammaloop-api/cli,gammaloop-tracing-filter/clap,gammaloop-tracing-filter/symbolica,idenso/bincode,idenso/reference-cases,linnet/bincode,linnet/drawing,linnet/nodestore-vec,linnet/rkyv,linnet/serde,linnet/symbolica,spenso-macros/shadowing,spenso/shadowing,symbolica/tracing_max_level_info
  150. 24.20 s gammaloop-workspace-doctest> Compiling target-lexicon v0.13.5
  151. 24.21 s gammaloop-workspace-doctest> Compiling symbolica v2.2.0 (https://github.com/symbolica-dev/symbolica?branch=dev#0441bd7a)
  152. 24.21 s gammaloop-workspace-doctest> Compiling maplit v1.0.2
  153. 24.22 s gammaloop-workspace-doctest> Compiling gammaloop-tracing-filter-macros v0.1.0 (/build/source/crates/gammaloop-tracing-filter-macros)
  154. 24.23 s gammaloop-workspace-doctest> Compiling vakint v0.1.2 (/build/source/crates/vakint)
  155. 24.23 s gammaloop-workspace-doctest> Compiling gammalooprs v0.3.4 (/build/source/crates/gammalooprs)
  156. 24.24 s gammaloop-workspace-doctest> Compiling alphal00p-docs-macros v0.1.0 (/build/source/crates/alphal00p-docs-macros)
  157. 24.24 s gammaloop-workspace-doctest> Compiling alphal00p-docs-schema v0.1.0 (/build/source/crates/alphal00p-docs-schema)
  158. 24.24 s gammaloop-workspace-doctest> Compiling rustc_version v0.4.1
  159. 24.24 s gammaloop-workspace-doctest> Compiling bincode v1.3.3
  160. 24.24 s gammaloop-workspace-doctest> Compiling target-triple v1.0.1
  161. 24.24 s gammaloop-workspace-doctest> Compiling iai-callgrind-runner v0.14.2
  162. 24.24 s gammaloop-workspace-doctest> Compiling gungraun-runner v0.18.2
  163. 24.25 s gammaloop-workspace-doctest> Compiling gammaloop-integration-tests v0.1.0 (/build/source/tests)
  164. 24.38 s gammaloop-workspace-doctest> Compiling test-log-core v0.2.20
  165. 24.40 s gammaloop-workspace-doctest> Compiling wait-timeout v0.2.1
  166. 24.40 s gammaloop-workspace-doctest> Compiling quick-error v1.2.3
  167. 24.47 s gammaloop-workspace-doctest> Compiling iai-callgrind v0.14.2
  168. 24.50 s gammaloop-workspace-doctest> Compiling bit-vec v0.8.0
  169. 24.72 s gammaloop-workspace-doctest> Compiling bit-set v0.8.0
  170. 24.83 s gammaloop-workspace-doctest> Compiling rusty-fork v0.3.1
  171. 24.89 s gammaloop-workspace-doctest> Compiling iai-callgrind-macros v0.5.1
  172. 24.90 s gammaloop-workspace-doctest> Compiling rand_xorshift v0.4.0
  173. 24.90 s gammaloop-workspace-doctest> Compiling console v0.15.11
  174. 24.93 s gammaloop-workspace-doctest> Compiling base64 v0.21.7
  175. 25.04 s gammaloop-workspace-doctest> Compiling termcolor v1.4.1
  176. 25.05 s gammaloop-workspace-doctest> Compiling glob v0.3.4
  177. 25.10 s gammaloop-workspace-doctest> Compiling unarray v0.1.4
  178. 25.13 s gammaloop-workspace-doctest> Compiling gungraun-macros v0.8.0
  179. 25.35 s gammaloop-workspace-doctest> Compiling similar-asserts v1.7.0
  180. 25.39 s gammaloop-workspace-doctest> Compiling trybuild v1.0.120
  181. 25.43 s gammaloop-workspace-doctest> Compiling alphal00p-docs-catalogs v0.1.0 (/build/source/crates/alphal00p-docs-catalogs)
  182. 25.55 s gammaloop-workspace-doctest> Compiling proptest v1.11.0
  183. 25.71 s gammaloop-workspace-doctest> Compiling ron v0.8.1
  184. 25.85 s gammaloop-workspace-doctest> Compiling alphal00p-docs-builder v0.1.0 (/build/source/crates/alphal00p-docs-builder)
  185. 26.02 s gammaloop-workspace-doctest> Compiling kurvst v0.1.0 (/build/source/crates/kurvst)
  186. 26.09 s gammaloop-workspace-doctest> Compiling pyo3-build-config v0.28.3
  187. 26.24 s gammaloop-workspace-doctest> Compiling test-log-macros v0.2.20
  188. 28.94 s gammaloop-workspace-doctest> Compiling alphal00p-docs-examples v0.1.0 (/build/source/crates/alphal00p-docs-examples)
  189. 29.24 s gammaloop-workspace-doctest> Compiling test-log v0.2.20
  190. 33.19 s gammaloop-workspace-doctest> Compiling gungraun v0.18.2
  191. 34.16 s gammaloop-workspace-doctest> Compiling pyo3-ffi v0.28.3
  192. 34.20 s gammaloop-workspace-doctest> Compiling pyo3-macros-backend v0.28.3
  193. 34.44 s gammaloop-workspace-doctest> Compiling pyo3 v0.28.3
  194. 34.52 s gammaloop-workspace-doctest> Compiling numpy v0.28.0
  195. 34.61 s gammaloop-workspace-doctest> Compiling gammaloop-api v0.1.0 (/build/source/crates/gammaloop-api)
  196. 41.97 s gammaloop-workspace-doctest> Compiling pyo3-macros v0.28.3
  197. 48.90 s gammaloop-workspace-doctest> Compiling pyo3-stub-gen v0.17.2
  198. 49.64 s gammaloop-workspace-doctest> Compiling numerica v2.2.0 (https://github.com/symbolica-dev/symbolica?branch=dev#0441bd7a)
  199. 52.22 s gammaloop-workspace-doctest> Compiling graphica v2.1.0 (https://github.com/symbolica-dev/symbolica?branch=dev#0441bd7a)
  200. 55.15 s gammaloop-workspace-doctest> Compiling symbolica-utils v0.1.0 (/build/source/crates/symbolica-utils)
  201. 283.72 s gammaloop-workspace-doctest> Compiling gammaloop-workspace-hack v0.1.0 (/build/source/crates/gammaloop-workspace-hack)
  202. 283.73 s gammaloop-workspace-doctest> Compiling spenso-macros v0.3.2 (/build/source/crates/spenso-macros)
  203. 283.93 s gammaloop-workspace-doctest> Compiling linnet v0.17.0 (/build/source/crates/linnet)
  204. 287.46 s gammaloop-workspace-doctest> Compiling spenso v0.6.0 (/build/source/crates/spenso)
  205. 295.17 s gammaloop-workspace-doctest> Compiling idenso v0.3.0 (/build/source/crates/idenso)
  206. 295.18 s gammaloop-workspace-doctest> Compiling gammaloop-tracing-filter v0.1.0 (/build/source/crates/gammaloop-tracing-filter)
  207. 298.97 s gammaloop-workspace-doctest> Compiling spenso-hep-lib v0.1.7 (/build/source/crates/spenso-hep-lib)
  208. 299.20 s gammaloop-workspace-doctest> Compiling spynso3 v0.1.2 (/build/source/crates/spynso3)
  209. 340.22 s gammaloop-workspace-doctest> Compiling linnest v0.1.0 (/build/source/crates/linnest)
  210. 340.23 s gammaloop-workspace-doctest> Compiling linnet-py v0.1.0 (/build/source/crates/linnet-py)
  211. 512.73 s gammaloop-workspace-doctest> Finished `ci-optim` profile [optimized] target(s) in 8m 09s
  212. 512.88 s gammaloop-workspace-doctest> warning: the following packages contain code that will be rejected by a future version of Rust: proc-macro-error2 v2.0.1
  213. 512.88 s gammaloop-workspace-doctest> note: to see what the problems were, use the option `--future-incompat-report`, or run `cargo report future-incompatibilities --id 1`
  214. 512.91 s gammaloop-workspace-doctest> Doc-tests alphal00p_docs_builder
  215. 513.09 s gammaloop-workspace-doctest>
  216. 513.09 s gammaloop-workspace-doctest> running 0 tests
  217. 513.09 s gammaloop-workspace-doctest>
  218. 513.09 s gammaloop-workspace-doctest> test result: ok. 0 passed; 0 failed; 0 ignored; 0 measured; 0 filtered out; finished in 0.00s
  219. 513.09 s gammaloop-workspace-doctest>
  220. 513.09 s gammaloop-workspace-doctest> Doc-tests alphal00p_docs_catalogs
  221. 514.44 s gammaloop-workspace-doctest>
  222. 514.44 s gammaloop-workspace-doctest> running 0 tests
  223. 514.44 s gammaloop-workspace-doctest>
  224. 514.44 s gammaloop-workspace-doctest> test result: ok. 0 passed; 0 failed; 0 ignored; 0 measured; 0 filtered out; finished in 0.00s
  225. 514.44 s gammaloop-workspace-doctest>
  226. 514.44 s gammaloop-workspace-doctest> Doc-tests alphal00p_docs_examples
  227. 514.45 s gammaloop-workspace-doctest>
  228. 514.45 s gammaloop-workspace-doctest> running 0 tests
  229. 514.46 s gammaloop-workspace-doctest>
  230. 514.46 s gammaloop-workspace-doctest> test result: ok. 0 passed; 0 failed; 0 ignored; 0 measured; 0 filtered out; finished in 0.00s
  231. 514.46 s gammaloop-workspace-doctest>
  232. 514.46 s gammaloop-workspace-doctest> Doc-tests alphal00p_docs
  233. 514.52 s gammaloop-workspace-doctest>
  234. 514.52 s gammaloop-workspace-doctest> running 0 tests
  235. 514.52 s gammaloop-workspace-doctest>
  236. 514.52 s gammaloop-workspace-doctest> test result: ok. 0 passed; 0 failed; 0 ignored; 0 measured; 0 filtered out; finished in 0.00s
  237. 514.52 s gammaloop-workspace-doctest>
  238. 514.52 s gammaloop-workspace-doctest> Doc-tests alphal00p_docs_schema
  239. 514.60 s gammaloop-workspace-doctest>
  240. 514.60 s gammaloop-workspace-doctest> running 0 tests
  241. 514.60 s gammaloop-workspace-doctest>
  242. 514.60 s gammaloop-workspace-doctest> test result: ok. 0 passed; 0 failed; 0 ignored; 0 measured; 0 filtered out; finished in 0.00s
  243. 514.60 s gammaloop-workspace-doctest>
  244. 514.60 s gammaloop-workspace-doctest> Doc-tests gammaloop_api
  245. 515.65 s gammaloop-workspace-doctest>
  246. 515.65 s gammaloop-workspace-doctest> running 16 tests
  247. 515.68 s gammaloop-workspace-doctest> test crates/gammaloop-api/src/python.rs - python::GammaLoopAPI::get_active_command_blocks (line 3760) ... FAILED
  248. 515.68 s gammaloop-workspace-doctest> test crates/gammaloop-api/src/python.rs - python::GammaLoopAPI::evaluate_samples (line 3108) ... FAILED
  249. 515.68 s gammaloop-workspace-doctest> test crates/gammaloop-api/src/python.rs - python::GammaLoopAPI::get_integrand_settings (line 3647) ... FAILED
  250. 515.68 s gammaloop-workspace-doctest> test crates/gammaloop-api/src/python.rs - python::GammaLoopAPI::evaluate_sample (line 2967) ... FAILED
  251. 515.68 s gammaloop-workspace-doctest> test crates/gammaloop-api/src/python.rs - python::GammaLoopAPI::get_integrand_info (line 3585) ... FAILED
  252. 515.68 s gammaloop-workspace-doctest> test crates/gammaloop-api/src/python.rs - python::PyHistogramAccumulator (line 871) ... FAILED
  253. 515.68 s gammaloop-workspace-doctest> test crates/gammaloop-api/src/python.rs - python::GammaLoopAPI::get_default_runtime_settings (line 3796) ... FAILED
  254. 515.73 s gammaloop-workspace-doctest> test crates/gammaloop-api/src/lib.rs - (line 18) - compile ... ok
  255. 515.78 s gammaloop-workspace-doctest> test crates/gammaloop-api/src/python.rs - python::GammaLoopAPI::get_global_settings (line 3739) ... FAILED
  256. 515.79 s gammaloop-workspace-doctest> test crates/gammaloop-api/src/python.rs - python::GammaLoopAPI::get_run_history (line 3711) ... FAILED
  257. 515.79 s gammaloop-workspace-doctest> test crates/gammaloop-api/src/python.rs - python::GammaLoopAPI::run_command (line 3901) ... FAILED
  258. 515.79 s gammaloop-workspace-doctest> test crates/gammaloop-api/src/python.rs - python::GammaLoopAPI::new_python (line 2834) ... FAILED
  259. 515.79 s gammaloop-workspace-doctest> test crates/gammaloop-api/src/python.rs - python::atom_to_dots (line 157) ... FAILED
  260. 515.79 s gammaloop-workspace-doctest> test crates/gammaloop-api/src/python.rs - python::atom_to_canonical_string (line 128) ... FAILED
  261. 515.81 s gammaloop-workspace-doctest> test crates/gammaloop-api/src/python.rs - python::evaluate_graph_overall_factor (line 95) ... FAILED
  262. 518.47 s gammaloop-workspace-doctest> test crates/gammaloop-api/src/commands/evaluate_samples.rs - commands::evaluate_samples::EvaluateSamples (line 50) ... ok
  263. 518.49 s gammaloop-workspace-doctest>
  264. 518.49 s gammaloop-workspace-doctest> failures:
  265. 518.49 s gammaloop-workspace-doctest>
  266. 518.49 s gammaloop-workspace-doctest> ---- crates/gammaloop-api/src/python.rs - python::GammaLoopAPI::get_active_command_blocks (line 3760) stdout ----
  267. 518.49 s gammaloop-workspace-doctest> error: expected item, found keyword `for`
  268. 518.49 s gammaloop-workspace-doctest> --> crates/gammaloop-api/src/python.rs:3761:1
  269. 518.49 s gammaloop-workspace-doctest> |
  270. 518.49 s gammaloop-workspace-doctest> 3761 | for name, commands in api.get_active_command_blocks().items():
  271. 518.49 s gammaloop-workspace-doctest> | ^^^ expected item
  272. 518.49 s gammaloop-workspace-doctest> |
  273. 518.49 s gammaloop-workspace-doctest> = note: for a full list of items that can appear in modules, see <https://doc.rust-lang.org/reference/items.html>
  274. 518.49 s gammaloop-workspace-doctest>
  275. 518.49 s gammaloop-workspace-doctest> error: aborting due to 1 previous error
  276. 518.49 s gammaloop-workspace-doctest>
  277. 518.49 s gammaloop-workspace-doctest> Couldn't compile the test.
  278. 518.49 s gammaloop-workspace-doctest> ---- crates/gammaloop-api/src/python.rs - python::GammaLoopAPI::evaluate_samples (line 3108) stdout ----
  279. 518.49 s gammaloop-workspace-doctest> error: expected one of `!` or `::`, found `pathlib`
  280. 518.49 s gammaloop-workspace-doctest> --> crates/gammaloop-api/src/python.rs:3109:6
  281. 518.49 s gammaloop-workspace-doctest> |
  282. 518.49 s gammaloop-workspace-doctest> 3109 | from pathlib import Path
  283. 518.49 s gammaloop-workspace-doctest> | ^^^^^^^ expected one of `!` or `::`
  284. 518.49 s gammaloop-workspace-doctest>
  285. 518.49 s gammaloop-workspace-doctest> error: aborting due to 1 previous error
  286. 518.49 s gammaloop-workspace-doctest>
  287. 518.49 s gammaloop-workspace-doctest> Couldn't compile the test.
  288. 518.49 s gammaloop-workspace-doctest> ---- crates/gammaloop-api/src/python.rs - python::GammaLoopAPI::get_integrand_settings (line 3647) stdout ----
  289. 518.49 s gammaloop-workspace-doctest> error: expected one of `!` or `::`, found `=`
  290. 518.49 s gammaloop-workspace-doctest> --> crates/gammaloop-api/src/python.rs:3648:10
  291. 518.49 s gammaloop-workspace-doctest> |
  292. 518.49 s gammaloop-workspace-doctest> 3648 | settings = api.get_integrand_settings(process_id=0)
  293. 518.49 s gammaloop-workspace-doctest> | ^ expected one of `!` or `::`
  294. 518.49 s gammaloop-workspace-doctest>
  295. 518.49 s gammaloop-workspace-doctest> error: aborting due to 1 previous error
  296. 518.49 s gammaloop-workspace-doctest>
  297. 518.49 s gammaloop-workspace-doctest> Couldn't compile the test.
  298. 518.49 s gammaloop-workspace-doctest> ---- crates/gammaloop-api/src/python.rs - python::GammaLoopAPI::evaluate_sample (line 2967) stdout ----
  299. 518.49 s gammaloop-workspace-doctest> error: expected one of `!` or `::`, found `pathlib`
  300. 518.49 s gammaloop-workspace-doctest> --> crates/gammaloop-api/src/python.rs:2968:6
  301. 518.49 s gammaloop-workspace-doctest> |
  302. 518.49 s gammaloop-workspace-doctest> 2968 | from pathlib import Path
  303. 518.49 s gammaloop-workspace-doctest> | ^^^^^^^ expected one of `!` or `::`
  304. 518.49 s gammaloop-workspace-doctest>
  305. 518.49 s gammaloop-workspace-doctest> error: aborting due to 1 previous error
  306. 518.49 s gammaloop-workspace-doctest>
  307. 518.49 s gammaloop-workspace-doctest> Couldn't compile the test.
  308. 518.49 s gammaloop-workspace-doctest> ---- crates/gammaloop-api/src/python.rs - python::GammaLoopAPI::get_integrand_info (line 3585) stdout ----
  309. 518.49 s gammaloop-workspace-doctest> error: expected one of `!` or `::`, found `pathlib`
  310. 518.49 s gammaloop-workspace-doctest> --> crates/gammaloop-api/src/python.rs:3586:6
  311. 518.49 s gammaloop-workspace-doctest> |
  312. 518.49 s gammaloop-workspace-doctest> 3586 | from pathlib import Path
  313. 518.49 s gammaloop-workspace-doctest> | ^^^^^^^ expected one of `!` or `::`
  314. 518.49 s gammaloop-workspace-doctest>
  315. 518.49 s gammaloop-workspace-doctest> error: aborting due to 1 previous error
  316. 518.49 s gammaloop-workspace-doctest>
  317. 518.49 s gammaloop-workspace-doctest> Couldn't compile the test.
  318. 518.49 s gammaloop-workspace-doctest> ---- crates/gammaloop-api/src/python.rs - python::PyHistogramAccumulator (line 871) stdout ----
  319. 518.49 s gammaloop-workspace-doctest> error: expected one of `!` or `::`, found `gammaloop`
  320. 518.49 s gammaloop-workspace-doctest> --> crates/gammaloop-api/src/python.rs:872:6
  321. 518.49 s gammaloop-workspace-doctest> |
  322. 518.49 s gammaloop-workspace-doctest> 872 | from gammaloop import HistogramAccumulator
  323. 518.49 s gammaloop-workspace-doctest> | ^^^^^^^^^ expected one of `!` or `::`
  324. 518.49 s gammaloop-workspace-doctest>
  325. 518.49 s gammaloop-workspace-doctest> error: aborting due to 1 previous error
  326. 518.49 s gammaloop-workspace-doctest>
  327. 518.49 s gammaloop-workspace-doctest> Couldn't compile the test.
  328. 518.49 s gammaloop-workspace-doctest> ---- crates/gammaloop-api/src/python.rs - python::GammaLoopAPI::get_default_runtime_settings (line 3796) stdout ----
  329. 518.49 s gammaloop-workspace-doctest> error: expected one of `!` or `::`, found `=`
  330. 518.49 s gammaloop-workspace-doctest> --> crates/gammaloop-api/src/python.rs:3797:9
  331. 518.49 s gammaloop-workspace-doctest> |
  332. 518.49 s gammaloop-workspace-doctest> 3797 | runtime = api.get_default_runtime_settings()
  333. 518.49 s gammaloop-workspace-doctest> | ^ expected one of `!` or `::`
  334. 518.49 s gammaloop-workspace-doctest>
  335. 518.49 s gammaloop-workspace-doctest> error: aborting due to 1 previous error
  336. 518.49 s gammaloop-workspace-doctest>
  337. 518.49 s gammaloop-workspace-doctest> Couldn't compile the test.
  338. 518.49 s gammaloop-workspace-doctest> ---- crates/gammaloop-api/src/python.rs - python::GammaLoopAPI::get_global_settings (line 3739) stdout ----
  339. 518.49 s gammaloop-workspace-doctest> error[E0425]: cannot find value `settings_toml` in this scope
  340. 518.49 s gammaloop-workspace-doctest> --> crates/gammaloop-api/src/python.rs:3740:1
  341. 518.49 s gammaloop-workspace-doctest> |
  342. 518.49 s gammaloop-workspace-doctest> 3740 | settings_toml = api.get_global_settings()
  343. 518.49 s gammaloop-workspace-doctest> | ^^^^^^^^^^^^^
  344. 518.49 s gammaloop-workspace-doctest> |
  345. 518.49 s gammaloop-workspace-doctest> help: you might have meant to introduce a new binding
  346. 518.49 s gammaloop-workspace-doctest> |
  347. 518.49 s gammaloop-workspace-doctest> 3740 | let settings_toml = api.get_global_settings()
  348. 518.49 s gammaloop-workspace-doctest> | +++
  349. 518.49 s gammaloop-workspace-doctest>
  350. 518.49 s gammaloop-workspace-doctest> error[E0425]: cannot find value `api` in this scope
  351. 518.49 s gammaloop-workspace-doctest> --> crates/gammaloop-api/src/python.rs:3740:17
  352. 518.49 s gammaloop-workspace-doctest> |
  353. 518.49 s gammaloop-workspace-doctest> 3740 | settings_toml = api.get_global_settings()
  354. 518.49 s gammaloop-workspace-doctest> | ^^^ not found in this scope
  355. 518.49 s gammaloop-workspace-doctest>
  356. 518.49 s gammaloop-workspace-doctest> error: aborting due to 2 previous errors
  357. 518.49 s gammaloop-workspace-doctest>
  358. 518.49 s gammaloop-workspace-doctest> For more information about this error, try `rustc --explain E0425`.
  359. 518.49 s gammaloop-workspace-doctest> Couldn't compile the test.
  360. 518.49 s gammaloop-workspace-doctest> ---- crates/gammaloop-api/src/python.rs - python::GammaLoopAPI::get_run_history (line 3711) stdout ----
  361. 518.49 s gammaloop-workspace-doctest> error[E0425]: cannot find value `run_card_toml` in this scope
  362. 518.49 s gammaloop-workspace-doctest> --> crates/gammaloop-api/src/python.rs:3712:1
  363. 518.49 s gammaloop-workspace-doctest> |
  364. 518.49 s gammaloop-workspace-doctest> 3712 | run_card_toml = api.get_run_history()
  365. 518.49 s gammaloop-workspace-doctest> | ^^^^^^^^^^^^^
  366. 518.49 s gammaloop-workspace-doctest> |
  367. 518.49 s gammaloop-workspace-doctest> help: you might have meant to introduce a new binding
  368. 518.49 s gammaloop-workspace-doctest> |
  369. 518.49 s gammaloop-workspace-doctest> 3712 | let run_card_toml = api.get_run_history()
  370. 518.49 s gammaloop-workspace-doctest> | +++
  371. 518.49 s gammaloop-workspace-doctest>
  372. 518.49 s gammaloop-workspace-doctest> error[E0425]: cannot find value `api` in this scope
  373. 518.49 s gammaloop-workspace-doctest> --> crates/gammaloop-api/src/python.rs:3712:17
  374. 518.49 s gammaloop-workspace-doctest> |
  375. 518.49 s gammaloop-workspace-doctest> 3712 | run_card_toml = api.get_run_history()
  376. 518.49 s gammaloop-workspace-doctest> | ^^^ not found in this scope
  377. 518.49 s gammaloop-workspace-doctest>
  378. 518.49 s gammaloop-workspace-doctest> error: aborting due to 2 previous errors
  379. 518.49 s gammaloop-workspace-doctest>
  380. 518.49 s gammaloop-workspace-doctest> For more information about this error, try `rustc --explain E0425`.
  381. 518.49 s gammaloop-workspace-doctest> Couldn't compile the test.
  382. 518.49 s gammaloop-workspace-doctest> ---- crates/gammaloop-api/src/python.rs - python::GammaLoopAPI::run_command (line 3901) stdout ----
  383. 518.49 s gammaloop-workspace-doctest> error[E0425]: cannot find value `api` in this scope
  384. 518.49 s gammaloop-workspace-doctest> --> crates/gammaloop-api/src/python.rs:3902:1
  385. 518.49 s gammaloop-workspace-doctest> |
  386. 518.49 s gammaloop-workspace-doctest> 3902 | api.run("display processes")
  387. 518.49 s gammaloop-workspace-doctest> | ^^^ not found in this scope
  388. 518.49 s gammaloop-workspace-doctest>
  389. 518.49 s gammaloop-workspace-doctest> error: aborting due to 1 previous error
  390. 518.49 s gammaloop-workspace-doctest>
  391. 518.49 s gammaloop-workspace-doctest> For more information about this error, try `rustc --explain E0425`.
  392. 518.49 s gammaloop-workspace-doctest> Couldn't compile the test.
  393. 518.49 s gammaloop-workspace-doctest> ---- crates/gammaloop-api/src/python.rs - python::GammaLoopAPI::new_python (line 2834) stdout ----
  394. 518.49 s gammaloop-workspace-doctest> error[E0425]: cannot find value `api` in this scope
  395. 518.49 s gammaloop-workspace-doctest> --> crates/gammaloop-api/src/python.rs:2835:1
  396. 518.49 s gammaloop-workspace-doctest> |
  397. 518.49 s gammaloop-workspace-doctest> 2835 | api = GammaLoopAPI(state_folder="./state", read_only_state=True)
  398. 518.49 s gammaloop-workspace-doctest> | ^^^
  399. 518.49 s gammaloop-workspace-doctest> |
  400. 518.49 s gammaloop-workspace-doctest> help: you might have meant to introduce a new binding
  401. 518.49 s gammaloop-workspace-doctest> |
  402. 518.49 s gammaloop-workspace-doctest> 2835 | let api = GammaLoopAPI(state_folder="./state", read_only_state=True)
  403. 518.49 s gammaloop-workspace-doctest> | +++
  404. 518.49 s gammaloop-workspace-doctest>
  405. 518.49 s gammaloop-workspace-doctest> error[E0425]: cannot find value `state_folder` in this scope
  406. 518.49 s gammaloop-workspace-doctest> --> crates/gammaloop-api/src/python.rs:2835:20
  407. 518.49 s gammaloop-workspace-doctest> |
  408. 518.49 s gammaloop-workspace-doctest> 2835 | api = GammaLoopAPI(state_folder="./state", read_only_state=True)
  409. 518.49 s gammaloop-workspace-doctest> | ^^^^^^^^^^^^ not found in this scope
  410. 518.49 s gammaloop-workspace-doctest>
  411. 518.49 s gammaloop-workspace-doctest> error[E0425]: cannot find value `read_only_state` in this scope
  412. 518.49 s gammaloop-workspace-doctest> --> crates/gammaloop-api/src/python.rs:2835:44
  413. 518.49 s gammaloop-workspace-doctest> |
  414. 518.49 s gammaloop-workspace-doctest> 2835 | api = GammaLoopAPI(state_folder="./state", read_only_state=True)
  415. 518.49 s gammaloop-workspace-doctest> | ^^^^^^^^^^^^^^^ not found in this scope
  416. 518.49 s gammaloop-workspace-doctest>
  417. 518.49 s gammaloop-workspace-doctest> error[E0425]: cannot find value `True` in this scope
  418. 518.49 s gammaloop-workspace-doctest> --> crates/gammaloop-api/src/python.rs:2835:60
  419. 518.49 s gammaloop-workspace-doctest> |
  420. 518.49 s gammaloop-workspace-doctest> 2835 | api = GammaLoopAPI(state_folder="./state", read_only_state=True)
  421. 518.49 s gammaloop-workspace-doctest> | ^^^^ not found in this scope
  422. 518.49 s gammaloop-workspace-doctest> |
  423. 518.49 s gammaloop-workspace-doctest> help: you may want to use a bool value instead
  424. 518.49 s gammaloop-workspace-doctest> |
  425. 518.49 s gammaloop-workspace-doctest> 2835 - api = GammaLoopAPI(state_folder="./state", read_only_state=True)
  426. 518.49 s gammaloop-workspace-doctest> 2835 + api = GammaLoopAPI(state_folder="./state", read_only_state=true)
  427. 518.49 s gammaloop-workspace-doctest> |
  428. 518.49 s gammaloop-workspace-doctest>
  429. 518.49 s gammaloop-workspace-doctest> error[E0425]: cannot find function, tuple struct or tuple variant `GammaLoopAPI` in this scope
  430. 518.49 s gammaloop-workspace-doctest> --> crates/gammaloop-api/src/python.rs:2835:7
  431. 518.49 s gammaloop-workspace-doctest> |
  432. 518.49 s gammaloop-workspace-doctest> 2835 | api = GammaLoopAPI(state_folder="./state", read_only_state=True)
  433. 518.49 s gammaloop-workspace-doctest> | ^^^^^^^^^^^^ not found in this scope
  434. 518.49 s gammaloop-workspace-doctest>
  435. 518.49 s gammaloop-workspace-doctest> error: aborting due to 5 previous errors
  436. 518.49 s gammaloop-workspace-doctest>
  437. 518.49 s gammaloop-workspace-doctest> For more information about this error, try `rustc --explain E0425`.
  438. 518.49 s gammaloop-workspace-doctest> Couldn't compile the test.
  439. 518.49 s gammaloop-workspace-doctest> ---- crates/gammaloop-api/src/python.rs - python::atom_to_dots (line 157) stdout ----
  440. 518.49 s gammaloop-workspace-doctest> error[E0425]: cannot find function `to_dots` in this scope
  441. 518.49 s gammaloop-workspace-doctest> --> crates/gammaloop-api/src/python.rs:158:1
  442. 518.49 s gammaloop-workspace-doctest> |
  443. 518.49 s gammaloop-workspace-doctest> 158 | to_dots("p(mu) * q(mu)")
  444. 518.49 s gammaloop-workspace-doctest> | ^^^^^^^ not found in this scope
  445. 518.49 s gammaloop-workspace-doctest>
  446. 518.49 s gammaloop-workspace-doctest> error: aborting due to 1 previous error
  447. 518.49 s gammaloop-workspace-doctest>
  448. 518.49 s gammaloop-workspace-doctest> For more information about this error, try `rustc --explain E0425`.
  449. 518.49 s gammaloop-workspace-doctest> Couldn't compile the test.
  450. 518.49 s gammaloop-workspace-doctest> ---- crates/gammaloop-api/src/python.rs - python::atom_to_canonical_string (line 128) stdout ----
  451. 518.49 s gammaloop-workspace-doctest> error[E0425]: cannot find function `atom_to_canonical_string` in this scope
  452. 518.49 s gammaloop-workspace-doctest> --> crates/gammaloop-api/src/python.rs:129:1
  453. 518.49 s gammaloop-workspace-doctest> |
  454. 518.49 s gammaloop-workspace-doctest> 129 | atom_to_canonical_string("x + x")
  455. 518.49 s gammaloop-workspace-doctest> | ^^^^^^^^^^^^^^^^^^^^^^^^ not found in this scope
  456. 518.49 s gammaloop-workspace-doctest>
  457. 518.49 s gammaloop-workspace-doctest> error: aborting due to 1 previous error
  458. 518.49 s gammaloop-workspace-doctest>
  459. 518.49 s gammaloop-workspace-doctest> For more information about this error, try `rustc --explain E0425`.
  460. 518.49 s gammaloop-workspace-doctest> Couldn't compile the test.
  461. 518.49 s gammaloop-workspace-doctest> ---- crates/gammaloop-api/src/python.rs - python::evaluate_graph_overall_factor (line 95) stdout ----
  462. 518.49 s gammaloop-workspace-doctest> error[E0425]: cannot find function `evaluate_graph_overall_factor` in this scope
  463. 518.49 s gammaloop-workspace-doctest> --> crates/gammaloop-api/src/python.rs:96:1
  464. 518.49 s gammaloop-workspace-doctest> |
  465. 518.49 s gammaloop-workspace-doctest> 96 | evaluate_graph_overall_factor(
  466. 518.49 s gammaloop-workspace-doctest> | ^^^^^^^^^^^^^^^^^^^^^^^^^^^^^ not found in this scope
  467. 518.49 s gammaloop-workspace-doctest>
  468. 518.49 s gammaloop-workspace-doctest> error: aborting due to 1 previous error
  469. 518.49 s gammaloop-workspace-doctest>
  470. 518.49 s gammaloop-workspace-doctest> For more information about this error, try `rustc --explain E0425`.
  471. 518.49 s gammaloop-workspace-doctest> Couldn't compile the test.
  472. 518.49 s gammaloop-workspace-doctest>
  473. 518.49 s gammaloop-workspace-doctest> failures:
  474. 518.49 s gammaloop-workspace-doctest> crates/gammaloop-api/src/python.rs - python::GammaLoopAPI::evaluate_sample (line 2967)
  475. 518.49 s gammaloop-workspace-doctest> crates/gammaloop-api/src/python.rs - python::GammaLoopAPI::evaluate_samples (line 3108)
  476. 518.49 s gammaloop-workspace-doctest> crates/gammaloop-api/src/python.rs - python::GammaLoopAPI::get_active_command_blocks (line 3760)
  477. 518.49 s gammaloop-workspace-doctest> crates/gammaloop-api/src/python.rs - python::GammaLoopAPI::get_default_runtime_settings (line 3796)
  478. 518.49 s gammaloop-workspace-doctest> crates/gammaloop-api/src/python.rs - python::GammaLoopAPI::get_global_settings (line 3739)
  479. 518.49 s gammaloop-workspace-doctest> crates/gammaloop-api/src/python.rs - python::GammaLoopAPI::get_integrand_info (line 3585)
  480. 518.49 s gammaloop-workspace-doctest> crates/gammaloop-api/src/python.rs - python::GammaLoopAPI::get_integrand_settings (line 3647)
  481. 518.49 s gammaloop-workspace-doctest> crates/gammaloop-api/src/python.rs - python::GammaLoopAPI::get_run_history (line 3711)
  482. 518.49 s gammaloop-workspace-doctest> crates/gammaloop-api/src/python.rs - python::GammaLoopAPI::new_python (line 2834)
  483. 518.49 s gammaloop-workspace-doctest> crates/gammaloop-api/src/python.rs - python::GammaLoopAPI::run_command (line 3901)
  484. 518.49 s gammaloop-workspace-doctest> crates/gammaloop-api/src/python.rs - python::PyHistogramAccumulator (line 871)
  485. 518.49 s gammaloop-workspace-doctest> crates/gammaloop-api/src/python.rs - python::atom_to_canonical_string (line 128)
  486. 518.49 s gammaloop-workspace-doctest> crates/gammaloop-api/src/python.rs - python::atom_to_dots (line 157)
  487. 518.49 s gammaloop-workspace-doctest> crates/gammaloop-api/src/python.rs - python::evaluate_graph_overall_factor (line 95)
  488. 518.49 s gammaloop-workspace-doctest>
  489. 518.49 s gammaloop-workspace-doctest> test result: FAILED. 2 passed; 14 failed; 0 ignored; 0 measured; 0 filtered out; finished in 2.82s
  490. 518.49 s gammaloop-workspace-doctest>
  491. 518.49 s gammaloop-workspace-doctest> error: doctest failed, to rerun pass `-p gammaloop-api --doc`
  492. 518.94 s error: Cannot build '/nix/store/qcailmgi3q1z5ibyq4n8nnc4asc1nkbp-gammaloop-workspace-doctest-0.1.0.drv'.
  493. 518.94 s Reason: builder failed with exit code 101.
  494. 518.94 s Output paths:
  495. 518.94 s /nix/store/7ih5ndgqkl4akd5g3iippxbw6x6xq39k-gammaloop-workspace-doctest-0.1.0
  496. 518.94 s Last 356 log lines:
  497. 518.94 s > Running phase: unpackPhase
  498. 518.94 s > unpacking source archive /nix/store/5afz06g4vsphrihpxicbxvm3sk5psnll-source
  499. 518.94 s > source root is source
  500. 518.94 s > Running phase: patchPhase
  501. 518.94 s > Executing configureCargoCommonVars
  502. 518.94 s > decompressing cargo artifacts from /nix/store/72wdcnp633ang33qg6wvb90brvf1679y-gammaloop-workspace-deps-deps-0.1.0/target.tar.zst to target
  503. 518.94 s > Running phase: updateAutotoolsGnuConfigScriptsPhase
  504. 518.94 s > Running phase: configurePhase
  505. 518.94 s > will append /build/source/.cargo-home/config.toml with contents of /nix/store/29aa708jkn8wd8vjwja1a5gh8k8wpi2b-vendor-cargo-deps/config.toml
  506. 518.94 s > default configurePhase, nothing to do
  507. 518.94 s > Running phase: buildPhase
  508. 518.94 s > +++ command cargo --version
  509. 518.94 s > cargo 1.98.0 (797e8a9bc 2026-08-05)
  510. 518.94 s > +++ command cargo test --profile ci-optim --doc --locked --workspace --features gammaloop-api/cli,gammaloop-tracing-filter/clap,gammaloop-tracing-filter/symbolica,idenso/bincode,idenso/reference-cases,linnet/bincode,linnet/drawing,linnet/nodestore-vec,linnet/rkyv,linnet/serde,linnet/symbolica,spenso-macros/shadowing,spenso/shadowing,symbolica/tracing_max_level_info
  511. 518.94 s > Compiling target-lexicon v0.13.5
  512. 518.94 s > Compiling symbolica v2.2.0 (https://github.com/symbolica-dev/symbolica?branch=dev#0441bd7a)
  513. 518.94 s > Compiling maplit v1.0.2
  514. 518.94 s > Compiling gammaloop-tracing-filter-macros v0.1.0 (/build/source/crates/gammaloop-tracing-filter-macros)
  515. 518.94 s > Compiling vakint v0.1.2 (/build/source/crates/vakint)
  516. 518.94 s > Compiling gammalooprs v0.3.4 (/build/source/crates/gammalooprs)
  517. 518.94 s > Compiling alphal00p-docs-macros v0.1.0 (/build/source/crates/alphal00p-docs-macros)
  518. 518.94 s > Compiling alphal00p-docs-schema v0.1.0 (/build/source/crates/alphal00p-docs-schema)
  519. 518.94 s > Compiling rustc_version v0.4.1
  520. 518.94 s > Compiling bincode v1.3.3
  521. 518.94 s > Compiling target-triple v1.0.1
  522. 518.94 s > Compiling iai-callgrind-runner v0.14.2
  523. 518.94 s > Compiling gungraun-runner v0.18.2
  524. 518.94 s > Compiling gammaloop-integration-tests v0.1.0 (/build/source/tests)
  525. 518.94 s > Compiling test-log-core v0.2.20
  526. 518.94 s > Compiling wait-timeout v0.2.1
  527. 518.94 s > Compiling quick-error v1.2.3
  528. 518.94 s > Compiling iai-callgrind v0.14.2
  529. 518.94 s > Compiling bit-vec v0.8.0
  530. 518.94 s > Compiling bit-set v0.8.0
  531. 518.94 s > Compiling rusty-fork v0.3.1
  532. 518.94 s > Compiling iai-callgrind-macros v0.5.1
  533. 518.94 s > Compiling rand_xorshift v0.4.0
  534. 518.94 s > Compiling console v0.15.11
  535. 518.94 s > Compiling base64 v0.21.7
  536. 518.94 s > Compiling termcolor v1.4.1
  537. 518.94 s > Compiling glob v0.3.4
  538. 518.94 s > Compiling unarray v0.1.4
  539. 518.94 s > Compiling gungraun-macros v0.8.0
  540. 518.94 s > Compiling similar-asserts v1.7.0
  541. 518.94 s > Compiling trybuild v1.0.120
  542. 518.94 s > Compiling alphal00p-docs-catalogs v0.1.0 (/build/source/crates/alphal00p-docs-catalogs)
  543. 518.94 s > Compiling proptest v1.11.0
  544. 518.94 s > Compiling ron v0.8.1
  545. 518.94 s > Compiling alphal00p-docs-builder v0.1.0 (/build/source/crates/alphal00p-docs-builder)
  546. 518.94 s > Compiling kurvst v0.1.0 (/build/source/crates/kurvst)
  547. 518.94 s > Compiling pyo3-build-config v0.28.3
  548. 518.94 s > Compiling test-log-macros v0.2.20
  549. 518.94 s > Compiling alphal00p-docs-examples v0.1.0 (/build/source/crates/alphal00p-docs-examples)
  550. 518.94 s > Compiling test-log v0.2.20
  551. 518.94 s > Compiling gungraun v0.18.2
  552. 518.94 s > Compiling pyo3-ffi v0.28.3
  553. 518.94 s > Compiling pyo3-macros-backend v0.28.3
  554. 518.94 s > Compiling pyo3 v0.28.3
  555. 518.94 s > Compiling numpy v0.28.0
  556. 518.94 s > Compiling gammaloop-api v0.1.0 (/build/source/crates/gammaloop-api)
  557. 518.94 s > Compiling pyo3-macros v0.28.3
  558. 518.94 s > Compiling pyo3-stub-gen v0.17.2
  559. 518.94 s > Compiling numerica v2.2.0 (https://github.com/symbolica-dev/symbolica?branch=dev#0441bd7a)
  560. 518.94 s > Compiling graphica v2.1.0 (https://github.com/symbolica-dev/symbolica?branch=dev#0441bd7a)
  561. 518.94 s > Compiling symbolica-utils v0.1.0 (/build/source/crates/symbolica-utils)
  562. 518.94 s > Compiling gammaloop-workspace-hack v0.1.0 (/build/source/crates/gammaloop-workspace-hack)
  563. 518.94 s > Compiling spenso-macros v0.3.2 (/build/source/crates/spenso-macros)
  564. 518.94 s > Compiling linnet v0.17.0 (/build/source/crates/linnet)
  565. 518.94 s > Compiling spenso v0.6.0 (/build/source/crates/spenso)
  566. 518.94 s > Compiling idenso v0.3.0 (/build/source/crates/idenso)
  567. 518.94 s > Compiling gammaloop-tracing-filter v0.1.0 (/build/source/crates/gammaloop-tracing-filter)
  568. 518.94 s > Compiling spenso-hep-lib v0.1.7 (/build/source/crates/spenso-hep-lib)
  569. 518.94 s > Compiling spynso3 v0.1.2 (/build/source/crates/spynso3)
  570. 518.94 s > Compiling linnest v0.1.0 (/build/source/crates/linnest)
  571. 518.94 s > Compiling linnet-py v0.1.0 (/build/source/crates/linnet-py)
  572. 518.94 s > Finished `ci-optim` profile [optimized] target(s) in 8m 09s
  573. 518.94 s > warning: the following packages contain code that will be rejected by a future version of Rust: proc-macro-error2 v2.0.1
  574. 518.94 s > note: to see what the problems were, use the option `--future-incompat-report`, or run `cargo report future-incompatibilities --id 1`
  575. 518.94 s > Doc-tests alphal00p_docs_builder
  576. 518.94 s >
  577. 518.94 s > running 0 tests
  578. 518.94 s >
  579. 518.94 s > test result: ok. 0 passed; 0 failed; 0 ignored; 0 measured; 0 filtered out; finished in 0.00s
  580. 518.94 s >
  581. 518.94 s > Doc-tests alphal00p_docs_catalogs
  582. 518.94 s >
  583. 518.94 s > running 0 tests
  584. 518.94 s >
  585. 518.94 s > test result: ok. 0 passed; 0 failed; 0 ignored; 0 measured; 0 filtered out; finished in 0.00s
  586. 518.94 s >
  587. 518.94 s > Doc-tests alphal00p_docs_examples
  588. 518.94 s >
  589. 518.94 s > running 0 tests
  590. 518.94 s >
  591. 518.94 s > test result: ok. 0 passed; 0 failed; 0 ignored; 0 measured; 0 filtered out; finished in 0.00s
  592. 518.94 s >
  593. 518.94 s > Doc-tests alphal00p_docs
  594. 518.94 s >
  595. 518.94 s > running 0 tests
  596. 518.94 s >
  597. 518.94 s > test result: ok. 0 passed; 0 failed; 0 ignored; 0 measured; 0 filtered out; finished in 0.00s
  598. 518.94 s >
  599. 518.94 s > Doc-tests alphal00p_docs_schema
  600. 518.94 s >
  601. 518.94 s > running 0 tests
  602. 518.94 s >
  603. 518.94 s > test result: ok. 0 passed; 0 failed; 0 ignored; 0 measured; 0 filtered out; finished in 0.00s
  604. 518.94 s >
  605. 518.94 s > Doc-tests gammaloop_api
  606. 518.94 s >
  607. 518.94 s > running 16 tests
  608. 518.94 s > test crates/gammaloop-api/src/python.rs - python::GammaLoopAPI::get_active_command_blocks (line 3760) ... FAILED
  609. 518.94 s > test crates/gammaloop-api/src/python.rs - python::GammaLoopAPI::evaluate_samples (line 3108) ... FAILED
  610. 518.94 s > test crates/gammaloop-api/src/python.rs - python::GammaLoopAPI::get_integrand_settings (line 3647) ... FAILED
  611. 518.94 s > test crates/gammaloop-api/src/python.rs - python::GammaLoopAPI::evaluate_sample (line 2967) ... FAILED
  612. 518.94 s > test crates/gammaloop-api/src/python.rs - python::GammaLoopAPI::get_integrand_info (line 3585) ... FAILED
  613. 518.94 s > test crates/gammaloop-api/src/python.rs - python::PyHistogramAccumulator (line 871) ... FAILED
  614. 518.94 s > test crates/gammaloop-api/src/python.rs - python::GammaLoopAPI::get_default_runtime_settings (line 3796) ... FAILED
  615. 518.94 s > test crates/gammaloop-api/src/lib.rs - (line 18) - compile ... ok
  616. 518.94 s > test crates/gammaloop-api/src/python.rs - python::GammaLoopAPI::get_global_settings (line 3739) ... FAILED
  617. 518.94 s > test crates/gammaloop-api/src/python.rs - python::GammaLoopAPI::get_run_history (line 3711) ... FAILED
  618. 518.94 s > test crates/gammaloop-api/src/python.rs - python::GammaLoopAPI::run_command (line 3901) ... FAILED
  619. 518.94 s > test crates/gammaloop-api/src/python.rs - python::GammaLoopAPI::new_python (line 2834) ... FAILED
  620. 518.94 s > test crates/gammaloop-api/src/python.rs - python::atom_to_dots (line 157) ... FAILED
  621. 518.94 s > test crates/gammaloop-api/src/python.rs - python::atom_to_canonical_string (line 128) ... FAILED
  622. 518.94 s > test crates/gammaloop-api/src/python.rs - python::evaluate_graph_overall_factor (line 95) ... FAILED
  623. 518.94 s > test crates/gammaloop-api/src/commands/evaluate_samples.rs - commands::evaluate_samples::EvaluateSamples (line 50) ... ok
  624. 518.94 s >
  625. 518.94 s > failures:
  626. 518.94 s >
  627. 518.94 s > ---- crates/gammaloop-api/src/python.rs - python::GammaLoopAPI::get_active_command_blocks (line 3760) stdout ----
  628. 518.94 s > error: expected item, found keyword `for`
  629. 518.94 s > --> crates/gammaloop-api/src/python.rs:3761:1
  630. 518.94 s > |
  631. 518.94 s > 3761 | for name, commands in api.get_active_command_blocks().items():
  632. 518.94 s > | ^^^ expected item
  633. 518.94 s > |
  634. 518.94 s > = note: for a full list of items that can appear in modules, see <https://doc.rust-lang.org/reference/items.html>
  635. 518.94 s >
  636. 518.94 s > error: aborting due to 1 previous error
  637. 518.94 s >
  638. 518.94 s > Couldn't compile the test.
  639. 518.94 s > ---- crates/gammaloop-api/src/python.rs - python::GammaLoopAPI::evaluate_samples (line 3108) stdout ----
  640. 518.94 s > error: expected one of `!` or `::`, found `pathlib`
  641. 518.94 s > --> crates/gammaloop-api/src/python.rs:3109:6
  642. 518.94 s > |
  643. 518.94 s > 3109 | from pathlib import Path
  644. 518.94 s > | ^^^^^^^ expected one of `!` or `::`
  645. 518.94 s >
  646. 518.94 s > error: aborting due to 1 previous error
  647. 518.94 s >
  648. 518.94 s > Couldn't compile the test.
  649. 518.94 s > ---- crates/gammaloop-api/src/python.rs - python::GammaLoopAPI::get_integrand_settings (line 3647) stdout ----
  650. 518.94 s > error: expected one of `!` or `::`, found `=`
  651. 518.94 s > --> crates/gammaloop-api/src/python.rs:3648:10
  652. 518.94 s > |
  653. 518.94 s > 3648 | settings = api.get_integrand_settings(process_id=0)
  654. 518.94 s > | ^ expected one of `!` or `::`
  655. 518.94 s >
  656. 518.94 s > error: aborting due to 1 previous error
  657. 518.94 s >
  658. 518.94 s > Couldn't compile the test.
  659. 518.94 s > ---- crates/gammaloop-api/src/python.rs - python::GammaLoopAPI::evaluate_sample (line 2967) stdout ----
  660. 518.94 s > error: expected one of `!` or `::`, found `pathlib`
  661. 518.94 s > --> crates/gammaloop-api/src/python.rs:2968:6
  662. 518.94 s > |
  663. 518.94 s > 2968 | from pathlib import Path
  664. 518.94 s > | ^^^^^^^ expected one of `!` or `::`
  665. 518.94 s >
  666. 518.94 s > error: aborting due to 1 previous error
  667. 518.94 s >
  668. 518.94 s > Couldn't compile the test.
  669. 518.94 s > ---- crates/gammaloop-api/src/python.rs - python::GammaLoopAPI::get_integrand_info (line 3585) stdout ----
  670. 518.94 s > error: expected one of `!` or `::`, found `pathlib`
  671. 518.94 s > --> crates/gammaloop-api/src/python.rs:3586:6
  672. 518.94 s > |
  673. 518.94 s > 3586 | from pathlib import Path
  674. 518.94 s > | ^^^^^^^ expected one of `!` or `::`
  675. 518.94 s >
  676. 518.94 s > error: aborting due to 1 previous error
  677. 518.94 s >
  678. 518.94 s > Couldn't compile the test.
  679. 518.94 s > ---- crates/gammaloop-api/src/python.rs - python::PyHistogramAccumulator (line 871) stdout ----
  680. 518.94 s > error: expected one of `!` or `::`, found `gammaloop`
  681. 518.94 s > --> crates/gammaloop-api/src/python.rs:872:6
  682. 518.94 s > |
  683. 518.94 s > 872 | from gammaloop import HistogramAccumulator
  684. 518.94 s > | ^^^^^^^^^ expected one of `!` or `::`
  685. 518.94 s >
  686. 518.94 s > error: aborting due to 1 previous error
  687. 518.94 s >
  688. 518.94 s > Couldn't compile the test.
  689. 518.94 s > ---- crates/gammaloop-api/src/python.rs - python::GammaLoopAPI::get_default_runtime_settings (line 3796) stdout ----
  690. 518.94 s > error: expected one of `!` or `::`, found `=`
  691. 518.94 s > --> crates/gammaloop-api/src/python.rs:3797:9
  692. 518.94 s > |
  693. 518.94 s > 3797 | runtime = api.get_default_runtime_settings()
  694. 518.94 s > | ^ expected one of `!` or `::`
  695. 518.94 s >
  696. 518.94 s > error: aborting due to 1 previous error
  697. 518.94 s >
  698. 518.94 s > Couldn't compile the test.
  699. 518.94 s > ---- crates/gammaloop-api/src/python.rs - python::GammaLoopAPI::get_global_settings (line 3739) stdout ----
  700. 518.94 s > error[E0425]: cannot find value `settings_toml` in this scope
  701. 518.94 s > --> crates/gammaloop-api/src/python.rs:3740:1
  702. 518.94 s > |
  703. 518.94 s > 3740 | settings_toml = api.get_global_settings()
  704. 518.94 s > | ^^^^^^^^^^^^^
  705. 518.94 s > |
  706. 518.94 s > help: you might have meant to introduce a new binding
  707. 518.94 s > |
  708. 518.94 s > 3740 | let settings_toml = api.get_global_settings()
  709. 518.94 s > | +++
  710. 518.94 s >
  711. 518.94 s > error[E0425]: cannot find value `api` in this scope
  712. 518.94 s > --> crates/gammaloop-api/src/python.rs:3740:17
  713. 518.94 s > |
  714. 518.94 s > 3740 | settings_toml = api.get_global_settings()
  715. 518.94 s > | ^^^ not found in this scope
  716. 518.94 s >
  717. 518.94 s > error: aborting due to 2 previous errors
  718. 518.94 s >
  719. 518.94 s > For more information about this error, try `rustc --explain E0425`.
  720. 518.94 s > Couldn't compile the test.
  721. 518.94 s > ---- crates/gammaloop-api/src/python.rs - python::GammaLoopAPI::get_run_history (line 3711) stdout ----
  722. 518.94 s > error[E0425]: cannot find value `run_card_toml` in this scope
  723. 518.94 s > --> crates/gammaloop-api/src/python.rs:3712:1
  724. 518.94 s > |
  725. 518.94 s > 3712 | run_card_toml = api.get_run_history()
  726. 518.94 s > | ^^^^^^^^^^^^^
  727. 518.94 s > |
  728. 518.94 s > help: you might have meant to introduce a new binding
  729. 518.94 s > |
  730. 518.94 s > 3712 | let run_card_toml = api.get_run_history()
  731. 518.94 s > | +++
  732. 518.94 s >
  733. 518.94 s > error[E0425]: cannot find value `api` in this scope
  734. 518.94 s > --> crates/gammaloop-api/src/python.rs:3712:17
  735. 518.94 s > |
  736. 518.94 s > 3712 | run_card_toml = api.get_run_history()
  737. 518.94 s > | ^^^ not found in this scope
  738. 518.94 s >
  739. 518.94 s > error: aborting due to 2 previous errors
  740. 518.94 s >
  741. 518.94 s > For more information about this error, try `rustc --explain E0425`.
  742. 518.94 s > Couldn't compile the test.
  743. 518.94 s > ---- crates/gammaloop-api/src/python.rs - python::GammaLoopAPI::run_command (line 3901) stdout ----
  744. 518.94 s > error[E0425]: cannot find value `api` in this scope
  745. 518.94 s > --> crates/gammaloop-api/src/python.rs:3902:1
  746. 518.94 s > |
  747. 518.94 s > 3902 | api.run("display processes")
  748. 518.94 s > | ^^^ not found in this scope
  749. 518.94 s >
  750. 518.94 s > error: aborting due to 1 previous error
  751. 518.94 s >
  752. 518.94 s > For more information about this error, try `rustc --explain E0425`.
  753. 518.94 s > Couldn't compile the test.
  754. 518.94 s > ---- crates/gammaloop-api/src/python.rs - python::GammaLoopAPI::new_python (line 2834) stdout ----
  755. 518.94 s > error[E0425]: cannot find value `api` in this scope
  756. 518.94 s > --> crates/gammaloop-api/src/python.rs:2835:1
  757. 518.94 s > |
  758. 518.94 s > 2835 | api = GammaLoopAPI(state_folder="./state", read_only_state=True)
  759. 518.94 s > | ^^^
  760. 518.94 s > |
  761. 518.94 s > help: you might have meant to introduce a new binding
  762. 518.94 s > |
  763. 518.94 s > 2835 | let api = GammaLoopAPI(state_folder="./state", read_only_state=True)
  764. 518.94 s > | +++
  765. 518.94 s >
  766. 518.94 s > error[E0425]: cannot find value `state_folder` in this scope
  767. 518.94 s > --> crates/gammaloop-api/src/python.rs:2835:20
  768. 518.94 s > |
  769. 518.94 s > 2835 | api = GammaLoopAPI(state_folder="./state", read_only_state=True)
  770. 518.94 s > | ^^^^^^^^^^^^ not found in this scope
  771. 518.94 s >
  772. 518.94 s > error[E0425]: cannot find value `read_only_state` in this scope
  773. 518.94 s > --> crates/gammaloop-api/src/python.rs:2835:44
  774. 518.94 s > |
  775. 518.94 s > 2835 | api = GammaLoopAPI(state_folder="./state", read_only_state=True)
  776. 518.94 s > | ^^^^^^^^^^^^^^^ not found in this scope
  777. 518.94 s >
  778. 518.94 s > error[E0425]: cannot find value `True` in this scope
  779. 518.94 s > --> crates/gammaloop-api/src/python.rs:2835:60
  780. 518.94 s > |
  781. 518.94 s > 2835 | api = GammaLoopAPI(state_folder="./state", read_only_state=True)
  782. 518.94 s > | ^^^^ not found in this scope
  783. 518.94 s > |
  784. 518.94 s > help: you may want to use a bool value instead
  785. 518.94 s > |
  786. 518.94 s > 2835 - api = GammaLoopAPI(state_folder="./state", read_only_state=True)
  787. 518.94 s > 2835 + api = GammaLoopAPI(state_folder="./state", read_only_state=true)
  788. 518.94 s > |
  789. 518.94 s >
  790. 518.94 s > error[E0425]: cannot find function, tuple struct or tuple variant `GammaLoopAPI` in this scope
  791. 518.94 s > --> crates/gammaloop-api/src/python.rs:2835:7
  792. 518.94 s > |
  793. 518.94 s > 2835 | api = GammaLoopAPI(state_folder="./state", read_only_state=True)
  794. 518.94 s > | ^^^^^^^^^^^^ not found in this scope
  795. 518.94 s >
  796. 518.94 s > error: aborting due to 5 previous errors
  797. 518.94 s >
  798. 518.94 s > For more information about this error, try `rustc --explain E0425`.
  799. 518.94 s > Couldn't compile the test.
  800. 518.94 s > ---- crates/gammaloop-api/src/python.rs - python::atom_to_dots (line 157) stdout ----
  801. 518.94 s > error[E0425]: cannot find function `to_dots` in this scope
  802. 518.94 s > --> crates/gammaloop-api/src/python.rs:158:1
  803. 518.94 s > |
  804. 518.94 s > 158 | to_dots("p(mu) * q(mu)")
  805. 518.94 s > | ^^^^^^^ not found in this scope
  806. 518.94 s >
  807. 518.94 s > error: aborting due to 1 previous error
  808. 518.94 s >
  809. 518.94 s > For more information about this error, try `rustc --explain E0425`.
  810. 518.94 s > Couldn't compile the test.
  811. 518.94 s > ---- crates/gammaloop-api/src/python.rs - python::atom_to_canonical_string (line 128) stdout ----
  812. 518.94 s > error[E0425]: cannot find function `atom_to_canonical_string` in this scope
  813. 518.94 s > --> crates/gammaloop-api/src/python.rs:129:1
  814. 518.94 s > |
  815. 518.94 s > 129 | atom_to_canonical_string("x + x")
  816. 518.94 s > | ^^^^^^^^^^^^^^^^^^^^^^^^ not found in this scope
  817. 518.94 s >
  818. 518.94 s > error: aborting due to 1 previous error
  819. 518.94 s >
  820. 518.94 s > For more information about this error, try `rustc --explain E0425`.
  821. 518.94 s > Couldn't compile the test.
  822. 518.94 s > ---- crates/gammaloop-api/src/python.rs - python::evaluate_graph_overall_factor (line 95) stdout ----
  823. 518.94 s > error[E0425]: cannot find function `evaluate_graph_overall_factor` in this scope
  824. 518.94 s > --> crates/gammaloop-api/src/python.rs:96:1
  825. 518.94 s > |
  826. 518.94 s > 96 | evaluate_graph_overall_factor(
  827. 518.94 s > | ^^^^^^^^^^^^^^^^^^^^^^^^^^^^^ not found in this scope
  828. 518.94 s >
  829. 518.94 s > error: aborting due to 1 previous error
  830. 518.94 s >
  831. 518.94 s > For more information about this error, try `rustc --explain E0425`.
  832. 518.94 s > Couldn't compile the test.
  833. 518.94 s >
  834. 518.94 s > failures:
  835. 518.94 s > crates/gammaloop-api/src/python.rs - python::GammaLoopAPI::evaluate_sample (line 2967)
  836. 518.94 s > crates/gammaloop-api/src/python.rs - python::GammaLoopAPI::evaluate_samples (line 3108)
  837. 518.94 s > crates/gammaloop-api/src/python.rs - python::GammaLoopAPI::get_active_command_blocks (line 3760)
  838. 518.94 s > crates/gammaloop-api/src/python.rs - python::GammaLoopAPI::get_default_runtime_settings (line 3796)
  839. 518.94 s > crates/gammaloop-api/src/python.rs - python::GammaLoopAPI::get_global_settings (line 3739)
  840. 518.94 s > crates/gammaloop-api/src/python.rs - python::GammaLoopAPI::get_integrand_info (line 3585)
  841. 518.94 s > crates/gammaloop-api/src/python.rs - python::GammaLoopAPI::get_integrand_settings (line 3647)
  842. 518.94 s > crates/gammaloop-api/src/python.rs - python::GammaLoopAPI::get_run_history (line 3711)
  843. 518.94 s > crates/gammaloop-api/src/python.rs - python::GammaLoopAPI::new_python (line 2834)
  844. 518.94 s > crates/gammaloop-api/src/python.rs - python::GammaLoopAPI::run_command (line 3901)
  845. 518.94 s > crates/gammaloop-api/src/python.rs - python::PyHistogramAccumulator (line 871)
  846. 518.94 s > crates/gammaloop-api/src/python.rs - python::atom_to_canonical_string (line 128)
  847. 518.94 s > crates/gammaloop-api/src/python.rs - python::atom_to_dots (line 157)
  848. 518.94 s > crates/gammaloop-api/src/python.rs - python::evaluate_graph_overall_factor (line 95)
  849. 518.94 s >
  850. 518.94 s > test result: FAILED. 2 passed; 14 failed; 0 ignored; 0 measured; 0 filtered out; finished in 2.82s
  851. 518.94 s >
  852. 518.94 s > error: doctest failed, to rerun pass `-p gammaloop-api --doc`
  853. 518.94 s For full logs, run:
  854. 518.94 s nix log /nix/store/qcailmgi3q1z5ibyq4n8nnc4asc1nkbp-gammaloop-workspace-doctest-0.1.0.drv
  855. 519.01 s [0 built (1 failed), 0.0Run failed.