1. 0.63 s $ /nix/store/9ypz3flqsrl5xl495mm8h645gadjsxi1-coreutils-9.11/bin/timeout --kill-after=15s 7200s /nix/store/23zk8sgzamrbmj1fday15szf7f2279s8-nix-2.34.7/bin/nix --extra-experimental-features nix-command --extra-experimental-features flakes flake clone git+https://github.com/alphal00p/gammaloop --dest /tmp/nix-ci-worker/stable-pwd/repo/
  2. 0.65 s Cloning into '/tmp/nix-ci-worker/stable-pwd/repo'...
  3. 0.90 s remote: Enumerating objects: 73453, done.
  4. 1.01 s remote: Counting objects: 0% (1/9296) remote: Counting objects: 1% (93/9296) remote: Counting objects: 2% (186/9296) remote: Counting objects: 3% (279/9296) remote: Counting objects: 4% (372/9296) remote: Counting objects: 5% (465/9296) remote: Counting objects: 6% (558/9296) remote: Counting objects: 7% (651/9296) remote: Counting objects: 8% (744/9296) remote: Counting objects: 9% (837/9296) remote: Counting objects: 10% (930/9296) remote: Counting objects: 11% (1023/9296) remote: Counting objects: 12% (1116/9296) remote: Counting objects: 13% (1209/9296) remote: Counting objects: 14% (1302/9296) remote: Counting objects: 15% (1395/9296) remote: Counting objects: 16% (1488/9296) remote: Counting objects: 17% (1581/9296) remote: Counting objects: 18% (1674/9296) remote: Counting objects: 19% (1767/9296) remote: Counting objects: 20% (1860/9296) remote: Counting objects: 21% (1953/9296) remote: Counting objects: 22% (2046/9296) remote: Counting objects: 23% (2139/9296) remote: Counting objects: 24% (2232/9296) remote: Counting objects: 25% (2324/9296) remote: Counting objects: 26% (2417/9296) remote: Counting objects: 27% (2510/9296) remote: Counting objects: 28% (2603/9296) remote: Counting objects: 29% (2696/9296) remote: Counting objects: 30% (2789/9296) remote: Counting objects: 31% (2882/9296) remote: Counting objects: 32% (2975/9296) remote: Counting objects: 33% (3068/9296) remote: Counting objects: 34% (3161/9296) remote: Counting objects: 35% (3254/9296) remote: Counting objects: 36% (3347/9296) remote: Counting objects: 37% (3440/9296) remote: Counting objects: 38% (3533/9296) remote: Counting objects: 39% (3626/9296) remote: Counting objects: 40% (3719/9296) remote: Counting objects: 41% (3812/9296) remote: Counting objects: 42% (3905/9296) remote: Counting objects: 43% (3998/9296) remote: Counting objects: 44% (4091/9296) remote: Counting objects: 45% (4184/9296) remote: Counting objects: 46% (4277/9296) remote: Counting objects: 47% (4370/9296) remote: Counting objects: 48% (4463/9296) remote: Counting objects: 49% (4556/9296) remote: Counting objects: 50% (4648/9296) remote: Counting objects: 51% (4741/9296) remote: Counting objects: 52% (4834/9296) remote: Counting objects: 53% (4927/9296) remote: Counting objects: 54% (5020/9296) remote: Counting objects: 55% (5113/9296) remote: Counting objects: 56% (5206/9296) remote: Counting objects: 57% (5299/9296) remote: Counting objects: 58% (5392/9296) remote: Counting objects: 59% (5485/9296) remote: Counting objects: 60% (5578/9296) remote: Counting objects: 61% (5671/9296) remote: Counting objects: 62% (5764/9296) remote: Counting objects: 63% (5857/9296) remote: Counting objects: 64% (5950/9296) remote: Counting objects: 65% (6043/9296) remote: Counting objects: 66% (6136/9296) remote: Counting objects: 67% (6229/9296) remote: Counting objects: 68% (6322/9296) remote: Counting objects: 69% (6415/9296) remote: Counting objects: 70% (6508/9296) remote: Counting objects: 71% (6601/9296) remote: Counting objects: 72% (6694/9296) remote: Counting objects: 73% (6787/9296) remote: Counting objects: 74% (6880/9296) remote: Counting objects: 75% (6972/9296) remote: Counting objects: 76% (7065/9296) remote: Counting objects: 77% (7158/9296) remote: Counting objects: 78% (7251/9296) remote: Counting objects: 79% (7344/9296) remote: Counting objects: 80% (7437/9296) remote: Counting objects: 81% (7530/9296) remote: Counting objects: 82% (7623/9296) remote: Counting objects: 83% (7716/9296) remote: Counting objects: 84% (7809/9296) remote: Counting objects: 85% (7902/9296) remote: Counting objects: 86% (7995/9296) remote: Counting objects: 87% (8088/9296) remote: Counting objects: 88% (8181/9296) remote: Counting objects: 89% (8274/9296) remote: Counting objects: 90% (8367/9296) remote: Counting objects: 91% (8460/9296) remote: Counting objects: 92% (8553/9296) remote: Counting objects: 93% (8646/9296) remote: Counting objects: 94% (8739/9296) remote: Counting objects: 95% (8832/9296) remote: Counting objects: 96% (8925/9296) remote: Counting objects: 97% (9018/9296) remote: Counting objects: 98% (9111/9296) remote: Counting objects: 99% (9204/9296) remote: Counting objects: 100% (9296/9296) remote: Counting objects: 100% (9296/9296), done.
  5. 3.29 s remote: Compressing objects: 0% (1/1922) remote: Compressing objects: 1% (20/1922) remote: Compressing objects: 2% (39/1922) remote: Compressing objects: 3% (58/1922) remote: Compressing objects: 4% (77/1922) remote: Compressing objects: 5% (97/1922) remote: Compressing objects: 6% (116/1922) remote: Compressing objects: 7% (135/1922) remote: Compressing objects: 8% (154/1922) remote: Compressing objects: 9% (173/1922) remote: Compressing objects: 10% (193/1922) remote: Compressing objects: 11% (212/1922) remote: Compressing objects: 12% (231/1922) remote: Compressing objects: 13% (250/1922) remote: Compressing objects: 14% (270/1922) remote: Compressing objects: 15% (289/1922) remote: Compressing objects: 15% (307/1922) remote: Compressing objects: 16% (308/1922) remote: Compressing objects: 17% (327/1922) remote: Compressing objects: 18% (346/1922) remote: Compressing objects: 19% (366/1922) remote: Compressing objects: 20% (385/1922) remote: Compressing objects: 21% (404/1922) remote: Compressing objects: 22% (423/1922) remote: Compressing objects: 23% (443/1922) remote: Compressing objects: 24% (462/1922) remote: Compressing objects: 25% (481/1922) remote: Compressing objects: 25% (498/1922) remote: Compressing objects: 26% (500/1922) remote: Compressing objects: 27% (519/1922) remote: Compressing objects: 28% (539/1922) remote: Compressing objects: 29% (558/1922) remote: Compressing objects: 30% (577/1922) remote: Compressing objects: 31% (596/1922) remote: Compressing objects: 32% (616/1922) remote: Compressing objects: 33% (635/1922) remote: Compressing objects: 34% (654/1922) remote: Compressing objects: 35% (673/1922) remote: Compressing objects: 36% (692/1922) remote: Compressing objects: 37% (712/1922) remote: Compressing objects: 38% (731/1922) remote: Compressing objects: 39% (750/1922) remote: Compressing objects: 40% (769/1922) remote: Compressing objects: 41% (789/1922) remote: Compressing objects: 42% (808/1922) remote: Compressing objects: 43% (827/1922) remote: Compressing objects: 44% (846/1922) remote: Compressing objects: 45% (865/1922) remote: Compressing objects: 46% (885/1922) remote: Compressing objects: 47% (904/1922) remote: Compressing objects: 48% (923/1922) remote: Compressing objects: 49% (942/1922) remote: Compressing objects: 50% (961/1922) remote: Compressing objects: 51% (981/1922) remote: Compressing objects: 52% (1000/1922) remote: Compressing objects: 53% (1019/1922) remote: Compressing objects: 54% (1038/1922) remote: Compressing objects: 55% (1058/1922) remote: Compressing objects: 56% (1077/1922) remote: Compressing objects: 57% (1096/1922) remote: Compressing objects: 58% (1115/1922) remote: Compressing objects: 59% (1134/1922) remote: Compressing objects: 60% (1154/1922) remote: Compressing objects: 61% (1173/1922) remote: Compressing objects: 62% (1192/1922) remote: Compressing objects: 63% (1211/1922) remote: Compressing objects: 64% (1231/1922) remote: Compressing objects: 65% (1250/1922) remote: Compressing objects: 66% (1269/1922) remote: Compressing objects: 67% (1288/1922) remote: Compressing objects: 68% (1307/1922) remote: Compressing objects: 69% (1327/1922) remote: Compressing objects: 70% (1346/1922) remote: Compressing objects: 71% (1365/1922) remote: Compressing objects: 72% (1384/1922) remote: Compressing objects: 73% (1404/1922) remote: Compressing objects: 74% (1423/1922) remote: Compressing objects: 75% (1442/1922) remote: Compressing objects: 76% (1461/1922) remote: Compressing objects: 77% (1480/1922) remote: Compressing objects: 78% (1500/1922) remote: Compressing objects: 79% (1519/1922) remote: Compressing objects: 80% (1538/1922) remote: Compressing objects: 81% (1557/1922) remote: Compressing objects: 82% (1577/1922) remote: Compressing objects: 83% (1596/1922) remote: Compressing objects: 84% (1615/1922) remote: Compressing objects: 85% (1634/1922) remote: Compressing objects: 86% (1653/1922) remote: Compressing objects: 87% (1673/1922) remote: Compressing objects: 88% (1692/1922) remote: Compressing objects: 89% (1711/1922) remote: Compressing objects: 90% (1730/1922) remote: Compressing objects: 91% (1750/1922) remote: Compressing objects: 92% (1769/1922) remote: Compressing objects: 93% (1788/1922) remote: Compressing objects: 94% (1807/1922) remote: Compressing objects: 95% (1826/1922) remote: Compressing objects: 96% (1846/1922) remote: Compressing objects: 97% (1865/1922) remote: Compressing objects: 98% (1884/1922) remote: Compressing objects: 99% (1903/1922) remote: Compressing objects: 100% (1922/1922) remote: Compressing objects: 100% (1922/1922), done.
  6. 6.70 s Receiving objects: 0% (1/73453) Receiving objects: 1% (735/73453) Receiving objects: 2% (1470/73453) Receiving objects: 3% (2204/73453) Receiving objects: 4% (2939/73453) Receiving objects: 5% (3673/73453) Receiving objects: 6% (4408/73453) Receiving objects: 7% (5142/73453) Receiving objects: 8% (5877/73453) Receiving objects: 9% (6611/73453) Receiving objects: 10% (7346/73453) Receiving objects: 11% (8080/73453), 17.11 MiB | 34.19 MiB/s Receiving objects: 12% (8815/73453), 17.11 MiB | 34.19 MiB/s Receiving objects: 13% (9549/73453), 17.11 MiB | 34.19 MiB/s Receiving objects: 14% (10284/73453), 17.11 MiB | 34.19 MiB/s Receiving objects: 15% (11018/73453), 17.11 MiB | 34.19 MiB/s Receiving objects: 16% (11753/73453), 17.11 MiB | 34.19 MiB/s Receiving objects: 17% (12488/73453), 17.11 MiB | 34.19 MiB/s Receiving objects: 18% (13222/73453), 17.11 MiB | 34.19 MiB/s Receiving objects: 19% (13957/73453), 17.11 MiB | 34.19 MiB/s Receiving objects: 20% (14691/73453), 17.11 MiB | 34.19 MiB/s Receiving objects: 21% (15426/73453), 17.11 MiB | 34.19 MiB/s Receiving objects: 22% (16160/73453), 17.11 MiB | 34.19 MiB/s Receiving objects: 23% (16895/73453), 17.11 MiB | 34.19 MiB/s Receiving objects: 24% (17629/73453), 17.11 MiB | 34.19 MiB/s Receiving objects: 25% (18364/73453), 17.11 MiB | 34.19 MiB/s Receiving objects: 26% (19098/73453), 17.11 MiB | 34.19 MiB/s Receiving objects: 27% (19833/73453), 17.11 MiB | 34.19 MiB/s Receiving objects: 28% (20567/73453), 17.11 MiB | 34.19 MiB/s Receiving objects: 29% (21302/73453), 17.11 MiB | 34.19 MiB/s Receiving objects: 30% (22036/73453), 17.11 MiB | 34.19 MiB/s Receiving objects: 31% (22771/73453), 17.11 MiB | 34.19 MiB/s Receiving objects: 32% (23505/73453), 17.11 MiB | 34.19 MiB/s Receiving objects: 33% (24240/73453), 17.11 MiB | 34.19 MiB/s Receiving objects: 34% (24975/73453), 17.11 MiB | 34.19 MiB/s Receiving objects: 35% (25709/73453), 17.11 MiB | 34.19 MiB/s Receiving objects: 36% (26444/73453), 17.11 MiB | 34.19 MiB/s Receiving objects: 37% (27178/73453), 17.11 MiB | 34.19 MiB/s Receiving objects: 38% (27913/73453), 17.11 MiB | 34.19 MiB/s Receiving objects: 39% (28647/73453), 17.11 MiB | 34.19 MiB/s Receiving objects: 40% (29382/73453), 17.11 MiB | 34.19 MiB/s Receiving objects: 41% (30116/73453), 17.11 MiB | 34.19 MiB/s Receiving objects: 42% (30851/73453), 17.11 MiB | 34.19 MiB/s Receiving objects: 43% (31585/73453), 17.11 MiB | 34.19 MiB/s Receiving objects: 44% (32320/73453), 17.11 MiB | 34.19 MiB/s Receiving objects: 45% (33054/73453), 17.11 MiB | 34.19 MiB/s Receiving objects: 46% (33789/73453), 17.11 MiB | 34.19 MiB/s Receiving objects: 46% (34126/73453), 17.11 MiB | 34.19 MiB/s Receiving objects: 47% (34523/73453), 33.54 MiB | 33.50 MiB/s Receiving objects: 48% (35258/73453), 33.54 MiB | 33.50 MiB/s Receiving objects: 49% (35992/73453), 33.54 MiB | 33.50 MiB/s Receiving objects: 50% (36727/73453), 33.54 MiB | 33.50 MiB/s Receiving objects: 51% (37462/73453), 33.54 MiB | 33.50 MiB/s Receiving objects: 52% (38196/73453), 33.54 MiB | 33.50 MiB/s Receiving objects: 53% (38931/73453), 33.54 MiB | 33.50 MiB/s Receiving objects: 54% (39665/73453), 33.54 MiB | 33.50 MiB/s Receiving objects: 55% (40400/73453), 33.54 MiB | 33.50 MiB/s Receiving objects: 56% (41134/73453), 33.54 MiB | 33.50 MiB/s Receiving objects: 57% (41869/73453), 33.54 MiB | 33.50 MiB/s Receiving objects: 58% (42603/73453), 33.54 MiB | 33.50 MiB/s Receiving objects: 59% (43338/73453), 51.31 MiB | 33.65 MiB/s Receiving objects: 60% (44072/73453), 51.31 MiB | 33.65 MiB/s Receiving objects: 61% (44807/73453), 51.31 MiB | 33.65 MiB/s Receiving objects: 62% (45541/73453), 51.31 MiB | 33.65 MiB/s Receiving objects: 63% (46276/73453), 51.31 MiB | 33.65 MiB/s Receiving objects: 64% (47010/73453), 51.31 MiB | 33.65 MiB/s Receiving objects: 65% (47745/73453), 51.31 MiB | 33.65 MiB/s Receiving objects: 66% (48479/73453), 51.31 MiB | 33.65 MiB/s Receiving objects: 67% (49214/73453), 51.31 MiB | 33.65 MiB/s Receiving objects: 67% (49931/73453), 51.31 MiB | 33.65 MiB/s Receiving objects: 68% (49949/73453), 51.31 MiB | 33.65 MiB/s Receiving objects: 69% (50683/73453), 69.89 MiB | 33.72 MiB/s Receiving objects: 70% (51418/73453), 69.89 MiB | 33.72 MiB/s Receiving objects: 71% (52152/73453), 69.89 MiB | 33.72 MiB/s Receiving objects: 72% (52887/73453), 69.89 MiB | 33.72 MiB/s Receiving objects: 73% (53621/73453), 69.89 MiB | 33.72 MiB/s Receiving objects: 74% (54356/73453), 69.89 MiB | 33.72 MiB/s Receiving objects: 75% (55090/73453), 69.89 MiB | 33.72 MiB/s Receiving objects: 76% (55825/73453), 69.89 MiB | 33.72 MiB/s Receiving objects: 77% (56559/73453), 69.89 MiB | 33.72 MiB/s Receiving objects: 78% (57294/73453), 69.89 MiB | 33.72 MiB/s Receiving objects: 79% (58028/73453), 69.89 MiB | 33.72 MiB/s Receiving objects: 80% (58763/73453), 69.89 MiB | 33.72 MiB/s Receiving objects: 81% (59497/73453), 69.89 MiB | 33.72 MiB/s Receiving objects: 82% (60232/73453), 69.89 MiB | 33.72 MiB/s Receiving objects: 83% (60966/73453), 89.15 MiB | 34.04 MiB/s Receiving objects: 84% (61701/73453), 89.15 MiB | 34.04 MiB/s Receiving objects: 85% (62436/73453), 89.15 MiB | 34.04 MiB/s Receiving objects: 86% (63170/73453), 89.15 MiB | 34.04 MiB/s Receiving objects: 86% (63627/73453), 89.15 MiB | 34.04 MiB/s Receiving objects: 87% (63905/73453), 107.15 MiB | 34.35 MiB/s Receiving objects: 88% (64639/73453), 107.15 MiB | 34.35 MiB/s Receiving objects: 89% (65374/73453), 107.15 MiB | 34.35 MiB/s Receiving objects: 90% (66108/73453), 107.15 MiB | 34.35 MiB/s Receiving objects: 91% (66843/73453), 107.15 MiB | 34.35 MiB/s Receiving objects: 92% (67577/73453), 107.15 MiB | 34.35 MiB/s Receiving objects: 93% (68312/73453), 107.15 MiB | 34.35 MiB/s Receiving objects: 94% (69046/73453), 107.15 MiB | 34.35 MiB/s Receiving objects: 95% (69781/73453), 107.15 MiB | 34.35 MiB/s Receiving objects: 96% (70515/73453), 107.15 MiB | 34.35 MiB/s Receiving objects: 97% (71250/73453), 107.15 MiB | 34.35 MiB/s Receiving objects: 98% (71984/73453), 107.15 MiB | 34.35 MiB/s Receiving objects: 99% (72719/73453), 107.15 MiB | 34.35 MiB/s remote: Total 73453 (delta 7532), reused 7642 (delta 6847), pack-reused 64157 (from 2)
  7. 6.72 s Receiving objects: 100% (73453/73453), 107.15 MiB | 34.35 MiB/s Receiving objects: 100% (73453/73453), 117.19 MiB | 34.40 MiB/s, done.
  8. 7.45 s Resolving deltas: 0% (0/50830) Resolving deltas: 1% (509/50830) Resolving deltas: 2% (1017/50830) Resolving deltas: 3% (1525/50830) Resolving deltas: 4% (2034/50830) Resolving deltas: 5% (2542/50830) Resolving deltas: 6% (3050/50830) Resolving deltas: 7% (3559/50830) Resolving deltas: 8% (4067/50830) Resolving deltas: 9% (4575/50830) Resolving deltas: 10% (5084/50830) Resolving deltas: 11% (5592/50830) Resolving deltas: 12% (6100/50830) Resolving deltas: 13% (6608/50830) Resolving deltas: 14% (7118/50830) Resolving deltas: 15% (7625/50830) Resolving deltas: 16% (8133/50830) Resolving deltas: 17% (8642/50830) Resolving deltas: 18% (9151/50830) Resolving deltas: 19% (9658/50830) Resolving deltas: 20% (10166/50830) Resolving deltas: 21% (10675/50830) Resolving deltas: 22% (11183/50830) Resolving deltas: 23% (11691/50830) Resolving deltas: 24% (12201/50830) Resolving deltas: 25% (12708/50830) Resolving deltas: 26% (13216/50830) Resolving deltas: 27% (13725/50830) Resolving deltas: 28% (14233/50830) Resolving deltas: 29% (14741/50830) Resolving deltas: 30% (15249/50830) Resolving deltas: 31% (15758/50830) Resolving deltas: 32% (16266/50830) Resolving deltas: 33% (16774/50830) Resolving deltas: 34% (17283/50830) Resolving deltas: 35% (17791/50830) Resolving deltas: 36% (18299/50830) Resolving deltas: 37% (18808/50830) Resolving deltas: 38% (19318/50830) Resolving deltas: 39% (19824/50830) Resolving deltas: 40% (20332/50830) Resolving deltas: 41% (20841/50830) Resolving deltas: 42% (21350/50830) Resolving deltas: 43% (21857/50830) Resolving deltas: 44% (22367/50830) Resolving deltas: 45% (22874/50830) Resolving deltas: 46% (23382/50830) Resolving deltas: 47% (23895/50830) Resolving deltas: 48% (24399/50830) Resolving deltas: 49% (24908/50830) Resolving deltas: 50% (25415/50830) Resolving deltas: 51% (25925/50830) Resolving deltas: 52% (26432/50830) Resolving deltas: 53% (26940/50830) Resolving deltas: 54% (27449/50830) Resolving deltas: 55% (27957/50830) Resolving deltas: 56% (28465/50830) Resolving deltas: 57% (28979/50830) Resolving deltas: 58% (29482/50830) Resolving deltas: 59% (29990/50830) Resolving deltas: 60% (30498/50830) Resolving deltas: 61% (31007/50830) Resolving deltas: 62% (31515/50830) Resolving deltas: 63% (32023/50830) Resolving deltas: 64% (32532/50830) Resolving deltas: 65% (33040/50830) Resolving deltas: 66% (33548/50830) Resolving deltas: 67% (34057/50830) Resolving deltas: 68% (34565/50830) Resolving deltas: 69% (35073/50830) Resolving deltas: 70% (35582/50830) Resolving deltas: 71% (36091/50830) Resolving deltas: 72% (36598/50830) Resolving deltas: 73% (37106/50830) Resolving deltas: 74% (37615/50830) Resolving deltas: 75% (38123/50830) Resolving deltas: 76% (38632/50830) Resolving deltas: 77% (39140/50830) Resolving deltas: 78% (39648/50830) Resolving deltas: 79% (40156/50830) Resolving deltas: 80% (40664/50830) Resolving deltas: 81% (41173/50830) Resolving deltas: 82% (41681/50830) Resolving deltas: 83% (42190/50830) Resolving deltas: 84% (42698/50830) Resolving deltas: 85% (43208/50830) Resolving deltas: 86% (43714/50830) Resolving deltas: 87% (44223/50830) Resolving deltas: 88% (44731/50830) Resolving deltas: 89% (45239/50830) Resolving deltas: 90% (45747/50830) Resolving deltas: 91% (46256/50830) Resolving deltas: 92% (46765/50830) Resolving deltas: 93% (47273/50830) Resolving deltas: 94% (47781/50830) Resolving deltas: 95% (48289/50830) Resolving deltas: 96% (48797/50830) Resolving deltas: 97% (49307/50830) Resolving deltas: 98% (49817/50830) Resolving deltas: 99% (50322/50830) Resolving deltas: 100% (50830/50830) Resolving deltas: 100% (50830/50830), done.
  9. 7.78 s Fetching commit 36f5c8d96254ee19f0c0bbc3f6a6e49b5d9777aa for docs ...
  10. 7.78 s $ /nix/store/bcnisk3ydfgv26v2gw3zlky24g00yww2-git-2.54.0/bin/git fetch origin 36f5c8d96254ee19f0c0bbc3f6a6e49b5d9777aa
  11. 8.23 s From https://github.com/alphal00p/gammaloop
  12. 8.23 s * branch 36f5c8d96254ee19f0c0bbc3f6a6e49b5d9777aa -> FETCH_HEAD
  13. 8.24 s $ /nix/store/9ypz3flqsrl5xl495mm8h645gadjsxi1-coreutils-9.11/bin/timeout --kill-after=15s 7200s /nix/store/bcnisk3ydfgv26v2gw3zlky24g00yww2-git-2.54.0/bin/git -c advice.detachedHead=false checkout 36f5c8d96254ee19f0c0bbc3f6a6e49b5d9777aa
  14. 8.43 s HEAD is now at 36f5c8d96 move portal pages from Rust into native Typst
  15. 8.43 s $ /nix/store/9ypz3flqsrl5xl495mm8h645gadjsxi1-coreutils-9.11/bin/timeout --kill-after=15s 7200s /nix/store/23zk8sgzamrbmj1fday15szf7f2279s8-nix-2.34.7/bin/nix --extra-experimental-features nix-command --extra-experimental-features flakes --log-format internal-json run .#packages.x86_64-linux.nix-ci-check-gammaloop-nextest-python-api --print-build-logs
  16. 8.84 s
  17. 9.52 s Downloading cached source from https://cache.nix-ci.com
  18. 16.13 s Downloaded cached source (203.2 MiB) in 6.6s
  19. 16.17 s Progress: 1 of 1 downloaded from cache
  20. 16.23 s stdenv.isDarwin is deprecated, use stdenv.hostPlatform.isDarwin instead
  21. 22.92 s fetching Git repository 'https://github.com/symbolica-dev/symbolica'
  22. 23.58 s remote: Enumerating objects: 9552, done.
  23. 23.70 s remote: Counting objects: 0% (1/528) remote: Counting objects: 1% (6/528) remote: Counting objects: 2% (11/528) remote: Counting objects: 3% (16/528) remote: Counting objects: 4% (22/528) remote: Counting objects: 5% (27/528) remote: Counting objects: 6% (32/528) remote: Counting objects: 7% (37/528) remote: Counting objects: 8% (43/528) remote: Counting objects: 9% (48/528) remote: Counting objects: 10% (53/528) remote: Counting objects: 11% (59/528) remote: Counting objects: 12% (64/528) remote: Counting objects: 13% (69/528) remote: Counting objects: 14% (74/528) remote: Counting objects: 15% (80/528) remote: Counting objects: 16% (85/528) remote: Counting objects: 17% (90/528) remote: Counting objects: 18% (96/528) remote: Counting objects: 19% (101/528) remote: Counting objects: 20% (106/528) remote: Counting objects: 21% (111/528) remote: Counting objects: 22% (117/528) remote: Counting objects: 23% (122/528) remote: Counting objects: 24% (127/528) remote: Counting objects: 25% (132/528) remote: Counting objects: 26% (138/528) remote: Counting objects: 27% (143/528) remote: Counting objects: 28% (148/528) remote: Counting objects: 29% (154/528) remote: Counting objects: 30% (159/528) remote: Counting objects: 31% (164/528) remote: Counting objects: 32% (169/528) remote: Counting objects: 33% (175/528) remote: Counting objects: 34% (180/528) remote: Counting objects: 35% (185/528) remote: Counting objects: 36% (191/528) remote: Counting objects: 37% (196/528) remote: Counting objects: 38% (201/528) remote: Counting objects: 39% (206/528) remote: Counting objects: 40% (212/528) remote: Counting objects: 41% (217/528) remote: Counting objects: 42% (222/528) remote: Counting objects: 43% (228/528) remote: Counting objects: 44% (233/528) remote: Counting objects: 45% (238/528) remote: Counting objects: 46% (243/528) remote: Counting objects: 47% (249/528) remote: Counting objects: 48% (254/528) remote: Counting objects: 49% (259/528) remote: Counting objects: 50% (264/528) remote: Counting objects: 51% (270/528) remote: Counting objects: 52% (275/528) remote: Counting objects: 53% (280/528) remote: Counting objects: 54% (286/528) remote: Counting objects: 55% (291/528) remote: Counting objects: 56% (296/528) remote: Counting objects: 57% (301/528) remote: Counting objects: 58% (307/528) remote: Counting objects: 59% (312/528) remote: Counting objects: 60% (317/528) remote: Counting objects: 61% (323/528) remote: Counting objects: 62% (328/528) remote: Counting objects: 63% (333/528) remote: Counting objects: 64% (338/528) remote: Counting objects: 65% (344/528) remote: Counting objects: 66% (349/528) remote: Counting objects: 67% (354/528) remote: Counting objects: 68% (360/528) remote: Counting objects: 69% (365/528) remote: Counting objects: 70% (370/528) remote: Counting objects: 71% (375/528) remote: Counting objects: 72% (381/528) remote: Counting objects: 73% (386/528) remote: Counting objects: 74% (391/528) remote: Counting objects: 75% (396/528) remote: Counting objects: 76% (402/528) remote: Counting objects: 77% (407/528) remote: Counting objects: 78% (412/528) remote: Counting objects: 79% (418/528) remote: Counting objects: 80% (423/528) remote: Counting objects: 81% (428/528) remote: Counting objects: 82% (433/528) remote: Counting objects: 83% (439/528) remote: Counting objects: 84% (444/528) remote: Counting objects: 85% (449/528) remote: Counting objects: 86% (455/528) remote: Counting objects: 87% (460/528) remote: Counting objects: 88% (465/528) remote: Counting objects: 89% (470/528) remote: Counting objects: 90% (476/528) remote: Counting objects: 91% (481/528) remote: Counting objects: 92% (486/528) remote: Counting objects: 93% (492/528) remote: Counting objects: 94% (497/528) remote: Counting objects: 95% (502/528) remote: Counting objects: 96% (507/528) remote: Counting objects: 97% (513/528) remote: Counting objects: 98% (518/528) remote: Counting objects: 99% (523/528) remote: Counting objects: 100% (528/528) remote: Counting objects: 100% (528/528), done.
  24. 24.06 s remote: Compressing objects: 0% (1/103) remote: Compressing objects: 1% (2/103) remote: Compressing objects: 2% (3/103) remote: Compressing objects: 3% (4/103) remote: Compressing objects: 4% (5/103) remote: Compressing objects: 5% (6/103) remote: Compressing objects: 6% (7/103) remote: Compressing objects: 7% (8/103) remote: Compressing objects: 8% (9/103) remote: Compressing objects: 9% (10/103) remote: Compressing objects: 10% (11/103) remote: Compressing objects: 11% (12/103) remote: Compressing objects: 12% (13/103) remote: Compressing objects: 13% (14/103) remote: Compressing objects: 14% (15/103) remote: Compressing objects: 15% (16/103) remote: Compressing objects: 16% (17/103) remote: Compressing objects: 17% (18/103) remote: Compressing objects: 18% (19/103) remote: Compressing objects: 19% (20/103) remote: Compressing objects: 20% (21/103) remote: Compressing objects: 21% (22/103) remote: Compressing objects: 22% (23/103) remote: Compressing objects: 23% (24/103) remote: Compressing objects: 24% (25/103) remote: Compressing objects: 25% (26/103) remote: Compressing objects: 26% (27/103) remote: Compressing objects: 27% (28/103) remote: Compressing objects: 28% (29/103) remote: Compressing objects: 29% (30/103) remote: Compressing objects: 30% (31/103) remote: Compressing objects: 31% (32/103) remote: Compressing objects: 32% (33/103) remote: Compressing objects: 33% (34/103) remote: Compressing objects: 34% (36/103) remote: Compressing objects: 35% (37/103) remote: Compressing objects: 36% (38/103) remote: Compressing objects: 37% (39/103) remote: Compressing objects: 38% (40/103) remote: Compressing objects: 39% (41/103) remote: Compressing objects: 40% (42/103) remote: Compressing objects: 41% (43/103) remote: Compressing objects: 42% (44/103) remote: Compressing objects: 43% (45/103) remote: Compressing objects: 44% (46/103) remote: Compressing objects: 45% (47/103) remote: Compressing objects: 46% (48/103) remote: Compressing objects: 47% (49/103) remote: Compressing objects: 48% (50/103) remote: Compressing objects: 49% (51/103) remote: Compressing objects: 50% (52/103) remote: Compressing objects: 51% (53/103) remote: Compressing objects: 52% (54/103) remote: Compressing objects: 53% (55/103) remote: Compressing objects: 54% (56/103) remote: Compressing objects: 55% (57/103) remote: Compressing objects: 56% (58/103) remote: Compressing objects: 57% (59/103) remote: Compressing objects: 58% (60/103) remote: Compressing objects: 59% (61/103) remote: Compressing objects: 60% (62/103) remote: Compressing objects: 61% (63/103) remote: Compressing objects: 62% (64/103) remote: Compressing objects: 63% (65/103) remote: Compressing objects: 64% (66/103) remote: Compressing objects: 65% (67/103) remote: Compressing objects: 66% (68/103) remote: Compressing objects: 67% (70/103) remote: Compressing objects: 68% (71/103) remote: Compressing objects: 69% (72/103) remote: Compressing objects: 70% (73/103) remote: Compressing objects: 71% (74/103) remote: Compressing objects: 72% (75/103) remote: Compressing objects: 73% (76/103) remote: Compressing objects: 74% (77/103) remote: Compressing objects: 75% (78/103) remote: Compressing objects: 76% (79/103) remote: Compressing objects: 77% (80/103) remote: Compressing objects: 78% (81/103) remote: Compressing objects: 79% (82/103) remote: Compressing objects: 80% (83/103) remote: Compressing objects: 81% (84/103) remote: Compressing objects: 82% (85/103) remote: Compressing objects: 83% (86/103) remote: Compressing objects: 84% (87/103) remote: Compressing objects: 85% (88/103) remote: Compressing objects: 86% (89/103) remote: Compressing objects: 87% (90/103) remote: Compressing objects: 88% (91/103) remote: Compressing objects: 89% (92/103) remote: Compressing objects: 90% (93/103) remote: Compressing objects: 91% (94/103) remote: Compressing objects: 92% (95/103) remote: Compressing objects: 93% (96/103) remote: Compressing objects: 94% (97/103) remote: Compressing objects: 95% (98/103) remote: Compressing objects: 96% (99/103) remote: Compressing objects: 97% (100/103) remote: Compressing objects: 98% (101/103) remote: Compressing objects: 99% (102/103) remote: Compressing objects: 100% (103/103) remote: Compressing objects: 100% (103/103), done.
  25. 24.22 s Receiving objects: 0% (1/9552) Receiving objects: 1% (96/9552) Receiving objects: 2% (192/9552) Receiving objects: 3% (287/9552) Receiving objects: 4% (383/9552) Receiving objects: 5% (478/9552) Receiving objects: 6% (574/9552) Receiving objects: 7% (669/9552) Receiving objects: 8% (765/9552) Receiving objects: 9% (860/9552) Receiving objects: 10% (956/9552) Receiving objects: 11% (1051/9552) Receiving objects: 12% (1147/9552) Receiving objects: 13% (1242/9552) Receiving objects: 14% (1338/9552) Receiving objects: 15% (1433/9552) Receiving objects: 16% (1529/9552) Receiving objects: 17% (1624/9552) Receiving objects: 18% (1720/9552) Receiving objects: 19% (1815/9552) Receiving objects: 20% (1911/9552) Receiving objects: 21% (2006/9552) Receiving objects: 22% (2102/9552) Receiving objects: 23% (2197/9552) Receiving objects: 24% (2293/9552) Receiving objects: 25% (2388/9552) Receiving objects: 26% (2484/9552) Receiving objects: 27% (2580/9552) Receiving objects: 28% (2675/9552) Receiving objects: 29% (2771/9552) Receiving objects: 30% (2866/9552) Receiving objects: 31% (2962/9552) Receiving objects: 32% (3057/9552) Receiving objects: 33% (3153/9552) Receiving objects: 34% (3248/9552) Receiving objects: 35% (3344/9552) Receiving objects: 36% (3439/9552) Receiving objects: 37% (3535/9552) Receiving objects: 38% (3630/9552) Receiving objects: 39% (3726/9552) Receiving objects: 40% (3821/9552) Receiving objects: 41% (3917/9552) Receiving objects: 42% (4012/9552) Receiving objects: 43% (4108/9552) Receiving objects: 44% (4203/9552) Receiving objects: 45% (4299/9552) Receiving objects: 46% (4394/9552) Receiving objects: 47% (4490/9552) Receiving objects: 48% (4585/9552) Receiving objects: 49% (4681/9552) Receiving objects: 50% (4776/9552) Receiving objects: 51% (4872/9552) Receiving objects: 52% (4968/9552) Receiving objects: 53% (5063/9552) Receiving objects: 54% (5159/9552) Receiving objects: 55% (5254/9552) Receiving objects: 56% (5350/9552) Receiving objects: 57% (5445/9552) Receiving objects: 58% (5541/9552) Receiving objects: 59% (5636/9552) Receiving objects: 60% (5732/9552) Receiving objects: 61% (5827/9552) Receiving objects: 62% (5923/9552) Receiving objects: 63% (6018/9552) Receiving objects: 64% (6114/9552) Receiving objects: 65% (6209/9552) Receiving objects: 66% (6305/9552) Receiving objects: 67% (6400/9552) Receiving objects: 68% (6496/9552) Receiving objects: 69% (6591/9552) Receiving objects: 70% (6687/9552) Receiving objects: 71% (6782/9552) Receiving objects: 72% (6878/9552) Receiving objects: 73% (6973/9552) Receiving objects: 74% (7069/9552) Receiving objects: 75% (7164/9552) Receiving objects: 76% (7260/9552) Receiving objects: 77% (7356/9552) Receiving objects: 78% (7451/9552) Receiving objects: 79% (7547/9552) Receiving objects: 80% (7642/9552) Receiving objects: 81% (7738/9552) Receiving objects: 82% (7833/9552) Receiving objects: 83% (7929/9552) Receiving objects: 84% (8024/9552) Receiving objects: 85% (8120/9552) Receiving objects: 86% (8215/9552) Receiving objects: 87% (8311/9552) Receiving objects: 88% (8406/9552) Receiving objects: 89% (8502/9552) Receiving objects: 90% (8597/9552) Receiving objects: 91% (8693/9552) Receiving objects: 92% (8788/9552) Receiving objects: 93% (8884/9552) Receiving objects: 94% (8979/9552) Receiving objects: 95% (9075/9552) Receiving objects: 96% (9170/9552) Receiving objects: 97% (9266/9552) Receiving objects: 98% (9361/9552) Receiving objects: 99% (9457/9552) remote: Total 9552 (delta 468), reused 425 (delta 425), pack-reused 9024 (from 2)
  26. 24.22 s Receiving objects: 100% (9552/9552) Receiving objects: 100% (9552/9552), 5.79 MiB | 35.50 MiB/s, done.
  27. 24.36 s Resolving deltas: 0% (0/7517) Resolving deltas: 1% (77/7517) Resolving deltas: 2% (151/7517) Resolving deltas: 3% (226/7517) Resolving deltas: 4% (301/7517) Resolving deltas: 5% (376/7517) Resolving deltas: 6% (452/7517) Resolving deltas: 7% (527/7517) Resolving deltas: 8% (602/7517) Resolving deltas: 9% (677/7517) Resolving deltas: 10% (752/7517) Resolving deltas: 11% (827/7517) Resolving deltas: 12% (903/7517) Resolving deltas: 13% (978/7517) Resolving deltas: 14% (1053/7517) Resolving deltas: 15% (1128/7517) Resolving deltas: 16% (1203/7517) Resolving deltas: 17% (1278/7517) Resolving deltas: 18% (1354/7517) Resolving deltas: 19% (1429/7517) Resolving deltas: 20% (1504/7517) Resolving deltas: 21% (1579/7517) Resolving deltas: 22% (1655/7517) Resolving deltas: 23% (1729/7517) Resolving deltas: 24% (1807/7517) Resolving deltas: 25% (1880/7517) Resolving deltas: 26% (1956/7517) Resolving deltas: 27% (2030/7517) Resolving deltas: 28% (2106/7517) Resolving deltas: 29% (2180/7517) Resolving deltas: 30% (2256/7517) Resolving deltas: 31% (2331/7517) Resolving deltas: 32% (2407/7517) Resolving deltas: 33% (2481/7517) Resolving deltas: 34% (2556/7517) Resolving deltas: 35% (2631/7517) Resolving deltas: 36% (2707/7517) Resolving deltas: 37% (2783/7517) Resolving deltas: 38% (2858/7517) Resolving deltas: 39% (2932/7517) Resolving deltas: 40% (3007/7517) Resolving deltas: 41% (3082/7517) Resolving deltas: 42% (3158/7517) Resolving deltas: 43% (3233/7517) Resolving deltas: 44% (3308/7517) Resolving deltas: 45% (3383/7517) Resolving deltas: 46% (3458/7517) Resolving deltas: 47% (3533/7517) Resolving deltas: 48% (3609/7517) Resolving deltas: 49% (3684/7517) Resolving deltas: 50% (3759/7517) Resolving deltas: 51% (3834/7517) Resolving deltas: 52% (3909/7517) Resolving deltas: 53% (3987/7517) Resolving deltas: 54% (4060/7517) Resolving deltas: 55% (4136/7517) Resolving deltas: 56% (4210/7517) Resolving deltas: 57% (4286/7517) Resolving deltas: 58% (4360/7517) Resolving deltas: 59% (4436/7517) Resolving deltas: 60% (4511/7517) Resolving deltas: 61% (4586/7517) Resolving deltas: 62% (4661/7517) Resolving deltas: 63% (4736/7517) Resolving deltas: 64% (4811/7517) Resolving deltas: 65% (4887/7517) Resolving deltas: 66% (4962/7517) Resolving deltas: 67% (5037/7517) Resolving deltas: 68% (5112/7517) Resolving deltas: 69% (5187/7517) Resolving deltas: 70% (5263/7517) Resolving deltas: 71% (5338/7517) Resolving deltas: 72% (5416/7517) Resolving deltas: 73% (5488/7517) Resolving deltas: 74% (5565/7517) Resolving deltas: 75% (5639/7517) Resolving deltas: 76% (5713/7517) Resolving deltas: 77% (5789/7517) Resolving deltas: 78% (5865/7517) Resolving deltas: 79% (5939/7517) Resolving deltas: 80% (6014/7517) Resolving deltas: 81% (6090/7517) Resolving deltas: 82% (6166/7517) Resolving deltas: 83% (6241/7517) Resolving deltas: 84% (6315/7517) Resolving deltas: 85% (6392/7517) Resolving deltas: 86% (6466/7517) Resolving deltas: 87% (6540/7517) Resolving deltas: 88% (6616/7517) Resolving deltas: 89% (6691/7517) Resolving deltas: 90% (6766/7517) Resolving deltas: 91% (6843/7517) Resolving deltas: 92% (6916/7517) Resolving deltas: 93% (6991/7517) Resolving deltas: 94% (7066/7517) Resolving deltas: 95% (7142/7517) Resolving deltas: 96% (7217/7517) Resolving deltas: 97% (7292/7517) Resolving deltas: 98% (7367/7517) Resolving deltas: 99% (7442/7517) Resolving deltas: 100% (7517/7517) Resolving deltas: 100% (7517/7517), done.
  28. 24.50 s From https://github.com/symbolica-dev/symbolica
  29. 24.50 s * branch 0441bd7a511209dce2ca99925fe87f8b18e4bf03 -> FETCH_HEAD
  30. 29.02 s
  31. 29.02 s Downloading cached gammaloop-nextest-binaries-python-api-gammaloop-integration-tests from https://cache.nix-ci.com
  32. 29.04 s Downloading cached gcc-15.3.0-libgcc from https://cache.nix-ci.com
  33. 29.04 s Downloading cached xgcc-15.3.0-libgcc from https://cache.nix-ci.com
  34. 29.04 s Downloading cached busybox from https://cache.nix-ci.com
  35. 29.04 s Downloading cached libunistring from https://cache.nix-ci.com
  36. 29.04 s Downloading cached publicsuffix-list-0-unstable-2026-08 from https://cache.nix-ci.com
  37. 29.04 s Downloaded cached xgcc-15.3.0-libgcc (193 KiB) in 7ms
  38. 29.04 s Progress: 0 of 1 built, 1 of 68 downloaded from cache (5 downloading)
  39. 29.05 s Downloaded cached busybox (230 KiB) in 9ms
  40. 29.05 s Progress: 0 of 1 built, 2 of 68 downloaded from cache (4 downloading)
  41. 29.05 s Downloaded cached gcc-15.3.0-libgcc (193 KiB) in 10ms
  42. 29.05 s Progress: 0 of 1 built, 3 of 68 downloaded from cache (3 downloading)
  43. 29.05 s Downloaded cached libunistring (2 MiB) in 16ms
  44. 29.05 s Progress: 0 of 1 built, 4 of 68 downloaded from cache (2 downloading)
  45. 29.05 s Downloading cached libidn2 from https://cache.nix-ci.com
  46. 29.06 s Downloaded cached publicsuffix-list-0-unstable-2026-08 (329 KiB) in 17ms
  47. 29.06 s Progress: 0 of 1 built, 5 of 68 downloaded from cache (2 downloading)
  48. 29.07 s Downloaded cached libidn2 (359 KiB) in 19ms
  49. 29.07 s Progress: 0 of 1 built, 6 of 68 downloaded from cache (1 downloading)
  50. 29.07 s Downloading cached glibc-2.42 from https://cache.nix-ci.com
  51. 29.23 s Downloaded cached glibc-2.42 (33.4 MiB) in 154ms
  52. 29.23 s Progress: 0 of 1 built, 7 of 68 downloaded from cache (1 downloading)
  53. 29.23 s Downloading cached acl from https://cache.nix-ci.com
  54. 29.23 s Downloading cached aws-c-common from https://cache.nix-ci.com
  55. 29.23 s Downloading cached bash from https://cache.nix-ci.com
  56. 29.23 s Downloading cached brotli-1.2.0-lib from https://cache.nix-ci.com
  57. 29.23 s Downloading cached bzip2 from https://cache.nix-ci.com
  58. 29.23 s Downloading cached editline-1.17.1-unstable-2025-05 from https://cache.nix-ci.com
  59. 29.23 s Downloading cached gcc-15.3.0-lib from https://cache.nix-ci.com
  60. 29.23 s Downloading cached hwloc-2.14.0-lib from https://cache.nix-ci.com
  61. 29.23 s Downloading cached keyutils-1.6.3-lib from https://cache.nix-ci.com
  62. 29.23 s Downloading cached libcpuid from https://cache.nix-ci.com
  63. 29.23 s Downloading cached libseccomp-2.6.1-lib from https://cache.nix-ci.com
  64. 29.23 s Downloading cached libpsl from https://cache.nix-ci.com
  65. 29.23 s Downloading cached libsodium-1.0.22-unstable-2026-07 from https://cache.nix-ci.com
  66. 29.23 s Downloading cached libxml2 from https://cache.nix-ci.com
  67. 29.23 s Downloading cached llhttp from https://cache.nix-ci.com
  68. 29.24 s Downloaded cached gammaloop-nextest-binaries-python-api-gammaloop-integration-tests (33 MiB) in 220ms
  69. 29.24 s Progress: 0 of 1 built, 8 of 68 downloaded from cache (15 downloading)
  70. 29.24 s Downloading cached lowdown-3.0.1-lib from https://cache.nix-ci.com
  71. 29.25 s Downloaded cached acl (134 KiB) in 17ms
  72. 29.25 s Progress: 0 of 1 built, 9 of 68 downloaded from cache (15 downloading)
  73. 29.25 s Downloading cached gammaloop-nextest-binaries-python-api from https://cache.nix-ci.com
  74. 29.26 s Downloaded cached gammaloop-nextest-binaries-python-api (520 B) in 8ms
  75. 29.26 s Progress: 0 of 1 built, 10 of 68 downloaded from cache (15 downloading)
  76. 29.26 s Downloading cached nghttp2-1.70.0-lib from https://cache.nix-ci.com
  77. 29.26 s Downloaded cached aws-c-common (1.1 MiB) in 27ms
  78. 29.26 s Progress: 0 of 1 built, 11 of 68 downloaded from cache (15 downloading)
  79. 29.26 s Downloading cached nghttp3 from https://cache.nix-ci.com
  80. 29.26 s Downloaded cached bash (1.8 MiB) in 30ms
  81. 29.26 s Progress: 0 of 1 built, 12 of 68 downloaded from cache (15 downloading)
  82. 29.26 s Downloading cached aws-c-compression from https://cache.nix-ci.com
  83. 29.26 s Downloaded cached brotli-1.2.0-lib (961 KiB) in 30ms
  84. 29.26 s Progress: 0 of 1 built, 13 of 68 downloaded from cache (15 downloading)
  85. 29.26 s Downloading cached aws-c-sdkutils from https://cache.nix-ci.com
  86. 29.26 s Downloaded cached libseccomp-2.6.1-lib (189 KiB) in 30ms
  87. 29.26 s Downloaded cached hwloc-2.14.0-lib (458 KiB) in 30ms
  88. 29.26 s Progress: 0 of 1 built, 14 of 68 downloaded from cache (15 downloading)
  89. 29.26 s Progress: 0 of 1 built, 15 of 68 downloaded from cache (15 downloading)
  90. 29.26 s Downloading cached aws-checksums from https://cache.nix-ci.com
  91. 29.26 s Downloaded cached editline-1.17.1-unstable-2025-05 (58 KiB) in 31ms
  92. 29.26 s Downloading cached openssl from https://cache.nix-ci.com
  93. 29.26 s Progress: 0 of 1 built, 16 of 68 downloaded from cache (15 downloading)
  94. 29.26 s Downloading cached pcre2 from https://cache.nix-ci.com
  95. 29.27 s Downloaded cached libcpuid (326 KiB) in 34ms
  96. 29.27 s Progress: 0 of 1 built, 17 of 68 downloaded from cache (15 downloading)
  97. 29.27 s Downloading cached xz from https://cache.nix-ci.com
  98. 29.27 s Downloaded cached libpsl (114 KiB) in 36ms
  99. 29.27 s Progress: 0 of 1 built, 18 of 68 downloaded from cache (15 downloading)
  100. 29.27 s Downloaded cached libxml2 (1.4 MiB) in 36ms
  101. 29.27 s Downloading cached zlib from https://cache.nix-ci.com
  102. 29.27 s Progress: 0 of 1 built, 19 of 68 downloaded from cache (15 downloading)
  103. 29.27 s Downloaded cached bzip2 (86 KiB) in 39ms
  104. 29.27 s Progress: 0 of 1 built, 20 of 68 downloaded from cache (14 downloading)
  105. 29.27 s Downloaded cached keyutils-1.6.3-lib (41 KiB) in 42ms
  106. 29.27 s Progress: 0 of 1 built, 21 of 68 downloaded from cache (13 downloading)
  107. 29.27 s Downloaded cached libsodium-1.0.22-unstable-2026-07 (669 KiB) in 42ms
  108. 29.27 s Progress: 0 of 1 built, 22 of 68 downloaded from cache (12 downloading)
  109. 29.27 s Downloaded cached llhttp (89 KiB) in 43ms
  110. 29.27 s Progress: 0 of 1 built, 23 of 68 downloaded from cache (11 downloading)
  111. 29.28 s Downloaded cached lowdown-3.0.1-lib (341 KiB) in 37ms
  112. 29.28 s Progress: 0 of 1 built, 24 of 68 downloaded from cache (10 downloading)
  113. 29.28 s Downloaded cached nghttp2-1.70.0-lib (225 KiB) in 28ms
  114. 29.28 s Progress: 0 of 1 built, 25 of 68 downloaded from cache (9 downloading)
  115. 29.29 s Downloaded cached nghttp3 (228 KiB) in 28ms
  116. 29.29 s Progress: 0 of 1 built, 26 of 68 downloaded from cache (8 downloading)
  117. 29.29 s Downloaded cached aws-c-compression (31 KiB) in 29ms
  118. 29.29 s Progress: 0 of 1 built, 27 of 68 downloaded from cache (7 downloading)
  119. 29.29 s Downloaded cached aws-c-sdkutils (155 KiB) in 32ms
  120. 29.29 s Downloaded cached aws-checksums (86 KiB) in 32ms
  121. 29.29 s Progress: 0 of 1 built, 28 of 68 downloaded from cache (6 downloading)
  122. 29.29 s Progress: 0 of 1 built, 29 of 68 downloaded from cache (5 downloading)
  123. 29.30 s Downloaded cached zlib (129 KiB) in 30ms
  124. 29.30 s Progress: 0 of 1 built, 30 of 68 downloaded from cache (4 downloading)
  125. 29.30 s Downloading cached sqlite from https://cache.nix-ci.com
  126. 29.30 s Downloaded cached xz (837 KiB) in 33ms
  127. 29.30 s Progress: 0 of 1 built, 31 of 68 downloaded from cache (4 downloading)
  128. 29.31 s Downloaded cached pcre2 (2 MiB) in 49ms
  129. 29.31 s Progress: 0 of 1 built, 32 of 68 downloaded from cache (3 downloading)
  130. 29.32 s Downloaded cached gcc-15.3.0-lib (9.8 MiB) in 88ms
  131. 29.32 s Progress: 0 of 1 built, 33 of 68 downloaded from cache (2 downloading)
  132. 29.32 s Downloading cached boehm-gc from https://cache.nix-ci.com
  133. 29.32 s Downloading cached gammaloop-python-module from https://cache.nix-ci.com
  134. 29.32 s Downloading cached icu4c from https://cache.nix-ci.com
  135. 29.32 s Downloading cached onetbb from https://cache.nix-ci.com
  136. 29.32 s Downloading cached zstd from https://cache.nix-ci.com
  137. 29.35 s Downloaded cached openssl (8.9 MiB) in 88ms
  138. 29.35 s Progress: 0 of 1 built, 34 of 68 downloaded from cache (6 downloading)
  139. 29.35 s Downloading cached aws-c-cal from https://cache.nix-ci.com
  140. 29.35 s Downloading cached krb5-1.22.2-lib from https://cache.nix-ci.com
  141. 29.35 s Downloading cached libssh2 from https://cache.nix-ci.com
  142. 29.35 s Downloading cached ngtcp2 from https://cache.nix-ci.com
  143. 29.35 s Downloading cached s2n-tls from https://cache.nix-ci.com
  144. 29.35 s Downloaded cached boehm-gc (312 KiB) in 33ms
  145. 29.35 s Progress: 0 of 1 built, 35 of 68 downloaded from cache (10 downloading)
  146. 29.36 s Downloaded cached onetbb (626 KiB) in 43ms
  147. 29.36 s Progress: 0 of 1 built, 36 of 68 downloaded from cache (9 downloading)
  148. 29.36 s Downloading cached libblake3 from https://cache.nix-ci.com
  149. 29.37 s Downloaded cached zstd (1.1 MiB) in 45ms
  150. 29.37 s Progress: 0 of 1 built, 37 of 68 downloaded from cache (9 downloading)
  151. 29.37 s Downloading cached libarchive-3.8.9-lib from https://cache.nix-ci.com
  152. 29.38 s Downloaded cached sqlite (5.7 MiB) in 76ms
  153. 29.38 s Progress: 0 of 1 built, 38 of 68 downloaded from cache (9 downloading)
  154. 29.38 s Downloaded cached aws-c-cal (158 KiB) in 28ms
  155. 29.38 s Progress: 0 of 1 built, 39 of 68 downloaded from cache (8 downloading)
  156. 29.38 s Downloaded cached ngtcp2 (515 KiB) in 31ms
  157. 29.38 s Progress: 0 of 1 built, 40 of 68 downloaded from cache (7 downloading)
  158. 29.39 s Downloaded cached libssh2 (330 KiB) in 36ms
  159. 29.39 s Progress: 0 of 1 built, 41 of 68 downloaded from cache (6 downloading)
  160. 29.39 s Downloading cached libgit2-1.9.7-lib from https://cache.nix-ci.com
  161. 29.39 s Downloaded cached s2n-tls (1.3 MiB) in 38ms
  162. 29.39 s Progress: 0 of 1 built, 42 of 68 downloaded from cache (6 downloading)
  163. 29.39 s Downloading cached aws-c-io from https://cache.nix-ci.com
  164. 29.39 s Downloaded cached krb5-1.22.2-lib (2.7 MiB) in 43ms
  165. 29.39 s Progress: 0 of 1 built, 43 of 68 downloaded from cache (6 downloading)
  166. 29.39 s Downloading cached curl from https://cache.nix-ci.com
  167. 29.40 s Downloaded cached libarchive-3.8.9-lib (961 KiB) in 34ms
  168. 29.40 s Progress: 0 of 1 built, 44 of 68 downloaded from cache (6 downloading)
  169. 29.40 s Downloaded cached libblake3 (117 KiB) in 38ms
  170. 29.40 s Progress: 0 of 1 built, 45 of 68 downloaded from cache (5 downloading)
  171. 29.42 s Downloaded cached aws-c-io (648 KiB) in 32ms
  172. 29.42 s Progress: 0 of 1 built, 46 of 68 downloaded from cache (4 downloading)
  173. 29.42 s Downloading cached aws-c-event-stream from https://cache.nix-ci.com
  174. 29.42 s Downloading cached aws-c-http from https://cache.nix-ci.com
  175. 29.43 s Downloaded cached libgit2-1.9.7-lib (1.6 MiB) in 39ms
  176. 29.43 s Progress: 0 of 1 built, 47 of 68 downloaded from cache (5 downloading)
  177. 29.43 s Downloaded cached curl (1.2 MiB) in 40ms
  178. 29.43 s Progress: 0 of 1 built, 48 of 68 downloaded from cache (4 downloading)
  179. 29.46 s Downloaded cached aws-c-event-stream (176 KiB) in 36ms
  180. 29.46 s Progress: 0 of 1 built, 49 of 68 downloaded from cache (3 downloading)
  181. 29.46 s Downloaded cached aws-c-http (641 KiB) in 39ms
  182. 29.46 s Progress: 0 of 1 built, 50 of 68 downloaded from cache (2 downloading)
  183. 29.46 s Downloading cached aws-c-auth from https://cache.nix-ci.com
  184. 29.46 s Downloading cached aws-c-mqtt from https://cache.nix-ci.com
  185. 29.51 s Downloaded cached aws-c-auth (387 KiB) in 42ms
  186. 29.51 s Progress: 0 of 1 built, 51 of 68 downloaded from cache (3 downloading)
  187. 29.51 s Downloading cached aws-c-s3 from https://cache.nix-ci.com
  188. 29.51 s Downloaded cached aws-c-mqtt (557 KiB) in 42ms
  189. 29.51 s Progress: 0 of 1 built, 52 of 68 downloaded from cache (3 downloading)
  190. 29.54 s Downloaded cached aws-c-s3 (384 KiB) in 31ms
  191. 29.54 s Progress: 0 of 1 built, 53 of 68 downloaded from cache (2 downloading)
  192. 29.54 s Downloading cached aws-crt-cpp from https://cache.nix-ci.com
  193. 29.54 s Downloaded cached icu4c (39.5 MiB) in 219ms
  194. 29.54 s Progress: 0 of 1 built, 54 of 68 downloaded from cache (2 downloading)
  195. 29.54 s Downloading cached boost from https://cache.nix-ci.com
  196. 29.55 s Downloaded cached aws-crt-cpp (979 KiB) in 13ms
  197. 29.55 s Progress: 0 of 1 built, 55 of 68 downloaded from cache (2 downloading)
  198. 29.59 s Downloaded cached boost (14.5 MiB) in 50ms
  199. 29.59 s Progress: 0 of 1 built, 56 of 68 downloaded from cache (1 downloading)
  200. 29.59 s Downloading cached nix-util from https://cache.nix-ci.com
  201. 29.61 s Downloaded cached nix-util (2.4 MiB) in 19ms
  202. 29.61 s Progress: 0 of 1 built, 57 of 68 downloaded from cache (1 downloading)
  203. 29.61 s Downloading cached nix-nswrapper from https://cache.nix-ci.com
  204. 29.61 s Downloading cached nix-store from https://cache.nix-ci.com
  205. 29.62 s Downloaded cached nix-nswrapper (131 KiB) in 9ms
  206. 29.62 s Progress: 0 of 1 built, 58 of 68 downloaded from cache (2 downloading)
  207. 29.64 s Downloaded cached nix-store (5.8 MiB) in 33ms
  208. 29.64 s Progress: 0 of 1 built, 59 of 68 downloaded from cache (1 downloading)
  209. 29.64 s Downloading cached nix-fetchers from https://cache.nix-ci.com
  210. 29.64 s Downloading cached nix-main from https://cache.nix-ci.com
  211. 29.66 s Downloaded cached nix-main (393 KiB) in 12ms
  212. 29.66 s Progress: 0 of 1 built, 60 of 68 downloaded from cache (2 downloading)
  213. 29.66 s Downloaded cached nix-fetchers (1.5 MiB) in 17ms
  214. 29.66 s Progress: 0 of 1 built, 61 of 68 downloaded from cache (1 downloading)
  215. 29.66 s Downloading cached nix-expr from https://cache.nix-ci.com
  216. 29.68 s Downloaded cached nix-expr (3.3 MiB) in 23ms
  217. 29.68 s Progress: 0 of 1 built, 62 of 68 downloaded from cache (1 downloading)
  218. 29.68 s Downloading cached nix-flake from https://cache.nix-ci.com
  219. 29.70 s Downloaded cached nix-flake (956 KiB) in 14ms
  220. 29.70 s Progress: 0 of 1 built, 63 of 68 downloaded from cache (1 downloading)
  221. 29.70 s Downloading cached nix-cmd from https://cache.nix-ci.com
  222. 29.71 s Downloaded cached nix-cmd (1 MiB) in 14ms
  223. 29.71 s Progress: 0 of 1 built, 64 of 68 downloaded from cache (1 downloading)
  224. 29.71 s Downloading cached nix from https://cache.nix-ci.com
  225. 29.74 s Downloaded cached nix (3.9 MiB) in 23ms
  226. 29.74 s Progress: 0 of 1 built, 65 of 68 downloaded from cache (1 downloading)
  227. 29.74 s Downloading cached nix from https://cache.nix-ci.com
  228. 29.75 s Downloaded cached nix (8848 B) in 11ms
  229. 29.75 s Progress: 0 of 1 built, 66 of 68 downloaded from cache (1 downloading)
  230. 30.30 s Downloaded cached gammaloop-python-module (133.4 MiB) in 979ms
  231. 30.30 s Progress: 0 of 1 built, 67 of 68 downloaded from cache
  232. 30.30 s Downloading cached nix-ci-check-gammaloop-nextest-python-api from https://cache.nix-ci.com
  233. 30.30 s Downloaded cached nix-ci-check-gammaloop-nextest-python-api (1104 B) in 3ms
  234. 30.30 s Progress: 0 of 1 built, 68 of 68 downloaded from cache
  235. 30.55 s evaluating derivation 'gevaluation warning: stdenv.isDarwin is deprecated, use stdenv.hostPlatform.isDarwin instead
  236. 36.96 s copying '/nix/store/s78m evaluating derivation 'g copying '/nix/store/s78m evaluating derivation 'g copying '/nix/store/s78m evaluating derivation 'g copying '/nix/store/s78m evaluating derivation 'g copying '/nix/store/s78m evaluating derivation 'g copying '/nix/store/s78m evaluating derivation 'g copying '/nix/store/s78m evaluating derivation 'g copying '/nix/store/s78m evaluating derivation 'g copying '/nix/store/s78m evaluating derivation 'g querying gammaloop-nexte [24.2 KiB DL] querying g [56.4 KiB DL] querying i [0/28 built, 15/2/76 cop [0/26 built, 16/11/76 co [0/26 built, 16/22/76 co [0/26 built, 16/30/76 co [0/25 built, 16/35/76 co [0/23 built, 16/40/76 co [0/22 built, 13/46/76 co [0/21 built, 11/51/76 co [0/20 built, 10/53/76 co [2/0/20 built, 10/53/76 builder.pl> Running phase: patchPhase
  237. 37.00 s [3/0/20 built, 8/55/76 cbuilder.pl> Running phase: updateAutotoolsGnuConfigScriptsPhase
  238. 37.00 s builder.pl> Running phase: configurePhase
  239. 37.00 s builder.pl> no configure script, doing nothing
  240. 37.00 s builder.pl> Running phase: buildPhase
  241. 37.00 s builder.pl> Running phase: checkPhase
  242. 37.00 s builder.pl> Running phase: installPhase
  243. 37.00 s [3/0/20 built, 10/55/76 builder.pl> no Makefile or custom installPhase, doing nothing
  244. 37.00 s crane-dummy-cargo-target.rs (post)> Uploading to the NixCI cache: /nix/store/fs2fn4bis6s0df4zsc6nw3x6sn3vf3mv-crane-dummy-cargo-target.rs
  245. 37.05 s crane-dummy-cargo-target.rs (post)> warning: 'warn-short-path-literals' is deprecated, use 'lint-short-path-literals = ignore' instead
  246. 37.09 s crane-dummy-cargo-target.rs (post)> copying 0 paths...
  247. 37.15 s crane-dummy-cargo-target.rs (post)> warning: 'warn-short-path-literals' is deprecated, use 'lint-short-path-literals = ignore' instead
  248. 38.28 s crane-dummy-cargo-target.rs (post)> copying 0 paths...
  249. 38.30 s builder.pl> Running phase: fixupPhase
  250. 38.30 s [2/1/20 built, 3/62/76 cbuilder.pl> shrinking RPATHs of ELF executables and libraries in /nix/store/654vgnw02gp7qz9lnaa6mypnmbgp8473-builder.pl
  251. 38.30 s builder.pl> checking for references to /build/ in /nix/store/654vgnw02gp7qz9lnaa6mypnmbgp8473-builder.pl...
  252. 38.30 s builder.pl> patching script interpreter paths in /nix/store/654vgnw02gp7qz9lnaa6mypnmbgp8473-builder.pl
  253. 38.32 s crane-dummy-proc-macro-cargo-target.rs (post)> Uploading to the NixCI cache: /nix/store/fpdx5r60dr2dgx09aqpb0wnbx2qwnga3-crane-dummy-proc-macro-cargo-target.rs
  254. 38.37 s crane-dummy-proc-macro-cargo-target.rs (post)> warning: 'warn-short-path-literals' is deprecated, use 'lint-short-path-literals = ignore' instead
  255. 38.40 s crane-dummy-proc-macro-cargo-target.rs (post)> copying 0 paths...
  256. 38.44 s crane-dummy-proc-macro-cargo-target.rs (post)> warning: 'warn-short-path-literals' is deprecated, use 'lint-short-path-literals = ignore' instead
  257. 38.49 s crane-dummy-proc-macro-cargo-target.rs (post)> copying 0 paths...
  258. 38.53 s builder.pl (post)> Uploading to the NixCI cache: /nix/store/654vgnw02gp7qz9lnaa6mypnmbgp8473-builder.pl
  259. 38.59 s [1/2/16 built, 6/63/76 cbuilder.pl (post)> warning: 'warn-short-path-literals' is deprecated, use 'lint-short-path-literals = ignore' instead
  260. 38.63 s builder.pl (post)> copying 0 paths...
  261. 38.68 s builder.pl (post)> warning: 'warn-short-path-literals' is deprecated, use 'lint-short-path-literals = ignore' instead
  262. 38.74 s builder.pl (post)> copying 0 paths...
  263. 39.13 s [3/14 built, 5/66/76 cop [3/13 built, 5/67/76 cop [3/11 built, 3/70/76 cop [3/11 built, 2/73/76 coppython3> structuredAttrs is enabled
  264. 39.19 s [1/3/10 built, 1/74/76 cpython3> created 227 symlinks in user environment
  265. 40.01 s python3 (post)> Uploading to the NixCI cache: /nix/store/v67wpyflacy0i2gvzasrxvw2gkz4mr12-python3-3.13.15-env
  266. 40.05 s python3 (post)> warning: 'warn-short-path-literals' is deprecated, use 'lint-short-path-literals = ignore' instead
  267. 40.09 s python3 (post)> copying 0 paths...
  268. 40.13 s python3 (post)> warning: 'warn-short-path-literals' is deprecated, use 'lint-short-path-literals = ignore' instead
  269. 41.05 s python3 (post)> copying 0 paths...
  270. 41.40 s [4/9 built, 1/75/76 copi [2/4/9 built, 1/75/76 co [2/4/8 built, 76 copied rust-stable-with-std (post)> Uploading to the NixCI cache: /nix/store/ig1b1l7vf644y7hszy5i6bndpf1adaf8-rust-stable-with-std-2026-08-20
  271. 41.43 s rust-stable-with-std (post)> warning: 'warn-short-path-literals' is deprecated, use 'lint-short-path-literals = ignore' instead
  272. 41.46 s rust-stable-with-std (post)> copying 0 paths...
  273. 41.51 s rust-stable-with-std (post)> warning: 'warn-short-path-literals' is deprecated, use 'lint-short-path-literals = ignore' instead
  274. 41.59 s rust-stable-with-std (post)> copying 0 paths...
  275. 41.74 s [1/5/9 built, 76 copied clippy-stable-with-std (post)> Uploading to the NixCI cache: /nix/store/pl1f6g2cpsbv4r71645h5ynfv2amghdd-clippy-stable-with-std-2026-08-20
  276. 41.78 s clippy-stable-with-std (post)> warning: 'warn-short-path-literals' is deprecated, use 'lint-short-path-literals = ignore' instead
  277. 41.81 s clippy-stable-with-std (post)> copying 0 paths...
  278. 41.85 s clippy-stable-with-std (post)> warning: 'warn-short-path-literals' is deprecated, use 'lint-short-path-literals = ignore' instead
  279. 41.89 s clippy-stable-with-std (post)> copying 0 paths...
  280. 41.97 s [1/6/8 built, 76 copied rust-stable-with-components> /nix/store/ig1b1l7vf644y7hszy5i6bndpf1adaf8-rust-stable-with-std-2026-08-20/bin:
  281. 41.99 s rust-stable-with-components> rustdoc: Keeping existing link to /nix/store/pl1f6g2cpsbv4r71645h5ynfv2amghdd-clippy-stable-with-std-2026-08-20/bin/rustdoc
  282. 41.99 s rust-stable-with-components> rustc: Keeping existing link to /nix/store/pl1f6g2cpsbv4r71645h5ynfv2amghdd-clippy-stable-with-std-2026-08-20/bin/rustc
  283. 41.99 s rust-stable-with-components> rust-gdbgui: Keeping existing link to /nix/store/pl1f6g2cpsbv4r71645h5ynfv2amghdd-clippy-stable-with-std-2026-08-20/bin/rust-gdbgui
  284. 41.99 s rust-stable-with-components> rust-lldb: Keeping existing link to /nix/store/pl1f6g2cpsbv4r71645h5ynfv2amghdd-clippy-stable-with-std-2026-08-20/bin/rust-lldb
  285. 41.99 s rust-stable-with-components> rust-gdb: Keeping existing link to /nix/store/pl1f6g2cpsbv4r71645h5ynfv2amghdd-clippy-stable-with-std-2026-08-20/bin/rust-gdb
  286. 41.99 s rust-stable-with-components> /nix/store/ig1b1l7vf644y7hszy5i6bndpf1adaf8-rust-stable-with-std-2026-08-20/lib:
  287. 41.99 s rust-stable-with-components> librustc_driver-28a98848f7a7c026.so: Keeping existing link to /nix/store/pl1f6g2cpsbv4r71645h5ynfv2amghdd-clippy-stable-with-std-2026-08-20/lib/librustc_driver-28a98848f7a7c026.so
  288. 42.39 s rust-stable-with-components (post)> Uploading to the NixCI cache: /nix/store/kmp5gyh60djqyqs6qrvgnz7581xhmwfs-rust-stable-with-components-2026-08-20
  289. 42.43 s rust-stable-with-components (post)> warning: 'warn-short-path-literals' is deprecated, use 'lint-short-path-literals = ignore' instead
  290. 42.45 s rust-stable-with-components (post)> copying 0 paths...
  291. 42.50 s rust-stable-with-components (post)> warning: 'warn-short-path-literals' is deprecated, use 'lint-short-path-literals = ignore' instead
  292. 42.54 s rust-stable-with-components (post)> copying 0 paths...
  293. 42.83 s [7/9 built, 76 copied (1 [1/7/8 built, 76 copied gammaloop-nextest-python-api> Extracting 3 binaries (including 2 non-test binaries), 1 build script output directory, and 3 linked paths to /build/nextest-archive-8zvA0E
  294. 43.06 s gammaloop-nextest-python-api> Extracted 22 files to /build/nextest-archive-8zvA0E in 0.22s
  295. 43.06 s gammaloop-nextest-python-api> ------------
  296. 43.06 s gammaloop-nextest-python-api> Nextest run ID 4c692186-877a-41ee-81bd-2e8a3e11660c with nextest profile: ci_gammaloop
  297. 43.06 s gammaloop-nextest-python-api> Starting 5 tests across 1 binary
  298. 43.18 s gammaloop-nextest-python-api> FAIL [ 0.116s] (1/5) gammaloop-integration-tests::test_python_api python_session_getters_return_live_toml_and_command_blocks
  299. 43.18 s gammaloop-nextest-python-api> stdout ---
  300. 43.18 s gammaloop-nextest-python-api>
  301. 43.18 s gammaloop-nextest-python-api> running 1 test
  302. 43.18 s gammaloop-nextest-python-api> test python_session_getters_return_live_toml_and_command_blocks ... FAILED
  303. 43.18 s gammaloop-nextest-python-api>
  304. 43.18 s gammaloop-nextest-python-api> failures:
  305. 43.18 s gammaloop-nextest-python-api>
  306. 43.18 s gammaloop-nextest-python-api> failures:
  307. 43.18 s gammaloop-nextest-python-api> python_session_getters_return_live_toml_and_command_blocks
  308. 43.18 s gammaloop-nextest-python-api>
  309. 43.18 s gammaloop-nextest-python-api> test result: FAILED. 0 passed; 1 failed; 0 ignored; 0 measured; 4 filtered out; finished in 0.11s
  310. 43.18 s gammaloop-nextest-python-api>
  311. 43.18 s gammaloop-nextest-python-api> stderr ---
  312. 43.18 s gammaloop-nextest-python-api> Error: Python API test subprocess failed.
  313. 43.18 s gammaloop-nextest-python-api> stdout:
  314. 43.18 s gammaloop-nextest-python-api> ┌────────────────────────────────────────────────────────┐
  315. 43.18 s gammaloop-nextest-python-api> │ You are running a restricted Symbolica instance. │
  316. 43.18 s gammaloop-nextest-python-api> │ │
  317. 43.18 s gammaloop-nextest-python-api> │ This mode is only permitted for non-commercial use and │
  318. 43.18 s gammaloop-nextest-python-api> │ is limited to one instance and core per machine. │
  319. 43.18 s gammaloop-nextest-python-api> │ │
  320. 43.18 s gammaloop-nextest-python-api> │ Hobbyists can easily acquire a free license key │
  321. 43.18 s gammaloop-nextest-python-api> │ that unlocks all cores and removes this banner: │
  322. 43.18 s gammaloop-nextest-python-api> │ │
  323. 43.18 s gammaloop-nextest-python-api> │ from symbolica import * │
  324. 43.18 s gammaloop-nextest-python-api> │ request_hobbyist_license('YOUR_NAME', 'YOUR_EMAIL') │
  325. 43.18 s gammaloop-nextest-python-api> │ │
  326. 43.18 s gammaloop-nextest-python-api> │ All other users can obtain a free 30-day trial key: │
  327. 43.18 s gammaloop-nextest-python-api> │ │
  328. 43.18 s gammaloop-nextest-python-api> │ from symbolica import * │
  329. 43.18 s gammaloop-nextest-python-api> │ request_trial_license('NAME', 'EMAIL', 'EMPLOYER') │
  330. 43.18 s gammaloop-nextest-python-api> │ │
  331. 43.18 s gammaloop-nextest-python-api> │ See https://symbolica.io/docs/get_started.html#license │
  332. 43.18 s gammaloop-nextest-python-api> └────────────────────────────────────────────────────────┘
  333. 43.18 s gammaloop-nextest-python-api> ┌───────────────────────────────────────────────────────────────────────────────────────────────────────────┐
  334. 43.18 s gammaloop-nextest-python-api> │ Cannot start new unlicensed Symbolica instance since there is already another one running on the machine. │
  335. 43.18 s gammaloop-nextest-python-api> └───────────────────────────────────────────────────────────────────────────────────────────────────────────┘
  336. 43.18 s gammaloop-nextest-python-api>
  337. 43.18 s gammaloop-nextest-python-api> stderr:
  338. 43.18 s gammaloop-nextest-python-api>
  339. 43.18 s gammaloop-nextest-python-api> ┌───────────────────────────────────────────────────────────┐
  340. 43.18 s gammaloop-nextest-python-api> │ Could not resolve the IP of the Symbolica license server. │
  341. 43.18 s gammaloop-nextest-python-api> │ │
  342. 43.18 s gammaloop-nextest-python-api> │ Please check your DNS configuration. │
  343. 43.18 s gammaloop-nextest-python-api> └───────────────────────────────────────────────────────────┘
  344. 43.18 s gammaloop-nextest-python-api> Error: failed to lookup address information: Temporary failure in name resolution
  345. 43.18 s gammaloop-nextest-python-api>
  346. 43.18 s gammaloop-nextest-python-api>
  347. 43.18 s gammaloop-nextest-python-api> Location:
  348. 43.18 s gammaloop-nextest-python-api> tests/tests/test_python_api.rs:156:20
  349. 43.18 s gammaloop-nextest-python-api>
  350. 43.18 s gammaloop-nextest-python-api> FAIL [ 0.118s] (2/5) gammaloop-integration-tests::test_python_api python_evaluate_sample_honors_generate_events_and_observable_snapshots
  351. 43.18 s gammaloop-nextest-python-api> stdout ---
  352. 43.18 s gammaloop-nextest-python-api>
  353. 43.18 s gammaloop-nextest-python-api> running 1 test
  354. 43.18 s gammaloop-nextest-python-api> test python_evaluate_sample_honors_generate_events_and_observable_snapshots ... FAILED
  355. 43.18 s gammaloop-nextest-python-api>
  356. 43.18 s gammaloop-nextest-python-api> failures:
  357. 43.18 s gammaloop-nextest-python-api>
  358. 43.18 s gammaloop-nextest-python-api> failures:
  359. 43.18 s gammaloop-nextest-python-api> python_evaluate_sample_honors_generate_events_and_observable_snapshots
  360. 43.18 s gammaloop-nextest-python-api>
  361. 43.18 s gammaloop-nextest-python-api> test result: FAILED. 0 passed; 1 failed; 0 ignored; 0 measured; 4 filtered out; finished in 0.11s
  362. 43.18 s gammaloop-nextest-python-api>
  363. 43.18 s gammaloop-nextest-python-api> stderr ---
  364. 43.18 s gammaloop-nextest-python-api> Error: Python API test subprocess failed.
  365. 43.18 s gammaloop-nextest-python-api> stdout:
  366. 43.18 s gammaloop-nextest-python-api> ┌────────────────────────────────────────────────────────┐
  367. 43.18 s gammaloop-nextest-python-api> │ You are running a restricted Symbolica instance. │
  368. 43.18 s gammaloop-nextest-python-api> │ │
  369. 43.18 s gammaloop-nextest-python-api> │ This mode is only permitted for non-commercial use and │
  370. 43.18 s gammaloop-nextest-python-api> │ is limited to one instance and core per machine. │
  371. 43.18 s gammaloop-nextest-python-api> │ │
  372. 43.18 s gammaloop-nextest-python-api> │ Hobbyists can easily acquire a free license key │
  373. 43.18 s gammaloop-nextest-python-api> │ that unlocks all cores and removes this banner: │
  374. 43.18 s gammaloop-nextest-python-api> │ │
  375. 43.18 s gammaloop-nextest-python-api> │ from symbolica import * │
  376. 43.18 s gammaloop-nextest-python-api> │ request_hobbyist_license('YOUR_NAME', 'YOUR_EMAIL') │
  377. 43.18 s gammaloop-nextest-python-api> │ │
  378. 43.18 s gammaloop-nextest-python-api> │ All other users can obtain a free 30-day trial key: │
  379. 43.18 s gammaloop-nextest-python-api> │ │
  380. 43.18 s gammaloop-nextest-python-api> │ from symbolica import * │
  381. 43.18 s gammaloop-nextest-python-api> │ request_trial_license('NAME', 'EMAIL', 'EMPLOYER') │
  382. 43.18 s gammaloop-nextest-python-api> │ │
  383. 43.18 s gammaloop-nextest-python-api> │ See https://symbolica.io/docs/get_started.html#license │
  384. 43.18 s gammaloop-nextest-python-api> └────────────────────────────────────────────────────────┘
  385. 43.18 s gammaloop-nextest-python-api> ┌───────────────────────────────────────────────────────────────────────────────────────────────────────────┐
  386. 43.18 s gammaloop-nextest-python-api> │ Cannot start new unlicensed Symbolica instance since there is already another one running on the machine. │
  387. 43.18 s gammaloop-nextest-python-api> └───────────────────────────────────────────────────────────────────────────────────────────────────────────┘
  388. 43.18 s gammaloop-nextest-python-api>
  389. 43.18 s gammaloop-nextest-python-api> stderr:
  390. 43.18 s gammaloop-nextest-python-api>
  391. 43.18 s gammaloop-nextest-python-api> ┌───────────────────────────────────────────────────────────┐
  392. 43.18 s gammaloop-nextest-python-api> │ Could not resolve the IP of the Symbolica license server. │
  393. 43.18 s gammaloop-nextest-python-api> │ │
  394. 43.18 s gammaloop-nextest-python-api> │ Please check your DNS configuration. │
  395. 43.18 s gammaloop-nextest-python-api> └───────────────────────────────────────────────────────────┘
  396. 43.18 s gammaloop-nextest-python-api> Error: failed to lookup address information: Temporary failure in name resolution
  397. 43.18 s gammaloop-nextest-python-api>
  398. 43.18 s gammaloop-nextest-python-api>
  399. 43.18 s gammaloop-nextest-python-api> Location:
  400. 43.18 s gammaloop-nextest-python-api> tests/tests/test_python_api.rs:156:20
  401. 43.18 s gammaloop-nextest-python-api>
  402. 43.18 s gammaloop-nextest-python-api> FAIL [ 0.118s] (3/5) gammaloop-integration-tests::test_python_api python_evaluate_samples_batch_and_momentum_space_have_expected_shape
  403. 43.18 s gammaloop-nextest-python-api> stdout ---
  404. 43.18 s gammaloop-nextest-python-api>
  405. 43.18 s gammaloop-nextest-python-api> running 1 test
  406. 43.18 s gammaloop-nextest-python-api> test python_evaluate_samples_batch_and_momentum_space_have_expected_shape ... FAILED
  407. 43.18 s gammaloop-nextest-python-api>
  408. 43.18 s gammaloop-nextest-python-api> failures:
  409. 43.18 s gammaloop-nextest-python-api>
  410. 43.18 s gammaloop-nextest-python-api> failures:
  411. 43.18 s gammaloop-nextest-python-api> python_evaluate_samples_batch_and_momentum_space_have_expected_shape
  412. 43.18 s gammaloop-nextest-python-api>
  413. 43.18 s gammaloop-nextest-python-api> test result: FAILED. 0 passed; 1 failed; 0 ignored; 0 measured; 4 filtered out; finished in 0.11s
  414. 43.18 s gammaloop-nextest-python-api>
  415. 43.18 s gammaloop-nextest-python-api> stderr ---
  416. 43.18 s gammaloop-nextest-python-api> Error: Python API test subprocess failed.
  417. 43.18 s gammaloop-nextest-python-api> stdout:
  418. 43.18 s gammaloop-nextest-python-api> ┌────────────────────────────────────────────────────────┐
  419. 43.18 s gammaloop-nextest-python-api> │ You are running a restricted Symbolica instance. │
  420. 43.18 s gammaloop-nextest-python-api> │ │
  421. 43.18 s gammaloop-nextest-python-api> │ This mode is only permitted for non-commercial use and │
  422. 43.18 s gammaloop-nextest-python-api> │ is limited to one instance and core per machine. │
  423. 43.18 s gammaloop-nextest-python-api> │ │
  424. 43.18 s gammaloop-nextest-python-api> │ Hobbyists can easily acquire a free license key │
  425. 43.18 s gammaloop-nextest-python-api> │ that unlocks all cores and removes this banner: │
  426. 43.18 s gammaloop-nextest-python-api> │ │
  427. 43.18 s gammaloop-nextest-python-api> │ from symbolica import * │
  428. 43.18 s gammaloop-nextest-python-api> │ request_hobbyist_license('YOUR_NAME', 'YOUR_EMAIL') │
  429. 43.18 s gammaloop-nextest-python-api> │ │
  430. 43.18 s gammaloop-nextest-python-api> │ All other users can obtain a free 30-day trial key: │
  431. 43.18 s gammaloop-nextest-python-api> │ │
  432. 43.18 s gammaloop-nextest-python-api> │ from symbolica import * │
  433. 43.18 s gammaloop-nextest-python-api> │ request_trial_license('NAME', 'EMAIL', 'EMPLOYER') │
  434. 43.18 s gammaloop-nextest-python-api> │ │
  435. 43.18 s gammaloop-nextest-python-api> │ See https://symbolica.io/docs/get_started.html#license │
  436. 43.18 s gammaloop-nextest-python-api> └────────────────────────────────────────────────────────┘
  437. 43.18 s gammaloop-nextest-python-api> ┌───────────────────────────────────────────────────────────────────────────────────────────────────────────┐
  438. 43.18 s gammaloop-nextest-python-api> │ Cannot start new unlicensed Symbolica instance since there is already another one running on the machine. │
  439. 43.18 s gammaloop-nextest-python-api> └───────────────────────────────────────────────────────────────────────────────────────────────────────────┘
  440. 43.18 s gammaloop-nextest-python-api>
  441. 43.18 s gammaloop-nextest-python-api> stderr:
  442. 43.18 s gammaloop-nextest-python-api>
  443. 43.18 s gammaloop-nextest-python-api> ┌───────────────────────────────────────────────────────────┐
  444. 43.18 s gammaloop-nextest-python-api> │ Could not resolve the IP of the Symbolica license server. │
  445. 43.18 s gammaloop-nextest-python-api> │ │
  446. 43.18 s gammaloop-nextest-python-api> │ Please check your DNS configuration. │
  447. 43.18 s gammaloop-nextest-python-api> └───────────────────────────────────────────────────────────┘
  448. 43.18 s gammaloop-nextest-python-api> Error: failed to lookup address information: Temporary failure in name resolution
  449. 43.18 s gammaloop-nextest-python-api>
  450. 43.18 s gammaloop-nextest-python-api>
  451. 43.18 s gammaloop-nextest-python-api> Location:
  452. 43.18 s gammaloop-nextest-python-api> tests/tests/test_python_api.rs:156:20
  453. 43.18 s gammaloop-nextest-python-api>
  454. 43.25 s gammaloop-nextest-python-api> FAIL [ 0.182s] (4/5) gammaloop-integration-tests::test_python_api python_evaluate_sample_preserves_graph_grouping_and_incoming_pdgs
  455. 43.25 s gammaloop-nextest-python-api> stdout ---
  456. 43.25 s gammaloop-nextest-python-api>
  457. 43.25 s gammaloop-nextest-python-api> running 1 test
  458. 43.25 s gammaloop-nextest-python-api> test python_evaluate_sample_preserves_graph_grouping_and_incoming_pdgs ... FAILED
  459. 43.25 s gammaloop-nextest-python-api>
  460. 43.25 s gammaloop-nextest-python-api> failures:
  461. 43.25 s gammaloop-nextest-python-api>
  462. 43.25 s gammaloop-nextest-python-api> failures:
  463. 43.25 s gammaloop-nextest-python-api> python_evaluate_sample_preserves_graph_grouping_and_incoming_pdgs
  464. 43.25 s gammaloop-nextest-python-api>
  465. 43.25 s gammaloop-nextest-python-api> test result: FAILED. 0 passed; 1 failed; 0 ignored; 0 measured; 4 filtered out; finished in 0.18s
  466. 43.25 s gammaloop-nextest-python-api>
  467. 43.25 s gammaloop-nextest-python-api> stderr ---
  468. 43.25 s gammaloop-nextest-python-api> Error: Python API test subprocess failed.
  469. 43.25 s gammaloop-nextest-python-api> stdout:
  470. 43.25 s gammaloop-nextest-python-api> ┌────────────────────────────────────────────────────────┐
  471. 43.25 s gammaloop-nextest-python-api> │ You are running a restricted Symbolica instance. │
  472. 43.25 s gammaloop-nextest-python-api> │ │
  473. 43.25 s gammaloop-nextest-python-api> │ This mode is only permitted for non-commercial use and │
  474. 43.25 s gammaloop-nextest-python-api> │ is limited to one instance and core per machine. │
  475. 43.25 s gammaloop-nextest-python-api> │ │
  476. 43.25 s gammaloop-nextest-python-api> │ Hobbyists can easily acquire a free license key │
  477. 43.25 s gammaloop-nextest-python-api> │ that unlocks all cores and removes this banner: │
  478. 43.25 s gammaloop-nextest-python-api> │ │
  479. 43.25 s gammaloop-nextest-python-api> │ from symbolica import * │
  480. 43.25 s gammaloop-nextest-python-api> │ request_hobbyist_license('YOUR_NAME', 'YOUR_EMAIL') │
  481. 43.25 s gammaloop-nextest-python-api> │ │
  482. 43.25 s gammaloop-nextest-python-api> │ All other users can obtain a free 30-day trial key: │
  483. 43.25 s gammaloop-nextest-python-api> │ │
  484. 43.25 s gammaloop-nextest-python-api> │ from symbolica import * │
  485. 43.25 s gammaloop-nextest-python-api> │ request_trial_license('NAME', 'EMAIL', 'EMPLOYER') │
  486. 43.25 s gammaloop-nextest-python-api> │ │
  487. 43.25 s gammaloop-nextest-python-api> │ See https://symbolica.io/docs/get_started.html#license │
  488. 43.25 s gammaloop-nextest-python-api> └────────────────────────────────────────────────────────┘
  489. 43.25 s gammaloop-nextest-python-api> ┌───────────────────────────────────────────────────────────────────────────────────────────────────────────┐
  490. 43.25 s gammaloop-nextest-python-api> │ Cannot start new unlicensed Symbolica instance since there is already another one running on the machine. │
  491. 43.25 s gammaloop-nextest-python-api> └───────────────────────────────────────────────────────────────────────────────────────────────────────────┘
  492. 43.25 s gammaloop-nextest-python-api>
  493. 43.25 s gammaloop-nextest-python-api> stderr:
  494. 43.25 s gammaloop-nextest-python-api>
  495. 43.25 s gammaloop-nextest-python-api> ┌───────────────────────────────────────────────────────────┐
  496. 43.25 s gammaloop-nextest-python-api> │ Could not resolve the IP of the Symbolica license server. │
  497. 43.25 s gammaloop-nextest-python-api> │ │
  498. 43.25 s gammaloop-nextest-python-api> │ Please check your DNS configuration. │
  499. 43.25 s gammaloop-nextest-python-api> └───────────────────────────────────────────────────────────┘
  500. 43.25 s gammaloop-nextest-python-api> Error: failed to lookup address information: Temporary failure in name resolution
  501. 43.25 s gammaloop-nextest-python-api> [2026-09-03 15:34:09.885] @gammaloop_api::se... INFO : Running command import model sm-default
  502. 43.25 s gammaloop-nextest-python-api> [2026-09-03 15:34:09.885] @import::model INFO : Loading built-in JSON model sm-default
  503. 43.25 s gammaloop-nextest-python-api> [2026-09-03 15:34:09.918] @gammalooprs::model INFO : The following 11 external parameters were forced to zero by the restriction card:
  504. 43.25 s gammaloop-nextest-python-api> lamWS, AWS, rhoWS, etaWS, ymc, yme, ymm, MC, Me, MM, WTau
  505. 43.25 s gammaloop-nextest-python-api> [2026-09-03 15:34:09.918] @gammalooprs::model INFO : The following 34 vertex rules were removed by the restriction card:
  506. 43.25 s gammaloop-nextest-python-api> V_82 -> (c~, d, G+) | V_83 -> (t~, d, G+) | V_84 -> (c~, s, G+) | V_85 -> (t~, s, G+) | V_86 -> (u~, b, G+) | V_87 -> (c~, b, G+) | V_90 -> (c~, d, W+) | V_91 -> (t~, d, W+) | V_92 -> (u~, s, W+) | V_94 -> (t~, s, W+) | V_95 -> (u~, b, W+) | V_96 -> (c~, b, W+) | V_101 -> (e+, e-, G0) | V_102 -> (mu+, mu-, G0) | V_104 -> (e+, e-, H) | V_105 -> (mu+, mu-, H) | V_110 -> (ve~, e-, G+) | V_111 -> (vm~, mu-, G+) | V_116 -> (b~, u, G-) | V_117 -> (d~, c, G-) | V_118 -> (s~, c, G-) | V_119 -> (b~, c, G-) | V_120 -> (d~, t, G-) | V_121 -> (s~, t, G-) | V_124 -> (s~, u, W-) | V_125 -> (b~, u, W-) | V_126 -> (d~, c, W-) | V_128 -> (b~, c, W-) | V_129 -> (d~, t, W-) | V_130 -> (s~, t, W-) | V_138 -> (c~, c, G0) | V_140 -> (c~, c, H) | V_145 -> (e+, ve, G-) | V_146 -> (mu+, vm, G-)
  507. 43.25 s gammaloop-nextest-python-api> [2026-09-03 15:34:09.918] @gammalooprs::model INFO : The following 36 couplings were removed by the restriction card:
  508. 43.25 s gammaloop-nextest-python-api> GC_13, GC_14, GC_16, GC_17, GC_18, GC_19, GC_20, GC_22, GC_23, GC_24, GC_25, GC_26, GC_28, GC_29, GC_42, GC_43, GC_44, GC_46, GC_47, GC_48, GC_84, GC_85, GC_86, GC_87, GC_88, GC_89, GC_90, GC_91, GC_92, GC_93, GC_101, GC_102, GC_103, GC_105, GC_106, GC_107
  509. 43.25 s gammaloop-nextest-python-api> [2026-09-03 15:34:09.918] @gammaloop_api::se... INFO : Running command set default-runtime kv kinematics.externals='{"type":"constant","data":{"momenta":[[32.0,0.0,0.0,32.0],[32.0,0.0,0.0,-32.0]],"helicities":[1,1]}}'
  510. 43.25 s gammaloop-nextest-python-api> [2026-09-03 15:34:09.919] @gammaloop_api::se... INFO : Running command set default-runtime kv subtraction.disable_threshold_subtraction=true
  511. 43.25 s gammaloop-nextest-python-api> [2026-09-03 15:34:09.920] @gammaloop_api::se... INFO : Running command generate xs e+ e- > d d~ g | e- a d g QED^2==4 [{{2}} QCD=0] --numerator-grouping group_identical_graphs_up_to_sign --clear-existing-processes --only-diagrams
  512. 43.25 s gammaloop-nextest-python-api> [2026-09-03 15:34:09.922] @feyngen::diagram_... INFO : 0s | Δ=0s | Starting Feynman graph generation with Symbolica...
  513. 43.25 s gammaloop-nextest-python-api> [2026-09-03 15:34:09.924] @feyngen::diagram_... INFO : 0s | Δ=0s | Number of graphs resulting from Symbolica generation: 246
  514. 43.25 s gammaloop-nextest-python-api> [2026-09-03 15:34:09.925] @feyngen::diagram_... INFO : 0s | Δ=0s | Number of graphs retained after enforcing supergraph particle content: 8
  515. 43.25 s gammaloop-nextest-python-api> [2026-09-03 15:34:09.925] @feyngen::diagram_... INFO : 0s | Δ=0s | Number of graphs retained after removal of vetoed topologies: 8
  516. 43.25 s gammaloop-nextest-python-api> [2026-09-03 15:34:09.925] @feyngen::diagram_... INFO : 0s | Δ=0s | Number of graphs after vertex info assignment: 8
  517. 43.25 s gammaloop-nextest-python-api> [2026-09-03 15:34:09.925] @feyngen::diagram_... INFO : 0s | Δ=0s | Number of graphs after all complete graphs filters are applied: 8
  518. 43.25 s gammaloop-nextest-python-api>
  519. 43.25 s gammaloop-nextest-python-api>
  520. 43.25 s gammaloop-nextest-python-api> Location:
  521. 43.25 s gammaloop-nextest-python-api> tests/tests/test_python_api.rs:156:20
  522. 43.25 s gammaloop-nextest-python-api>
  523. 43.25 s gammaloop-nextest-python-api> FAIL [ 0.185s] (5/5) gammaloop-integration-tests::test_python_api python_settings_wrappers_expose_nested_runtime_and_global_settings
  524. 43.25 s gammaloop-nextest-python-api> stdout ---
  525. 43.25 s gammaloop-nextest-python-api>
  526. 43.25 s gammaloop-nextest-python-api> running 1 test
  527. 43.25 s gammaloop-nextest-python-api> test python_settings_wrappers_expose_nested_runtime_and_global_settings ... FAILED
  528. 43.25 s gammaloop-nextest-python-api>
  529. 43.25 s gammaloop-nextest-python-api> failures:
  530. 43.25 s gammaloop-nextest-python-api>
  531. 43.25 s gammaloop-nextest-python-api> failures:
  532. 43.25 s gammaloop-nextest-python-api> python_settings_wrappers_expose_nested_runtime_and_global_settings
  533. 43.25 s gammaloop-nextest-python-api>
  534. 43.25 s gammaloop-nextest-python-api> test result: FAILED. 0 passed; 1 failed; 0 ignored; 0 measured; 4 filtered out; finished in 0.18s
  535. 43.25 s gammaloop-nextest-python-api>
  536. 43.25 s gammaloop-nextest-python-api> stderr ---
  537. 43.25 s gammaloop-nextest-python-api> Error: Python API test subprocess failed.
  538. 43.25 s gammaloop-nextest-python-api> stdout:
  539. 43.25 s gammaloop-nextest-python-api> ┌────────────────────────────────────────────────────────┐
  540. 43.25 s gammaloop-nextest-python-api> │ You are running a restricted Symbolica instance. │
  541. 43.25 s gammaloop-nextest-python-api> │ │
  542. 43.25 s gammaloop-nextest-python-api> │ This mode is only permitted for non-commercial use and │
  543. 43.25 s gammaloop-nextest-python-api> │ is limited to one instance and core per machine. │
  544. 43.25 s gammaloop-nextest-python-api> │ │
  545. 43.25 s gammaloop-nextest-python-api> │ Hobbyists can easily acquire a free license key │
  546. 43.25 s gammaloop-nextest-python-api> │ that unlocks all cores and removes this banner: │
  547. 43.25 s gammaloop-nextest-python-api> │ │
  548. 43.25 s gammaloop-nextest-python-api> │ from symbolica import * │
  549. 43.25 s gammaloop-nextest-python-api> │ request_hobbyist_license('YOUR_NAME', 'YOUR_EMAIL') │
  550. 43.25 s gammaloop-nextest-python-api> │ │
  551. 43.25 s gammaloop-nextest-python-api> │ All other users can obtain a free 30-day trial key: │
  552. 43.25 s gammaloop-nextest-python-api> │ │
  553. 43.25 s gammaloop-nextest-python-api> │ from symbolica import * │
  554. 43.25 s gammaloop-nextest-python-api> │ request_trial_license('NAME', 'EMAIL', 'EMPLOYER') │
  555. 43.25 s gammaloop-nextest-python-api> │ │
  556. 43.25 s gammaloop-nextest-python-api> │ See https://symbolica.io/docs/get_started.html#license │
  557. 43.25 s gammaloop-nextest-python-api> └────────────────────────────────────────────────────────┘
  558. 43.25 s gammaloop-nextest-python-api> ┌───────────────────────────────────────────────────────────────────────────────────────────────────────────┐
  559. 43.25 s gammaloop-nextest-python-api> │ Cannot start new unlicensed Symbolica instance since there is already another one running on the machine. │
  560. 43.25 s gammaloop-nextest-python-api> └───────────────────────────────────────────────────────────────────────────────────────────────────────────┘
  561. 43.25 s gammaloop-nextest-python-api>
  562. 43.25 s gammaloop-nextest-python-api> stderr:
  563. 43.25 s gammaloop-nextest-python-api>
  564. 43.25 s gammaloop-nextest-python-api> ┌───────────────────────────────────────────────────────────┐
  565. 43.25 s gammaloop-nextest-python-api> │ Could not resolve the IP of the Symbolica license server. │
  566. 43.25 s gammaloop-nextest-python-api> │ │
  567. 43.25 s gammaloop-nextest-python-api> │ Please check your DNS configuration. │
  568. 43.25 s gammaloop-nextest-python-api> └───────────────────────────────────────────────────────────┘
  569. 43.25 s gammaloop-nextest-python-api> Error: failed to lookup address information: Temporary failure in name resolution
  570. 43.25 s gammaloop-nextest-python-api>
  571. 43.25 s gammaloop-nextest-python-api>
  572. 43.25 s gammaloop-nextest-python-api> Location:
  573. 43.25 s gammaloop-nextest-python-api> tests/tests/test_python_api.rs:156:20
  574. 43.25 s gammaloop-nextest-python-api>
  575. 43.25 s gammaloop-nextest-python-api> ------------
  576. 43.25 s gammaloop-nextest-python-api> Summary [ 0.186s] 5 tests run: 0 passed, 5 failed, 0 skipped
  577. 43.25 s gammaloop-nextest-python-api> FAIL [ 0.116s] (1/5) gammaloop-integration-tests::test_python_api python_session_getters_return_live_toml_and_command_blocks
  578. 43.25 s gammaloop-nextest-python-api> stdout ---
  579. 43.25 s gammaloop-nextest-python-api>
  580. 43.25 s gammaloop-nextest-python-api> running 1 test
  581. 43.25 s gammaloop-nextest-python-api> test python_session_getters_return_live_toml_and_command_blocks ... FAILED
  582. 43.25 s gammaloop-nextest-python-api>
  583. 43.25 s gammaloop-nextest-python-api> failures:
  584. 43.25 s gammaloop-nextest-python-api>
  585. 43.25 s gammaloop-nextest-python-api> failures:
  586. 43.25 s gammaloop-nextest-python-api> python_session_getters_return_live_toml_and_command_blocks
  587. 43.25 s gammaloop-nextest-python-api>
  588. 43.25 s gammaloop-nextest-python-api> test result: FAILED. 0 passed; 1 failed; 0 ignored; 0 measured; 4 filtered out; finished in 0.11s
  589. 43.25 s gammaloop-nextest-python-api>
  590. 43.25 s gammaloop-nextest-python-api> stderr ---
  591. 43.25 s gammaloop-nextest-python-api> Error: Python API test subprocess failed.
  592. 43.25 s gammaloop-nextest-python-api> stdout:
  593. 43.25 s gammaloop-nextest-python-api> ┌────────────────────────────────────────────────────────┐
  594. 43.25 s gammaloop-nextest-python-api> │ You are running a restricted Symbolica instance. │
  595. 43.25 s gammaloop-nextest-python-api> │ │
  596. 43.25 s gammaloop-nextest-python-api> │ This mode is only permitted for non-commercial use and │
  597. 43.25 s gammaloop-nextest-python-api> │ is limited to one instance and core per machine. │
  598. 43.25 s gammaloop-nextest-python-api> │ │
  599. 43.25 s gammaloop-nextest-python-api> │ Hobbyists can easily acquire a free license key │
  600. 43.25 s gammaloop-nextest-python-api> │ that unlocks all cores and removes this banner: │
  601. 43.25 s gammaloop-nextest-python-api> │ │
  602. 43.25 s gammaloop-nextest-python-api> │ from symbolica import * │
  603. 43.25 s gammaloop-nextest-python-api> │ request_hobbyist_license('YOUR_NAME', 'YOUR_EMAIL') │
  604. 43.25 s gammaloop-nextest-python-api> │ │
  605. 43.25 s gammaloop-nextest-python-api> │ All other users can obtain a free 30-day trial key: │
  606. 43.25 s gammaloop-nextest-python-api> │ │
  607. 43.25 s gammaloop-nextest-python-api> │ from symbolica import * │
  608. 43.25 s gammaloop-nextest-python-api> │ request_trial_license('NAME', 'EMAIL', 'EMPLOYER') │
  609. 43.25 s gammaloop-nextest-python-api> │ │
  610. 43.25 s gammaloop-nextest-python-api> │ See https://symbolica.io/docs/get_started.html#license │
  611. 43.25 s gammaloop-nextest-python-api> └────────────────────────────────────────────────────────┘
  612. 43.25 s gammaloop-nextest-python-api> ┌───────────────────────────────────────────────────────────────────────────────────────────────────────────┐
  613. 43.25 s gammaloop-nextest-python-api> │ Cannot start new unlicensed Symbolica instance since there is already another one running on the machine. │
  614. 43.25 s gammaloop-nextest-python-api> └───────────────────────────────────────────────────────────────────────────────────────────────────────────┘
  615. 43.25 s gammaloop-nextest-python-api>
  616. 43.25 s gammaloop-nextest-python-api> stderr:
  617. 43.25 s gammaloop-nextest-python-api>
  618. 43.25 s gammaloop-nextest-python-api> ┌───────────────────────────────────────────────────────────┐
  619. 43.25 s gammaloop-nextest-python-api> │ Could not resolve the IP of the Symbolica license server. │
  620. 43.25 s gammaloop-nextest-python-api> │ │
  621. 43.25 s gammaloop-nextest-python-api> │ Please check your DNS configuration. │
  622. 43.25 s gammaloop-nextest-python-api> └───────────────────────────────────────────────────────────┘
  623. 43.25 s gammaloop-nextest-python-api> Error: failed to lookup address information: Temporary failure in name resolution
  624. 43.25 s gammaloop-nextest-python-api>
  625. 43.25 s gammaloop-nextest-python-api>
  626. 43.25 s gammaloop-nextest-python-api> Location:
  627. 43.25 s gammaloop-nextest-python-api> tests/tests/test_python_api.rs:156:20
  628. 43.25 s gammaloop-nextest-python-api>
  629. 43.25 s gammaloop-nextest-python-api> FAIL [ 0.118s] (2/5) gammaloop-integration-tests::test_python_api python_evaluate_sample_honors_generate_events_and_observable_snapshots
  630. 43.25 s gammaloop-nextest-python-api> stdout ---
  631. 43.25 s gammaloop-nextest-python-api>
  632. 43.25 s gammaloop-nextest-python-api> running 1 test
  633. 43.25 s gammaloop-nextest-python-api> test python_evaluate_sample_honors_generate_events_and_observable_snapshots ... FAILED
  634. 43.25 s gammaloop-nextest-python-api>
  635. 43.25 s gammaloop-nextest-python-api> failures:
  636. 43.25 s gammaloop-nextest-python-api>
  637. 43.25 s gammaloop-nextest-python-api> failures:
  638. 43.25 s gammaloop-nextest-python-api> python_evaluate_sample_honors_generate_events_and_observable_snapshots
  639. 43.25 s gammaloop-nextest-python-api>
  640. 43.25 s gammaloop-nextest-python-api> test result: FAILED. 0 passed; 1 failed; 0 ignored; 0 measured; 4 filtered out; finished in 0.11s
  641. 43.25 s gammaloop-nextest-python-api>
  642. 43.25 s gammaloop-nextest-python-api> stderr ---
  643. 43.25 s gammaloop-nextest-python-api> Error: Python API test subprocess failed.
  644. 43.25 s gammaloop-nextest-python-api> stdout:
  645. 43.25 s gammaloop-nextest-python-api> ┌────────────────────────────────────────────────────────┐
  646. 43.25 s gammaloop-nextest-python-api> │ You are running a restricted Symbolica instance. │
  647. 43.25 s gammaloop-nextest-python-api> │ │
  648. 43.25 s gammaloop-nextest-python-api> │ This mode is only permitted for non-commercial use and │
  649. 43.25 s gammaloop-nextest-python-api> │ is limited to one instance and core per machine. │
  650. 43.25 s gammaloop-nextest-python-api> │ │
  651. 43.25 s gammaloop-nextest-python-api> │ Hobbyists can easily acquire a free license key │
  652. 43.25 s gammaloop-nextest-python-api> │ that unlocks all cores and removes this banner: │
  653. 43.25 s gammaloop-nextest-python-api> │ │
  654. 43.25 s gammaloop-nextest-python-api> │ from symbolica import * │
  655. 43.25 s gammaloop-nextest-python-api> │ request_hobbyist_license('YOUR_NAME', 'YOUR_EMAIL') │
  656. 43.25 s gammaloop-nextest-python-api> │ │
  657. 43.25 s gammaloop-nextest-python-api> │ All other users can obtain a free 30-day trial key: │
  658. 43.25 s gammaloop-nextest-python-api> │ │
  659. 43.25 s gammaloop-nextest-python-api> │ from symbolica import * │
  660. 43.25 s gammaloop-nextest-python-api> │ request_trial_license('NAME', 'EMAIL', 'EMPLOYER') │
  661. 43.25 s gammaloop-nextest-python-api> │ │
  662. 43.25 s gammaloop-nextest-python-api> │ See https://symbolica.io/docs/get_started.html#license │
  663. 43.25 s gammaloop-nextest-python-api> └────────────────────────────────────────────────────────┘
  664. 43.25 s gammaloop-nextest-python-api> ┌───────────────────────────────────────────────────────────────────────────────────────────────────────────┐
  665. 43.25 s gammaloop-nextest-python-api> │ Cannot start new unlicensed Symbolica instance since there is already another one running on the machine. │
  666. 43.25 s gammaloop-nextest-python-api> └───────────────────────────────────────────────────────────────────────────────────────────────────────────┘
  667. 43.25 s gammaloop-nextest-python-api>
  668. 43.25 s gammaloop-nextest-python-api> stderr:
  669. 43.25 s gammaloop-nextest-python-api>
  670. 43.25 s gammaloop-nextest-python-api> ┌───────────────────────────────────────────────────────────┐
  671. 43.25 s gammaloop-nextest-python-api> │ Could not resolve the IP of the Symbolica license server. │
  672. 43.25 s gammaloop-nextest-python-api> │ │
  673. 43.25 s gammaloop-nextest-python-api> │ Please check your DNS configuration. │
  674. 43.25 s gammaloop-nextest-python-api> └───────────────────────────────────────────────────────────┘
  675. 43.25 s gammaloop-nextest-python-api> Error: failed to lookup address information: Temporary failure in name resolution
  676. 43.25 s gammaloop-nextest-python-api>
  677. 43.25 s gammaloop-nextest-python-api>
  678. 43.25 s gammaloop-nextest-python-api> Location:
  679. 43.25 s gammaloop-nextest-python-api> tests/tests/test_python_api.rs:156:20
  680. 43.25 s gammaloop-nextest-python-api>
  681. 43.25 s gammaloop-nextest-python-api> FAIL [ 0.118s] (3/5) gammaloop-integration-tests::test_python_api python_evaluate_samples_batch_and_momentum_space_have_expected_shape
  682. 43.25 s gammaloop-nextest-python-api> stdout ---
  683. 43.25 s gammaloop-nextest-python-api>
  684. 43.25 s gammaloop-nextest-python-api> running 1 test
  685. 43.25 s gammaloop-nextest-python-api> test python_evaluate_samples_batch_and_momentum_space_have_expected_shape ... FAILED
  686. 43.25 s gammaloop-nextest-python-api>
  687. 43.25 s gammaloop-nextest-python-api> failures:
  688. 43.25 s gammaloop-nextest-python-api>
  689. 43.25 s gammaloop-nextest-python-api> failures:
  690. 43.25 s gammaloop-nextest-python-api> python_evaluate_samples_batch_and_momentum_space_have_expected_shape
  691. 43.25 s gammaloop-nextest-python-api>
  692. 43.25 s gammaloop-nextest-python-api> test result: FAILED. 0 passed; 1 failed; 0 ignored; 0 measured; 4 filtered out; finished in 0.11s
  693. 43.25 s gammaloop-nextest-python-api>
  694. 43.25 s gammaloop-nextest-python-api> stderr ---
  695. 43.25 s gammaloop-nextest-python-api> Error: Python API test subprocess failed.
  696. 43.25 s gammaloop-nextest-python-api> stdout:
  697. 43.25 s gammaloop-nextest-python-api> ┌────────────────────────────────────────────────────────┐
  698. 43.25 s gammaloop-nextest-python-api> │ You are running a restricted Symbolica instance. │
  699. 43.25 s gammaloop-nextest-python-api> │ │
  700. 43.25 s gammaloop-nextest-python-api> │ This mode is only permitted for non-commercial use and │
  701. 43.25 s gammaloop-nextest-python-api> │ is limited to one instance and core per machine. │
  702. 43.25 s gammaloop-nextest-python-api> │ │
  703. 43.25 s gammaloop-nextest-python-api> │ Hobbyists can easily acquire a free license key │
  704. 43.25 s gammaloop-nextest-python-api> │ that unlocks all cores and removes this banner: │
  705. 43.25 s gammaloop-nextest-python-api> │ │
  706. 43.25 s gammaloop-nextest-python-api> │ from symbolica import * │
  707. 43.25 s gammaloop-nextest-python-api> │ request_hobbyist_license('YOUR_NAME', 'YOUR_EMAIL') │
  708. 43.25 s gammaloop-nextest-python-api> │ │
  709. 43.25 s gammaloop-nextest-python-api> │ All other users can obtain a free 30-day trial key: │
  710. 43.25 s gammaloop-nextest-python-api> │ │
  711. 43.25 s gammaloop-nextest-python-api> │ from symbolica import * │
  712. 43.25 s gammaloop-nextest-python-api> │ request_trial_license('NAME', 'EMAIL', 'EMPLOYER') │
  713. 43.25 s gammaloop-nextest-python-api> │ │
  714. 43.25 s gammaloop-nextest-python-api> │ See https://symbolica.io/docs/get_started.html#license │
  715. 43.25 s gammaloop-nextest-python-api> └────────────────────────────────────────────────────────┘
  716. 43.25 s gammaloop-nextest-python-api> ┌───────────────────────────────────────────────────────────────────────────────────────────────────────────┐
  717. 43.25 s gammaloop-nextest-python-api> │ Cannot start new unlicensed Symbolica instance since there is already another one running on the machine. │
  718. 43.25 s gammaloop-nextest-python-api> └───────────────────────────────────────────────────────────────────────────────────────────────────────────┘
  719. 43.25 s gammaloop-nextest-python-api>
  720. 43.25 s gammaloop-nextest-python-api> stderr:
  721. 43.25 s gammaloop-nextest-python-api>
  722. 43.25 s gammaloop-nextest-python-api> ┌───────────────────────────────────────────────────────────┐
  723. 43.25 s gammaloop-nextest-python-api> │ Could not resolve the IP of the Symbolica license server. │
  724. 43.25 s gammaloop-nextest-python-api> │ │
  725. 43.25 s gammaloop-nextest-python-api> │ Please check your DNS configuration. │
  726. 43.25 s gammaloop-nextest-python-api> └───────────────────────────────────────────────────────────┘
  727. 43.25 s gammaloop-nextest-python-api> Error: failed to lookup address information: Temporary failure in name resolution
  728. 43.25 s gammaloop-nextest-python-api>
  729. 43.25 s gammaloop-nextest-python-api>
  730. 43.25 s gammaloop-nextest-python-api> Location:
  731. 43.25 s gammaloop-nextest-python-api> tests/tests/test_python_api.rs:156:20
  732. 43.25 s gammaloop-nextest-python-api>
  733. 43.25 s gammaloop-nextest-python-api> FAIL [ 0.182s] (4/5) gammaloop-integration-tests::test_python_api python_evaluate_sample_preserves_graph_grouping_and_incoming_pdgs
  734. 43.25 s gammaloop-nextest-python-api> stdout ---
  735. 43.25 s gammaloop-nextest-python-api>
  736. 43.25 s gammaloop-nextest-python-api> running 1 test
  737. 43.25 s gammaloop-nextest-python-api> test python_evaluate_sample_preserves_graph_grouping_and_incoming_pdgs ... FAILED
  738. 43.25 s gammaloop-nextest-python-api>
  739. 43.25 s gammaloop-nextest-python-api> failures:
  740. 43.25 s gammaloop-nextest-python-api>
  741. 43.25 s gammaloop-nextest-python-api> failures:
  742. 43.25 s gammaloop-nextest-python-api> python_evaluate_sample_preserves_graph_grouping_and_incoming_pdgs
  743. 43.25 s gammaloop-nextest-python-api>
  744. 43.25 s gammaloop-nextest-python-api> test result: FAILED. 0 passed; 1 failed; 0 ignored; 0 measured; 4 filtered out; finished in 0.18s
  745. 43.25 s gammaloop-nextest-python-api>
  746. 43.25 s gammaloop-nextest-python-api> stderr ---
  747. 43.25 s gammaloop-nextest-python-api> Error: Python API test subprocess failed.
  748. 43.25 s gammaloop-nextest-python-api> stdout:
  749. 43.25 s gammaloop-nextest-python-api> ┌────────────────────────────────────────────────────────┐
  750. 43.25 s gammaloop-nextest-python-api> │ You are running a restricted Symbolica instance. │
  751. 43.25 s gammaloop-nextest-python-api> │ │
  752. 43.25 s gammaloop-nextest-python-api> │ This mode is only permitted for non-commercial use and │
  753. 43.25 s gammaloop-nextest-python-api> │ is limited to one instance and core per machine. │
  754. 43.25 s gammaloop-nextest-python-api> │ │
  755. 43.25 s gammaloop-nextest-python-api> │ Hobbyists can easily acquire a free license key │
  756. 43.25 s gammaloop-nextest-python-api> │ that unlocks all cores and removes this banner: │
  757. 43.25 s gammaloop-nextest-python-api> │ │
  758. 43.25 s gammaloop-nextest-python-api> │ from symbolica import * │
  759. 43.25 s gammaloop-nextest-python-api> │ request_hobbyist_license('YOUR_NAME', 'YOUR_EMAIL') │
  760. 43.25 s gammaloop-nextest-python-api> │ │
  761. 43.25 s gammaloop-nextest-python-api> │ All other users can obtain a free 30-day trial key: │
  762. 43.25 s gammaloop-nextest-python-api> │ │
  763. 43.25 s gammaloop-nextest-python-api> │ from symbolica import * │
  764. 43.25 s gammaloop-nextest-python-api> │ request_trial_license('NAME', 'EMAIL', 'EMPLOYER') │
  765. 43.25 s gammaloop-nextest-python-api> │ │
  766. 43.25 s gammaloop-nextest-python-api> │ See https://symbolica.io/docs/get_started.html#license │
  767. 43.25 s gammaloop-nextest-python-api> └────────────────────────────────────────────────────────┘
  768. 43.25 s gammaloop-nextest-python-api> ┌───────────────────────────────────────────────────────────────────────────────────────────────────────────┐
  769. 43.25 s gammaloop-nextest-python-api> │ Cannot start new unlicensed Symbolica instance since there is already another one running on the machine. │
  770. 43.25 s gammaloop-nextest-python-api> └───────────────────────────────────────────────────────────────────────────────────────────────────────────┘
  771. 43.25 s gammaloop-nextest-python-api>
  772. 43.25 s gammaloop-nextest-python-api> stderr:
  773. 43.25 s gammaloop-nextest-python-api>
  774. 43.25 s gammaloop-nextest-python-api> ┌───────────────────────────────────────────────────────────┐
  775. 43.25 s gammaloop-nextest-python-api> │ Could not resolve the IP of the Symbolica license server. │
  776. 43.25 s gammaloop-nextest-python-api> │ │
  777. 43.25 s gammaloop-nextest-python-api> │ Please check your DNS configuration. │
  778. 43.25 s gammaloop-nextest-python-api> └───────────────────────────────────────────────────────────┘
  779. 43.25 s gammaloop-nextest-python-api> Error: failed to lookup address information: Temporary failure in name resolution
  780. 43.25 s gammaloop-nextest-python-api> [2026-09-03 15:34:09.885] @gammaloop_api::se... INFO : Running command import model sm-default
  781. 43.25 s gammaloop-nextest-python-api> [2026-09-03 15:34:09.885] @import::model INFO : Loading built-in JSON model sm-default
  782. 43.25 s gammaloop-nextest-python-api> [2026-09-03 15:34:09.918] @gammalooprs::model INFO : The following 11 external parameters were forced to zero by the restriction card:
  783. 43.25 s gammaloop-nextest-python-api> lamWS, AWS, rhoWS, etaWS, ymc, yme, ymm, MC, Me, MM, WTau
  784. 43.25 s gammaloop-nextest-python-api> [2026-09-03 15:34:09.918] @gammalooprs::model INFO : The following 34 vertex rules were removed by the restriction card:
  785. 43.25 s gammaloop-nextest-python-api> V_82 -> (c~, d, G+) | V_83 -> (t~, d, G+) | V_84 -> (c~, s, G+) | V_85 -> (t~, s, G+) | V_86 -> (u~, b, G+) | V_87 -> (c~, b, G+) | V_90 -> (c~, d, W+) | V_91 -> (t~, d, W+) | V_92 -> (u~, s, W+) | V_94 -> (t~, s, W+) | V_95 -> (u~, b, W+) | V_96 -> (c~, b, W+) | V_101 -> (e+, e-, G0) | V_102 -> (mu+, mu-, G0) | V_104 -> (e+, e-, H) | V_105 -> (mu+, mu-, H) | V_110 -> (ve~, e-, G+) | V_111 -> (vm~, mu-, G+) | V_116 -> (b~, u, G-) | V_117 -> (d~, c, G-) | V_118 -> (s~, c, G-) | V_119 -> (b~, c, G-) | V_120 -> (d~, t, G-) | V_121 -> (s~, t, G-) | V_124 -> (s~, u, W-) | V_125 -> (b~, u, W-) | V_126 -> (d~, c, W-) | V_128 -> (b~, c, W-) | V_129 -> (d~, t, W-) | V_130 -> (s~, t, W-) | V_138 -> (c~, c, G0) | V_140 -> (c~, c, H) | V_145 -> (e+, ve, G-) | V_146 -> (mu+, vm, G-)
  786. 43.25 s gammaloop-nextest-python-api> [2026-09-03 15:34:09.918] @gammalooprs::model INFO : The following 36 couplings were removed by the restriction card:
  787. 43.25 s gammaloop-nextest-python-api> GC_13, GC_14, GC_16, GC_17, GC_18, GC_19, GC_20, GC_22, GC_23, GC_24, GC_25, GC_26, GC_28, GC_29, GC_42, GC_43, GC_44, GC_46, GC_47, GC_48, GC_84, GC_85, GC_86, GC_87, GC_88, GC_89, GC_90, GC_91, GC_92, GC_93, GC_101, GC_102, GC_103, GC_105, GC_106, GC_107
  788. 43.25 s gammaloop-nextest-python-api> [2026-09-03 15:34:09.918] @gammaloop_api::se... INFO : Running command set default-runtime kv kinematics.externals='{"type":"constant","data":{"momenta":[[32.0,0.0,0.0,32.0],[32.0,0.0,0.0,-32.0]],"helicities":[1,1]}}'
  789. 43.25 s gammaloop-nextest-python-api> [2026-09-03 15:34:09.919] @gammaloop_api::se... INFO : Running command set default-runtime kv subtraction.disable_threshold_subtraction=true
  790. 43.25 s gammaloop-nextest-python-api> [2026-09-03 15:34:09.920] @gammaloop_api::se... INFO : Running command generate xs e+ e- > d d~ g | e- a d g QED^2==4 [{{2}} QCD=0] --numerator-grouping group_identical_graphs_up_to_sign --clear-existing-processes --only-diagrams
  791. 43.25 s gammaloop-nextest-python-api> [2026-09-03 15:34:09.922] @feyngen::diagram_... INFO : 0s | Δ=0s | Starting Feynman graph generation with Symbolica...
  792. 43.25 s gammaloop-nextest-python-api> [2026-09-03 15:34:09.924] @feyngen::diagram_... INFO : 0s | Δ=0s | Number of graphs resulting from Symbolica generation: 246
  793. 43.25 s gammaloop-nextest-python-api> [2026-09-03 15:34:09.925] @feyngen::diagram_... INFO : 0s | Δ=0s | Number of graphs retained after enforcing supergraph particle content: 8
  794. 43.25 s gammaloop-nextest-python-api> [2026-09-03 15:34:09.925] @feyngen::diagram_... INFO : 0s | Δ=0s | Number of graphs retained after removal of vetoed topologies: 8
  795. 43.25 s gammaloop-nextest-python-api> [2026-09-03 15:34:09.925] @feyngen::diagram_... INFO : 0s | Δ=0s | Number of graphs after vertex info assignment: 8
  796. 43.25 s gammaloop-nextest-python-api> [2026-09-03 15:34:09.925] @feyngen::diagram_... INFO : 0s | Δ=0s | Number of graphs after all complete graphs filters are applied: 8
  797. 43.25 s gammaloop-nextest-python-api>
  798. 43.25 s gammaloop-nextest-python-api>
  799. 43.25 s gammaloop-nextest-python-api> Location:
  800. 43.25 s gammaloop-nextest-python-api> tests/tests/test_python_api.rs:156:20
  801. 43.25 s gammaloop-nextest-python-api>
  802. 43.25 s gammaloop-nextest-python-api> FAIL [ 0.185s] (5/5) gammaloop-integration-tests::test_python_api python_settings_wrappers_expose_nested_runtime_and_global_settings
  803. 43.25 s gammaloop-nextest-python-api> stdout ---
  804. 43.25 s gammaloop-nextest-python-api>
  805. 43.25 s gammaloop-nextest-python-api> running 1 test
  806. 43.25 s gammaloop-nextest-python-api> test python_settings_wrappers_expose_nested_runtime_and_global_settings ... FAILED
  807. 43.25 s gammaloop-nextest-python-api>
  808. 43.25 s gammaloop-nextest-python-api> failures:
  809. 43.25 s gammaloop-nextest-python-api>
  810. 43.25 s gammaloop-nextest-python-api> failures:
  811. 43.25 s gammaloop-nextest-python-api> python_settings_wrappers_expose_nested_runtime_and_global_settings
  812. 43.25 s gammaloop-nextest-python-api>
  813. 43.25 s gammaloop-nextest-python-api> test result: FAILED. 0 passed; 1 failed; 0 ignored; 0 measured; 4 filtered out; finished in 0.18s
  814. 43.25 s gammaloop-nextest-python-api>
  815. 43.25 s gammaloop-nextest-python-api> stderr ---
  816. 43.25 s gammaloop-nextest-python-api> Error: Python API test subprocess failed.
  817. 43.25 s gammaloop-nextest-python-api> stdout:
  818. 43.25 s gammaloop-nextest-python-api> ┌────────────────────────────────────────────────────────┐
  819. 43.25 s gammaloop-nextest-python-api> │ You are running a restricted Symbolica instance. │
  820. 43.26 s gammaloop-nextest-python-api> │ │
  821. 43.26 s gammaloop-nextest-python-api> │ This mode is only permitted for non-commercial use and │
  822. 43.26 s gammaloop-nextest-python-api> │ is limited to one instance and core per machine. │
  823. 43.26 s gammaloop-nextest-python-api> │ │
  824. 43.26 s gammaloop-nextest-python-api> │ Hobbyists can easily acquire a free license key │
  825. 43.26 s gammaloop-nextest-python-api> │ that unlocks all cores and removes this banner: │
  826. 43.26 s gammaloop-nextest-python-api> │ │
  827. 43.26 s gammaloop-nextest-python-api> │ from symbolica import * │
  828. 43.26 s gammaloop-nextest-python-api> │ request_hobbyist_license('YOUR_NAME', 'YOUR_EMAIL') │
  829. 43.26 s gammaloop-nextest-python-api> │ │
  830. 43.26 s gammaloop-nextest-python-api> │ All other users can obtain a free 30-day trial key: │
  831. 43.26 s gammaloop-nextest-python-api> │ │
  832. 43.26 s gammaloop-nextest-python-api> │ from symbolica import * │
  833. 43.26 s gammaloop-nextest-python-api> │ request_trial_license('NAME', 'EMAIL', 'EMPLOYER') │
  834. 43.26 s gammaloop-nextest-python-api> │ │
  835. 43.26 s gammaloop-nextest-python-api> │ See https://symbolica.io/docs/get_started.html#license │
  836. 43.26 s gammaloop-nextest-python-api> └────────────────────────────────────────────────────────┘
  837. 43.26 s gammaloop-nextest-python-api> ┌───────────────────────────────────────────────────────────────────────────────────────────────────────────┐
  838. 43.26 s gammaloop-nextest-python-api> │ Cannot start new unlicensed Symbolica instance since there is already another one running on the machine. │
  839. 43.26 s gammaloop-nextest-python-api> └───────────────────────────────────────────────────────────────────────────────────────────────────────────┘
  840. 43.26 s gammaloop-nextest-python-api>
  841. 43.26 s gammaloop-nextest-python-api> stderr:
  842. 43.26 s gammaloop-nextest-python-api>
  843. 43.26 s gammaloop-nextest-python-api> ┌───────────────────────────────────────────────────────────┐
  844. 43.26 s gammaloop-nextest-python-api> │ Could not resolve the IP of the Symbolica license server. │
  845. 43.26 s gammaloop-nextest-python-api> │ │
  846. 43.26 s gammaloop-nextest-python-api> │ Please check your DNS configuration. │
  847. 43.26 s gammaloop-nextest-python-api> └───────────────────────────────────────────────────────────┘
  848. 43.26 s gammaloop-nextest-python-api> Error: failed to lookup address information: Temporary failure in name resolution
  849. 43.26 s gammaloop-nextest-python-api>
  850. 43.26 s gammaloop-nextest-python-api>
  851. 43.26 s gammaloop-nextest-python-api> Location:
  852. 43.26 s gammaloop-nextest-python-api> tests/tests/test_python_api.rs:156:20
  853. 43.26 s gammaloop-nextest-python-api>
  854. 43.28 s gammaloop-nextest-python-api> error: test run failed
  855. 43.31 s gammaloop-nextest-python-api>
  856. 43.31 s gammaloop-nextest-python-api> ========== nextest test summary ==========
  857. 43.31 s gammaloop-nextest-python-api> report: target/nextest/ci_gammaloop/junit.xml
  858. 43.31 s gammaloop-nextest-python-api> tests: 5, failures: 5, errors: 0
  859. 43.31 s gammaloop-nextest-python-api>
  860. 43.31 s gammaloop-nextest-python-api> 1. gammaloop-integration-tests::test_python_api::python_session_getters_return_live_toml_and_command_blocks
  861. 43.31 s gammaloop-nextest-python-api> failure: test failure with exit code 101
  862. 43.31 s gammaloop-nextest-python-api> Error: Python API test subprocess failed.
  863. 43.31 s gammaloop-nextest-python-api> stdout:
  864. 43.31 s gammaloop-nextest-python-api> ┌────────────────────────────────────────────────────────┐
  865. 43.31 s gammaloop-nextest-python-api> │ You are running a restricted Symbolica instance. │
  866. 43.31 s gammaloop-nextest-python-api> │ │
  867. 43.31 s gammaloop-nextest-python-api> │ This mode is only permitted for non-commercial use and │
  868. 43.31 s gammaloop-nextest-python-api> │ is limited to one instance and core per machine. │
  869. 43.31 s gammaloop-nextest-python-api> │ │
  870. 43.31 s gammaloop-nextest-python-api> │ Hobbyists can easily acquire a free license key │
  871. 43.31 s gammaloop-nextest-python-api> │ that unlocks all cores and removes this banner: │
  872. 43.31 s gammaloop-nextest-python-api> │ │
  873. 43.31 s gammaloop-nextest-python-api> │ from symbolica import * │
  874. 43.31 s gammaloop-nextest-python-api> │ request_hobbyist_license('YOUR_NAME', 'YOUR_EMAIL') │
  875. 43.31 s gammaloop-nextest-python-api> │ │
  876. 43.31 s gammaloop-nextest-python-api> │ All other users can obtain a free 30-day trial key: │
  877. 43.31 s gammaloop-nextest-python-api> │ │
  878. 43.31 s gammaloop-nextest-python-api> │ from symbolica import * │
  879. 43.31 s gammaloop-nextest-python-api> │ request_trial_license('NAME', 'EMAIL', 'EMPLOYER') │
  880. 43.31 s gammaloop-nextest-python-api> │ │
  881. 43.31 s gammaloop-nextest-python-api> │ See https://symbolica.io/docs/get_started.html#license │
  882. 43.31 s gammaloop-nextest-python-api> └────────────────────────────────────────────────────────┘
  883. 43.31 s gammaloop-nextest-python-api> ┌───────────────────────────────────────────────────────────────────────────────────────────────────────────┐
  884. 43.31 s gammaloop-nextest-python-api> │ Cannot start new unlicensed Symbolica instance since there is already another one running on the machine. │
  885. 43.31 s gammaloop-nextest-python-api> └───────────────────────────────────────────────────────────────────────────────────────────────────────────┘
  886. 43.31 s gammaloop-nextest-python-api>
  887. 43.31 s gammaloop-nextest-python-api> stderr:
  888. 43.31 s gammaloop-nextest-python-api>
  889. 43.31 s gammaloop-nextest-python-api> ┌───────────────────────────────────────────────────────────┐
  890. 43.31 s gammaloop-nextest-python-api> │ Could not resolve the IP of the Symbolica license server. │
  891. 43.31 s gammaloop-nextest-python-api> │ │
  892. 43.31 s gammaloop-nextest-python-api> │ Please check your DNS configuration. │
  893. 43.31 s gammaloop-nextest-python-api> └───────────────────────────────────────────────────────────┘
  894. 43.31 s gammaloop-nextest-python-api> Error: failed to lookup address information: Temporary failure in name resolution
  895. 43.31 s gammaloop-nextest-python-api>
  896. 43.31 s gammaloop-nextest-python-api>
  897. 43.31 s gammaloop-nextest-python-api> Location:
  898. 43.31 s gammaloop-nextest-python-api> tests/tests/test_python_api.rs:156:20
  899. 43.31 s gammaloop-nextest-python-api> system-out
  900. 43.31 s gammaloop-nextest-python-api> running 1 test
  901. 43.31 s gammaloop-nextest-python-api> test python_session_getters_return_live_toml_and_command_blocks ... FAILED
  902. 43.31 s gammaloop-nextest-python-api>
  903. 43.31 s gammaloop-nextest-python-api> failures:
  904. 43.31 s gammaloop-nextest-python-api>
  905. 43.31 s gammaloop-nextest-python-api> failures:
  906. 43.31 s gammaloop-nextest-python-api> python_session_getters_return_live_toml_and_command_blocks
  907. 43.31 s gammaloop-nextest-python-api>
  908. 43.31 s gammaloop-nextest-python-api> test result: FAILED. 0 passed; 1 failed; 0 ignored; 0 measured; 4 filtered out; finished in 0.11s
  909. 43.31 s gammaloop-nextest-python-api> system-err
  910. 43.31 s gammaloop-nextest-python-api> Error: Python API test subprocess failed.
  911. 43.31 s gammaloop-nextest-python-api> stdout:
  912. 43.31 s gammaloop-nextest-python-api> ┌────────────────────────────────────────────────────────┐
  913. 43.31 s gammaloop-nextest-python-api> │ You are running a restricted Symbolica instance. │
  914. 43.31 s gammaloop-nextest-python-api> │ │
  915. 43.31 s gammaloop-nextest-python-api> │ This mode is only permitted for non-commercial use and │
  916. 43.31 s gammaloop-nextest-python-api> │ is limited to one instance and core per machine. │
  917. 43.31 s gammaloop-nextest-python-api> │ │
  918. 43.31 s gammaloop-nextest-python-api> │ Hobbyists can easily acquire a free license key │
  919. 43.31 s gammaloop-nextest-python-api> │ that unlocks all cores and removes this banner: │
  920. 43.31 s gammaloop-nextest-python-api> │ │
  921. 43.31 s gammaloop-nextest-python-api> │ from symbolica import * │
  922. 43.31 s gammaloop-nextest-python-api> │ request_hobbyist_license('YOUR_NAME', 'YOUR_EMAIL') │
  923. 43.31 s gammaloop-nextest-python-api> │ │
  924. 43.31 s gammaloop-nextest-python-api> │ All other users can obtain a free 30-day trial key: │
  925. 43.31 s gammaloop-nextest-python-api> │ │
  926. 43.31 s gammaloop-nextest-python-api> │ from symbolica import * │
  927. 43.31 s gammaloop-nextest-python-api> │ request_trial_license('NAME', 'EMAIL', 'EMPLOYER') │
  928. 43.31 s gammaloop-nextest-python-api> │ │
  929. 43.31 s gammaloop-nextest-python-api> │ See https://symbolica.io/docs/get_started.html#license │
  930. 43.31 s gammaloop-nextest-python-api> └────────────────────────────────────────────────────────┘
  931. 43.31 s gammaloop-nextest-python-api> ┌───────────────────────────────────────────────────────────────────────────────────────────────────────────┐
  932. 43.31 s gammaloop-nextest-python-api> │ Cannot start new unlicensed Symbolica instance since there is already another one running on the machine. │
  933. 43.31 s gammaloop-nextest-python-api> └───────────────────────────────────────────────────────────────────────────────────────────────────────────┘
  934. 43.31 s gammaloop-nextest-python-api>
  935. 43.31 s gammaloop-nextest-python-api> stderr:
  936. 43.31 s gammaloop-nextest-python-api>
  937. 43.31 s gammaloop-nextest-python-api> ┌───────────────────────────────────────────────────────────┐
  938. 43.31 s gammaloop-nextest-python-api> │ Could not resolve the IP of the Symbolica license server. │
  939. 43.31 s gammaloop-nextest-python-api> │ │
  940. 43.31 s gammaloop-nextest-python-api> │ Please check your DNS configuration. │
  941. 43.31 s gammaloop-nextest-python-api> └───────────────────────────────────────────────────────────┘
  942. 43.31 s gammaloop-nextest-python-api> Error: failed to lookup address information: Temporary failure in name resolution
  943. 43.31 s gammaloop-nextest-python-api>
  944. 43.31 s gammaloop-nextest-python-api>
  945. 43.31 s gammaloop-nextest-python-api> Location:
  946. 43.31 s gammaloop-nextest-python-api> tests/tests/test_python_api.rs:156:20
  947. 43.31 s gammaloop-nextest-python-api>
  948. 43.31 s gammaloop-nextest-python-api> 2. gammaloop-integration-tests::test_python_api::python_evaluate_sample_honors_generate_events_and_observable_snapshots
  949. 43.31 s gammaloop-nextest-python-api> failure: test failure with exit code 101
  950. 43.31 s gammaloop-nextest-python-api> Error: Python API test subprocess failed.
  951. 43.31 s gammaloop-nextest-python-api> stdout:
  952. 43.31 s gammaloop-nextest-python-api> ┌────────────────────────────────────────────────────────┐
  953. 43.31 s gammaloop-nextest-python-api> │ You are running a restricted Symbolica instance. │
  954. 43.31 s gammaloop-nextest-python-api> │ │
  955. 43.31 s gammaloop-nextest-python-api> │ This mode is only permitted for non-commercial use and │
  956. 43.31 s gammaloop-nextest-python-api> │ is limited to one instance and core per machine. │
  957. 43.31 s gammaloop-nextest-python-api> │ │
  958. 43.31 s gammaloop-nextest-python-api> │ Hobbyists can easily acquire a free license key │
  959. 43.31 s gammaloop-nextest-python-api> │ that unlocks all cores and removes this banner: │
  960. 43.31 s gammaloop-nextest-python-api> │ │
  961. 43.31 s gammaloop-nextest-python-api> │ from symbolica import * │
  962. 43.31 s gammaloop-nextest-python-api> │ request_hobbyist_license('YOUR_NAME', 'YOUR_EMAIL') │
  963. 43.31 s gammaloop-nextest-python-api> │ │
  964. 43.31 s gammaloop-nextest-python-api> │ All other users can obtain a free 30-day trial key: │
  965. 43.31 s gammaloop-nextest-python-api> │ │
  966. 43.31 s gammaloop-nextest-python-api> │ from symbolica import * │
  967. 43.31 s gammaloop-nextest-python-api> │ request_trial_license('NAME', 'EMAIL', 'EMPLOYER') │
  968. 43.31 s gammaloop-nextest-python-api> │ │
  969. 43.31 s gammaloop-nextest-python-api> │ See https://symbolica.io/docs/get_started.html#license │
  970. 43.31 s gammaloop-nextest-python-api> └────────────────────────────────────────────────────────┘
  971. 43.31 s gammaloop-nextest-python-api> ┌───────────────────────────────────────────────────────────────────────────────────────────────────────────┐
  972. 43.31 s gammaloop-nextest-python-api> │ Cannot start new unlicensed Symbolica instance since there is already another one running on the machine. │
  973. 43.31 s gammaloop-nextest-python-api> └───────────────────────────────────────────────────────────────────────────────────────────────────────────┘
  974. 43.31 s gammaloop-nextest-python-api>
  975. 43.31 s gammaloop-nextest-python-api> stderr:
  976. 43.31 s gammaloop-nextest-python-api>
  977. 43.31 s gammaloop-nextest-python-api> ┌───────────────────────────────────────────────────────────┐
  978. 43.31 s gammaloop-nextest-python-api> │ Could not resolve the IP of the Symbolica license server. │
  979. 43.31 s gammaloop-nextest-python-api> │ │
  980. 43.31 s gammaloop-nextest-python-api> │ Please check your DNS configuration. │
  981. 43.31 s gammaloop-nextest-python-api> └───────────────────────────────────────────────────────────┘
  982. 43.31 s gammaloop-nextest-python-api> Error: failed to lookup address information: Temporary failure in name resolution
  983. 43.31 s gammaloop-nextest-python-api>
  984. 43.31 s gammaloop-nextest-python-api>
  985. 43.31 s gammaloop-nextest-python-api> Location:
  986. 43.31 s gammaloop-nextest-python-api> tests/tests/test_python_api.rs:156:20
  987. 43.31 s gammaloop-nextest-python-api> system-out
  988. 43.31 s gammaloop-nextest-python-api> running 1 test
  989. 43.31 s gammaloop-nextest-python-api> test python_evaluate_sample_honors_generate_events_and_observable_snapshots ... FAILED
  990. 43.31 s gammaloop-nextest-python-api>
  991. 43.31 s gammaloop-nextest-python-api> failures:
  992. 43.31 s gammaloop-nextest-python-api>
  993. 43.31 s gammaloop-nextest-python-api> failures:
  994. 43.31 s gammaloop-nextest-python-api> python_evaluate_sample_honors_generate_events_and_observable_snapshots
  995. 43.31 s gammaloop-nextest-python-api>
  996. 43.31 s gammaloop-nextest-python-api> test result: FAILED. 0 passed; 1 failed; 0 ignored; 0 measured; 4 filtered out; finished in 0.11s
  997. 43.31 s gammaloop-nextest-python-api> system-err
  998. 43.31 s gammaloop-nextest-python-api> Error: Python API test subprocess failed.
  999. 43.31 s gammaloop-nextest-python-api> stdout:
  1000. 43.31 s gammaloop-nextest-python-api> ┌────────────────────────────────────────────────────────┐
  1001. 43.31 s gammaloop-nextest-python-api> │ You are running a restricted Symbolica instance. │
  1002. 43.31 s gammaloop-nextest-python-api> │ │
  1003. 43.31 s gammaloop-nextest-python-api> │ This mode is only permitted for non-commercial use and │
  1004. 43.31 s gammaloop-nextest-python-api> │ is limited to one instance and core per machine. │
  1005. 43.31 s gammaloop-nextest-python-api> │ │
  1006. 43.31 s gammaloop-nextest-python-api> │ Hobbyists can easily acquire a free license key │
  1007. 43.31 s gammaloop-nextest-python-api> │ that unlocks all cores and removes this banner: │
  1008. 43.31 s gammaloop-nextest-python-api> │ │
  1009. 43.31 s gammaloop-nextest-python-api> │ from symbolica import * │
  1010. 43.31 s gammaloop-nextest-python-api> │ request_hobbyist_license('YOUR_NAME', 'YOUR_EMAIL') │
  1011. 43.31 s gammaloop-nextest-python-api> │ │
  1012. 43.31 s gammaloop-nextest-python-api> │ All other users can obtain a free 30-day trial key: │
  1013. 43.31 s gammaloop-nextest-python-api> │ │
  1014. 43.31 s gammaloop-nextest-python-api> │ from symbolica import * │
  1015. 43.31 s gammaloop-nextest-python-api> │ request_trial_license('NAME', 'EMAIL', 'EMPLOYER') │
  1016. 43.31 s gammaloop-nextest-python-api> │ │
  1017. 43.31 s gammaloop-nextest-python-api> │ See https://symbolica.io/docs/get_started.html#license │
  1018. 43.31 s gammaloop-nextest-python-api> └────────────────────────────────────────────────────────┘
  1019. 43.31 s gammaloop-nextest-python-api> ┌───────────────────────────────────────────────────────────────────────────────────────────────────────────┐
  1020. 43.31 s gammaloop-nextest-python-api> │ Cannot start new unlicensed Symbolica instance since there is already another one running on the machine. │
  1021. 43.31 s gammaloop-nextest-python-api> └───────────────────────────────────────────────────────────────────────────────────────────────────────────┘
  1022. 43.31 s gammaloop-nextest-python-api>
  1023. 43.31 s gammaloop-nextest-python-api> stderr:
  1024. 43.31 s gammaloop-nextest-python-api>
  1025. 43.31 s gammaloop-nextest-python-api> ┌───────────────────────────────────────────────────────────┐
  1026. 43.31 s gammaloop-nextest-python-api> │ Could not resolve the IP of the Symbolica license server. │
  1027. 43.31 s gammaloop-nextest-python-api> │ │
  1028. 43.31 s gammaloop-nextest-python-api> │ Please check your DNS configuration. │
  1029. 43.31 s gammaloop-nextest-python-api> └───────────────────────────────────────────────────────────┘
  1030. 43.31 s gammaloop-nextest-python-api> Error: failed to lookup address information: Temporary failure in name resolution
  1031. 43.31 s gammaloop-nextest-python-api>
  1032. 43.31 s gammaloop-nextest-python-api>
  1033. 43.31 s gammaloop-nextest-python-api> Location:
  1034. 43.31 s gammaloop-nextest-python-api> tests/tests/test_python_api.rs:156:20
  1035. 43.31 s gammaloop-nextest-python-api>
  1036. 43.31 s gammaloop-nextest-python-api> 3. gammaloop-integration-tests::test_python_api::python_evaluate_samples_batch_and_momentum_space_have_expected_shape
  1037. 43.31 s gammaloop-nextest-python-api> failure: test failure with exit code 101
  1038. 43.31 s gammaloop-nextest-python-api> Error: Python API test subprocess failed.
  1039. 43.31 s gammaloop-nextest-python-api> stdout:
  1040. 43.31 s gammaloop-nextest-python-api> ┌────────────────────────────────────────────────────────┐
  1041. 43.31 s gammaloop-nextest-python-api> │ You are running a restricted Symbolica instance. │
  1042. 43.31 s gammaloop-nextest-python-api> │ │
  1043. 43.31 s gammaloop-nextest-python-api> │ This mode is only permitted for non-commercial use and │
  1044. 43.31 s gammaloop-nextest-python-api> │ is limited to one instance and core per machine. │
  1045. 43.31 s gammaloop-nextest-python-api> │ │
  1046. 43.31 s gammaloop-nextest-python-api> │ Hobbyists can easily acquire a free license key │
  1047. 43.31 s gammaloop-nextest-python-api> │ that unlocks all cores and removes this banner: │
  1048. 43.31 s gammaloop-nextest-python-api> │ │
  1049. 43.31 s gammaloop-nextest-python-api> │ from symbolica import * │
  1050. 43.31 s gammaloop-nextest-python-api> │ request_hobbyist_license('YOUR_NAME', 'YOUR_EMAIL') │
  1051. 43.31 s gammaloop-nextest-python-api> │ │
  1052. 43.31 s gammaloop-nextest-python-api> │ All other users can obtain a free 30-day trial key: │
  1053. 43.31 s gammaloop-nextest-python-api> │ │
  1054. 43.31 s gammaloop-nextest-python-api> │ from symbolica import * │
  1055. 43.31 s gammaloop-nextest-python-api> │ request_trial_license('NAME', 'EMAIL', 'EMPLOYER') │
  1056. 43.31 s gammaloop-nextest-python-api> │ │
  1057. 43.31 s gammaloop-nextest-python-api> │ See https://symbolica.io/docs/get_started.html#license │
  1058. 43.31 s gammaloop-nextest-python-api> └────────────────────────────────────────────────────────┘
  1059. 43.31 s gammaloop-nextest-python-api> ┌───────────────────────────────────────────────────────────────────────────────────────────────────────────┐
  1060. 43.31 s gammaloop-nextest-python-api> │ Cannot start new unlicensed Symbolica instance since there is already another one running on the machine. │
  1061. 43.31 s gammaloop-nextest-python-api> └───────────────────────────────────────────────────────────────────────────────────────────────────────────┘
  1062. 43.31 s gammaloop-nextest-python-api>
  1063. 43.31 s gammaloop-nextest-python-api> stderr:
  1064. 43.31 s gammaloop-nextest-python-api>
  1065. 43.31 s gammaloop-nextest-python-api> ┌───────────────────────────────────────────────────────────┐
  1066. 43.31 s gammaloop-nextest-python-api> │ Could not resolve the IP of the Symbolica license server. │
  1067. 43.31 s gammaloop-nextest-python-api> │ │
  1068. 43.31 s gammaloop-nextest-python-api> │ Please check your DNS configuration. │
  1069. 43.31 s gammaloop-nextest-python-api> └───────────────────────────────────────────────────────────┘
  1070. 43.31 s gammaloop-nextest-python-api> Error: failed to lookup address information: Temporary failure in name resolution
  1071. 43.31 s gammaloop-nextest-python-api>
  1072. 43.31 s gammaloop-nextest-python-api>
  1073. 43.31 s gammaloop-nextest-python-api> Location:
  1074. 43.31 s gammaloop-nextest-python-api> tests/tests/test_python_api.rs:156:20
  1075. 43.31 s gammaloop-nextest-python-api> system-out
  1076. 43.31 s gammaloop-nextest-python-api> running 1 test
  1077. 43.31 s gammaloop-nextest-python-api> test python_evaluate_samples_batch_and_momentum_space_have_expected_shape ... FAILED
  1078. 43.31 s gammaloop-nextest-python-api>
  1079. 43.31 s gammaloop-nextest-python-api> failures:
  1080. 43.31 s gammaloop-nextest-python-api>
  1081. 43.31 s gammaloop-nextest-python-api> failures:
  1082. 43.31 s gammaloop-nextest-python-api> python_evaluate_samples_batch_and_momentum_space_have_expected_shape
  1083. 43.31 s gammaloop-nextest-python-api>
  1084. 43.31 s gammaloop-nextest-python-api> test result: FAILED. 0 passed; 1 failed; 0 ignored; 0 measured; 4 filtered out; finished in 0.11s
  1085. 43.31 s gammaloop-nextest-python-api> system-err
  1086. 43.31 s gammaloop-nextest-python-api> Error: Python API test subprocess failed.
  1087. 43.31 s gammaloop-nextest-python-api> stdout:
  1088. 43.31 s gammaloop-nextest-python-api> ┌────────────────────────────────────────────────────────┐
  1089. 43.31 s gammaloop-nextest-python-api> │ You are running a restricted Symbolica instance. │
  1090. 43.31 s gammaloop-nextest-python-api> │ │
  1091. 43.31 s gammaloop-nextest-python-api> │ This mode is only permitted for non-commercial use and │
  1092. 43.31 s gammaloop-nextest-python-api> │ is limited to one instance and core per machine. │
  1093. 43.31 s gammaloop-nextest-python-api> │ │
  1094. 43.31 s gammaloop-nextest-python-api> │ Hobbyists can easily acquire a free license key │
  1095. 43.31 s gammaloop-nextest-python-api> │ that unlocks all cores and removes this banner: │
  1096. 43.31 s gammaloop-nextest-python-api> │ │
  1097. 43.31 s gammaloop-nextest-python-api> │ from symbolica import * │
  1098. 43.31 s gammaloop-nextest-python-api> │ request_hobbyist_license('YOUR_NAME', 'YOUR_EMAIL') │
  1099. 43.31 s gammaloop-nextest-python-api> │ │
  1100. 43.31 s gammaloop-nextest-python-api> │ All other users can obtain a free 30-day trial key: │
  1101. 43.31 s gammaloop-nextest-python-api> │ │
  1102. 43.31 s gammaloop-nextest-python-api> │ from symbolica import * │
  1103. 43.31 s gammaloop-nextest-python-api> │ request_trial_license('NAME', 'EMAIL', 'EMPLOYER') │
  1104. 43.31 s gammaloop-nextest-python-api> │ │
  1105. 43.31 s gammaloop-nextest-python-api> │ See https://symbolica.io/docs/get_started.html#license │
  1106. 43.31 s gammaloop-nextest-python-api> └────────────────────────────────────────────────────────┘
  1107. 43.31 s gammaloop-nextest-python-api> ┌───────────────────────────────────────────────────────────────────────────────────────────────────────────┐
  1108. 43.31 s gammaloop-nextest-python-api> │ Cannot start new unlicensed Symbolica instance since there is already another one running on the machine. │
  1109. 43.31 s gammaloop-nextest-python-api> └───────────────────────────────────────────────────────────────────────────────────────────────────────────┘
  1110. 43.31 s gammaloop-nextest-python-api>
  1111. 43.31 s gammaloop-nextest-python-api> stderr:
  1112. 43.31 s gammaloop-nextest-python-api>
  1113. 43.31 s gammaloop-nextest-python-api> ┌───────────────────────────────────────────────────────────┐
  1114. 43.31 s gammaloop-nextest-python-api> │ Could not resolve the IP of the Symbolica license server. │
  1115. 43.31 s gammaloop-nextest-python-api> │ │
  1116. 43.31 s gammaloop-nextest-python-api> │ Please check your DNS configuration. │
  1117. 43.31 s gammaloop-nextest-python-api> └───────────────────────────────────────────────────────────┘
  1118. 43.31 s gammaloop-nextest-python-api> Error: failed to lookup address information: Temporary failure in name resolution
  1119. 43.31 s gammaloop-nextest-python-api>
  1120. 43.31 s gammaloop-nextest-python-api>
  1121. 43.31 s gammaloop-nextest-python-api> Location:
  1122. 43.31 s gammaloop-nextest-python-api> tests/tests/test_python_api.rs:156:20
  1123. 43.31 s gammaloop-nextest-python-api>
  1124. 43.31 s gammaloop-nextest-python-api> 4. gammaloop-integration-tests::test_python_api::python_evaluate_sample_preserves_graph_grouping_and_incoming_pdgs
  1125. 43.31 s gammaloop-nextest-python-api> failure: test failure with exit code 101
  1126. 43.31 s gammaloop-nextest-python-api> Error: Python API test subprocess failed.
  1127. 43.31 s gammaloop-nextest-python-api> stdout:
  1128. 43.31 s gammaloop-nextest-python-api> ┌────────────────────────────────────────────────────────┐
  1129. 43.31 s gammaloop-nextest-python-api> │ You are running a restricted Symbolica instance. │
  1130. 43.31 s gammaloop-nextest-python-api> │ │
  1131. 43.31 s gammaloop-nextest-python-api> │ This mode is only permitted for non-commercial use and │
  1132. 43.31 s gammaloop-nextest-python-api> │ is limited to one instance and core per machine. │
  1133. 43.31 s gammaloop-nextest-python-api> │ │
  1134. 43.31 s gammaloop-nextest-python-api> │ Hobbyists can easily acquire a free license key │
  1135. 43.31 s gammaloop-nextest-python-api> │ that unlocks all cores and removes this banner: │
  1136. 43.31 s gammaloop-nextest-python-api> │ │
  1137. 43.31 s gammaloop-nextest-python-api> │ from symbolica import * │
  1138. 43.31 s gammaloop-nextest-python-api> │ request_hobbyist_license('YOUR_NAME', 'YOUR_EMAIL') │
  1139. 43.31 s gammaloop-nextest-python-api> │ │
  1140. 43.31 s gammaloop-nextest-python-api> │ All other users can obtain a free 30-day trial key: │
  1141. 43.31 s gammaloop-nextest-python-api> │ │
  1142. 43.31 s gammaloop-nextest-python-api> │ from symbolica import * │
  1143. 43.31 s gammaloop-nextest-python-api> │ request_trial_license('NAME', 'EMAIL', 'EMPLOYER') │
  1144. 43.31 s gammaloop-nextest-python-api> │ │
  1145. 43.31 s gammaloop-nextest-python-api> │ See https://symbolica.io/docs/get_started.html#license │
  1146. 43.31 s gammaloop-nextest-python-api> └────────────────────────────────────────────────────────┘
  1147. 43.31 s gammaloop-nextest-python-api> ┌───────────────────────────────────────────────────────────────────────────────────────────────────────────┐
  1148. 43.31 s gammaloop-nextest-python-api> │ Cannot start new unlicensed Symbolica instance since there is already another one running on the machine. │
  1149. 43.31 s gammaloop-nextest-python-api> └───────────────────────────────────────────────────────────────────────────────────────────────────────────┘
  1150. 43.31 s gammaloop-nextest-python-api>
  1151. 43.31 s gammaloop-nextest-python-api> stderr:
  1152. 43.31 s gammaloop-nextest-python-api>
  1153. 43.31 s gammaloop-nextest-python-api> ┌───────────────────────────────────────────────────────────┐
  1154. 43.31 s gammaloop-nextest-python-api> │ Could not resolve the IP of the Symbolica license server. │
  1155. 43.31 s gammaloop-nextest-python-api> │ │
  1156. 43.31 s gammaloop-nextest-python-api> │ Please check your DNS configuration. │
  1157. 43.31 s gammaloop-nextest-python-api> └───────────────────────────────────────────────────────────┘
  1158. 43.31 s gammaloop-nextest-python-api> Error: failed to lookup address information: Temporary failure in name resolution
  1159. 43.31 s gammaloop-nextest-python-api> [2026-09-03 15:34:09.885] @gammaloop_api::se... INFO : Running command import model sm-default
  1160. 43.31 s gammaloop-nextest-python-api> [2026-09-03 15:34:09.885] @import::model INFO : Loading built-in JSON model sm-default
  1161. 43.31 s gammaloop-nextest-python-api> [2026-09-03 15:34:09.918] @gammalooprs::model INFO : The following 11 external parameters were forced to zero by the restriction card:
  1162. 43.31 s gammaloop-nextest-python-api> lamWS, AWS, rhoWS, etaWS, ymc, yme, ymm, MC, Me, MM, WTau
  1163. 43.31 s gammaloop-nextest-python-api> [2026-09-03 15:34:09.918] @gammalooprs::model INFO : The following 34 vertex rules were removed by the restriction card:
  1164. 43.31 s gammaloop-nextest-python-api> V_82 -> (c~, d, G+) | V_83 -> (t~, d, G+) | V_84 -> (c~, s, G+) | V_85 -> (t~, s, G+) | V_86 -> (u~, b, G+) | V_87 -> (c~, b, G+) | V_90 -> (c~, d, W+) | V_91 -> (t~, d, W+) | V_92 -> (u~, s, W+) | V_94 -> (t~, s, W+) | V_95 -> (u~, b, W+) | V_96 -> (c~, b, W+) | V_101 -> (e+, e-, G0) | V_102 -> (mu+, mu-, G0) | V_104 -> (e+, e-, H) | V_105 -> (mu+, mu-, H) | V_110 -> (ve~, e-, G+) | V_111 -> (vm~, mu-, G+) | V_116 -> (b~, u, G-) | V_117 -> (d~, c, G-) | V_118 -> (s~, c, G-) | V_119 -> (b~, c, G-) | V_120 -> (d~, t, G-) | V_121 -> (s~, t, G-) | V_124 -> (s~, u, W-) | V_125 -> (b~, u, W-) | V_126 -> (d~, c, W-) | V_128 -> (b~, c, W-) | V_129 -> (d~, t, W-) | V_130 -> (s~, t, W-) | V_138 -> (c~, c, G0) | V_140 -> (c~, c, H) | V_145 -> (e+, ve, G-) | V_146 -> (mu+, vm, G-)
  1165. 43.31 s gammaloop-nextest-python-api> [2026-09-03 15:34:09.918] @gammalooprs::model INFO : The following 36 couplings were removed by the restriction card:
  1166. 43.31 s gammaloop-nextest-python-api> GC_13, GC_14, GC_16, GC_17, GC_18, GC_19, GC_20, GC_22, GC_23, GC_24, GC_25, GC_26, GC_28, GC_29, GC_42, GC_43, GC_44, GC_46, GC_47, GC_48, GC_84, GC_85, GC_86, GC_87, GC_88, GC_89, GC_90, GC_91, GC_92, GC_93, GC_101, GC_102, GC_103, GC_105, GC_106, GC_107
  1167. 43.31 s gammaloop-nextest-python-api> [2026-09-03 15:34:09.918] @gammaloop_api::se... INFO : Running command set default-runtime kv kinematics.externals='{"type":"constant","data":{"momenta":[[32.0,0.0,0.0,32.0],[32.0,0.0,0.0,-32.0]],"helicities":[1,1]}}'
  1168. 43.31 s gammaloop-nextest-python-api> [2026-09-03 15:34:09.919] @gammaloop_api::se... INFO : Running command set default-runtime kv subtraction.disable_threshold_subtraction=true
  1169. 43.31 s gammaloop-nextest-python-api> [2026-09-03 15:34:09.920] @gammaloop_api::se... INFO : Running command generate xs e+ e- > d d~ g | e- a d g QED^2==4 [{{2}} QCD=0] --numerator-grouping group_identical_graphs_up_to_sign --clear-existing-processes --only-diagrams
  1170. 43.31 s gammaloop-nextest-python-api> [2026-09-03 15:34:09.922] @feyngen::diagram_... INFO : 0s | Δ=0s | Starting Feynman graph generation with Symbolica...
  1171. 43.31 s gammaloop-nextest-python-api> [2026-09-03 15:34:09.924] @feyngen::diagram_... INFO : 0s | Δ=0s | Number of graphs resulting from Symbolica generation: 246
  1172. 43.31 s gammaloop-nextest-python-api> [2026-09-03 15:34:09.925] @feyngen::diagram_... INFO : 0s | Δ=0s | Number of graphs retained after enforcing supergraph particle content: 8
  1173. 43.31 s gammaloop-nextest-python-api> [2026-09-03 15:34:09.925] @feyngen::diagram_... INFO : 0s | Δ=0s | Number of graphs retained after removal of vetoed topologies: 8
  1174. 43.31 s gammaloop-nextest-python-api> [2026-09-03 15:34:09.925] @feyngen::diagram_... INFO : 0s | Δ=0s | Number of graphs after vertex info assignment: 8
  1175. 43.31 s gammaloop-nextest-python-api> [2026-09-03 15:34:09.925] @feyngen::diagram_... INFO : 0s | Δ=0s | Number of graphs after all complete graphs filters are applied: 8
  1176. 43.31 s gammaloop-nextest-python-api>
  1177. 43.31 s gammaloop-nextest-python-api>
  1178. 43.31 s gammaloop-nextest-python-api> Location:
  1179. 43.31 s gammaloop-nextest-python-api> tests/tests/test_python_api.rs:156:20
  1180. 43.31 s gammaloop-nextest-python-api> system-out
  1181. 43.31 s gammaloop-nextest-python-api> running 1 test
  1182. 43.31 s gammaloop-nextest-python-api> test python_evaluate_sample_preserves_graph_grouping_and_incoming_pdgs ... FAILED
  1183. 43.31 s gammaloop-nextest-python-api>
  1184. 43.31 s gammaloop-nextest-python-api> failures:
  1185. 43.31 s gammaloop-nextest-python-api>
  1186. 43.31 s gammaloop-nextest-python-api> failures:
  1187. 43.31 s gammaloop-nextest-python-api> python_evaluate_sample_preserves_graph_grouping_and_incoming_pdgs
  1188. 43.31 s gammaloop-nextest-python-api>
  1189. 43.31 s gammaloop-nextest-python-api> test result: FAILED. 0 passed; 1 failed; 0 ignored; 0 measured; 4 filtered out; finished in 0.18s
  1190. 43.31 s gammaloop-nextest-python-api> system-err
  1191. 43.31 s gammaloop-nextest-python-api> Error: Python API test subprocess failed.
  1192. 43.31 s gammaloop-nextest-python-api> stdout:
  1193. 43.31 s gammaloop-nextest-python-api> ┌────────────────────────────────────────────────────────┐
  1194. 43.31 s gammaloop-nextest-python-api> │ You are running a restricted Symbolica instance. │
  1195. 43.31 s gammaloop-nextest-python-api> │ │
  1196. 43.31 s gammaloop-nextest-python-api> │ This mode is only permitted for non-commercial use and │
  1197. 43.31 s gammaloop-nextest-python-api> │ is limited to one instance and core per machine. │
  1198. 43.31 s gammaloop-nextest-python-api> │ │
  1199. 43.31 s gammaloop-nextest-python-api> │ Hobbyists can easily acquire a free license key │
  1200. 43.31 s gammaloop-nextest-python-api> │ that unlocks all cores and removes this banner: │
  1201. 43.31 s gammaloop-nextest-python-api> │ │
  1202. 43.31 s gammaloop-nextest-python-api> │ from symbolica import * │
  1203. 43.31 s gammaloop-nextest-python-api> │ request_hobbyist_license('YOUR_NAME', 'YOUR_EMAIL') │
  1204. 43.31 s gammaloop-nextest-python-api> │ │
  1205. 43.31 s gammaloop-nextest-python-api> │ All other users can obtain a free 30-day trial key: │
  1206. 43.31 s gammaloop-nextest-python-api> │ │
  1207. 43.31 s gammaloop-nextest-python-api> │ from symbolica import * │
  1208. 43.31 s gammaloop-nextest-python-api> │ request_trial_license('NAME', 'EMAIL', 'EMPLOYER') │
  1209. 43.31 s gammaloop-nextest-python-api> │ │
  1210. 43.31 s gammaloop-nextest-python-api> │ See https://symbolica.io/docs/get_started.html#license │
  1211. 43.31 s gammaloop-nextest-python-api> └────────────────────────────────────────────────────────┘
  1212. 43.31 s gammaloop-nextest-python-api> ┌───────────────────────────────────────────────────────────────────────────────────────────────────────────┐
  1213. 43.31 s gammaloop-nextest-python-api> │ Cannot start new unlicensed Symbolica instance since there is already another one running on the machine. │
  1214. 43.31 s gammaloop-nextest-python-api> └───────────────────────────────────────────────────────────────────────────────────────────────────────────┘
  1215. 43.31 s gammaloop-nextest-python-api>
  1216. 43.31 s gammaloop-nextest-python-api> stderr:
  1217. 43.31 s gammaloop-nextest-python-api>
  1218. 43.31 s gammaloop-nextest-python-api> ┌───────────────────────────────────────────────────────────┐
  1219. 43.31 s gammaloop-nextest-python-api> │ Could not resolve the IP of the Symbolica license server. │
  1220. 43.31 s gammaloop-nextest-python-api> │ │
  1221. 43.31 s gammaloop-nextest-python-api> │ Please check your DNS configuration. │
  1222. 43.31 s gammaloop-nextest-python-api> └───────────────────────────────────────────────────────────┘
  1223. 43.31 s gammaloop-nextest-python-api> Error: failed to lookup address information: Temporary failure in name resolution
  1224. 43.31 s gammaloop-nextest-python-api> [2026-09-03 15:34:09.885] @gammaloop_api::se... INFO : Running command import model sm-default
  1225. 43.31 s gammaloop-nextest-python-api> [2026-09-03 15:34:09.885] @import::model INFO : Loading built-in JSON model sm-default
  1226. 43.31 s gammaloop-nextest-python-api> [2026-09-03 15:34:09.918] @gammalooprs::model INFO : The following 11 external parameters were forced to zero by the restriction card:
  1227. 43.31 s gammaloop-nextest-python-api> lamWS, AWS, rhoWS, etaWS, ymc, yme, ymm, MC, Me, MM, WTau
  1228. 43.31 s gammaloop-nextest-python-api> [2026-09-03 15:34:09.918] @gammalooprs::model INFO : The following 34 vertex rules were removed by the restriction card:
  1229. 43.31 s gammaloop-nextest-python-api> V_82 -> (c~, d, G+) | V_83 -> (t~, d, G+) | V_84 -> (c~, s, G+) | V_85 -> (t~, s, G+) | V_86 -> (u~, b, G+) | V_87 -> (c~, b, G+) | V_90 -> (c~, d, W+) | V_91 -> (t~, d, W+) | V_92 -> (u~, s, W+) | V_94 -> (t~, s, W+) | V_95 -> (u~, b, W+) | V_96 -> (c~, b, W+) | V_101 -> (e+, e-, G0) | V_102 -> (mu+, mu-, G0) | V_104 -> (e+, e-, H) | V_105 -> (mu+, mu-, H) | V_110 -> (ve~, e-, G+) | V_111 -> (vm~, mu-, G+) | V_116 -> (b~, u, G-) | V_117 -> (d~, c, G-) | V_118 -> (s~, c, G-) | V_119 -> (b~, c, G-) | V_120 -> (d~, t, G-) | V_121 -> (s~, t, G-) | V_124 -> (s~, u, W-) | V_125 -> (b~, u, W-) | V_126 -> (d~, c, W-) | V_128 -> (b~, c, W-) | V_129 -> (d~, t, W-) | V_130 -> (s~, t, W-) | V_138 -> (c~, c, G0) | V_140 -> (c~, c, H) | V_145 -> (e+, ve, G-) | V_146 -> (mu+, vm, G-)
  1230. 43.31 s gammaloop-nextest-python-api> [2026-09-03 15:34:09.918] @gammalooprs::model INFO : The following 36 couplings were removed by the restriction card:
  1231. 43.31 s gammaloop-nextest-python-api> GC_13, GC_14, GC_16, GC_17, GC_18, GC_19, GC_20, GC_22, GC_23, GC_24, GC_25, GC_26, GC_28, GC_29, GC_42, GC_43, GC_44, GC_46, GC_47, GC_48, GC_84, GC_85, GC_86, GC_87, GC_88, GC_89, GC_90, GC_91, GC_92, GC_93, GC_101, GC_102, GC_103, GC_105, GC_106, GC_107
  1232. 43.31 s gammaloop-nextest-python-api> [2026-09-03 15:34:09.918] @gammaloop_api::se... INFO : Running command set default-runtime kv kinematics.externals='{"type":"constant","data":{"momenta":[[32.0,0.0,0.0,32.0],[32.0,0.0,0.0,-32.0]],"helicities":[1,1]}}'
  1233. 43.31 s gammaloop-nextest-python-api> [2026-09-03 15:34:09.919] @gammaloop_api::se... INFO : Running command set default-runtime kv subtraction.disable_threshold_subtraction=true
  1234. 43.31 s gammaloop-nextest-python-api> [2026-09-03 15:34:09.920] @gammaloop_api::se... INFO : Running command generate xs e+ e- > d d~ g | e- a d g QED^2==4 [{{2}} QCD=0] --numerator-grouping group_identical_graphs_up_to_sign --clear-existing-processes --only-diagrams
  1235. 43.31 s gammaloop-nextest-python-api> [2026-09-03 15:34:09.922] @feyngen::diagram_... INFO : 0s | Δ=0s | Starting Feynman graph generation with Symbolica...
  1236. 43.31 s gammaloop-nextest-python-api> [2026-09-03 15:34:09.924] @feyngen::diagram_... INFO : 0s | Δ=0s | Number of graphs resulting from Symbolica generation: 246
  1237. 43.31 s gammaloop-nextest-python-api> [2026-09-03 15:34:09.925] @feyngen::diagram_... INFO : 0s | Δ=0s | Number of graphs retained after enforcing supergraph particle content: 8
  1238. 43.31 s gammaloop-nextest-python-api> [2026-09-03 15:34:09.925] @feyngen::diagram_... INFO : 0s | Δ=0s | Number of graphs retained after removal of vetoed topologies: 8
  1239. 43.31 s gammaloop-nextest-python-api> [2026-09-03 15:34:09.925] @feyngen::diagram_... INFO : 0s | Δ=0s | Number of graphs after vertex info assignment: 8
  1240. 43.31 s gammaloop-nextest-python-api> [2026-09-03 15:34:09.925] @feyngen::diagram_... INFO : 0s | Δ=0s | Number of graphs after all complete graphs filters are applied: 8
  1241. 43.31 s gammaloop-nextest-python-api>
  1242. 43.31 s gammaloop-nextest-python-api>
  1243. 43.31 s gammaloop-nextest-python-api> Location:
  1244. 43.31 s gammaloop-nextest-python-api> tests/tests/test_python_api.rs:156:20
  1245. 43.31 s gammaloop-nextest-python-api>
  1246. 43.31 s gammaloop-nextest-python-api> 5. gammaloop-integration-tests::test_python_api::python_settings_wrappers_expose_nested_runtime_and_global_settings
  1247. 43.31 s gammaloop-nextest-python-api> failure: test failure with exit code 101
  1248. 43.31 s gammaloop-nextest-python-api> Error: Python API test subprocess failed.
  1249. 43.31 s gammaloop-nextest-python-api> stdout:
  1250. 43.31 s gammaloop-nextest-python-api> ┌────────────────────────────────────────────────────────┐
  1251. 43.31 s gammaloop-nextest-python-api> │ You are running a restricted Symbolica instance. │
  1252. 43.31 s gammaloop-nextest-python-api> │ │
  1253. 43.31 s gammaloop-nextest-python-api> │ This mode is only permitted for non-commercial use and │
  1254. 43.31 s gammaloop-nextest-python-api> │ is limited to one instance and core per machine. │
  1255. 43.31 s gammaloop-nextest-python-api> │ │
  1256. 43.31 s gammaloop-nextest-python-api> │ Hobbyists can easily acquire a free license key │
  1257. 43.31 s gammaloop-nextest-python-api> │ that unlocks all cores and removes this banner: │
  1258. 43.31 s gammaloop-nextest-python-api> │ │
  1259. 43.31 s gammaloop-nextest-python-api> │ from symbolica import * │
  1260. 43.31 s gammaloop-nextest-python-api> │ request_hobbyist_license('YOUR_NAME', 'YOUR_EMAIL') │
  1261. 43.31 s gammaloop-nextest-python-api> │ │
  1262. 43.31 s gammaloop-nextest-python-api> │ All other users can obtain a free 30-day trial key: │
  1263. 43.31 s gammaloop-nextest-python-api> │ │
  1264. 43.31 s gammaloop-nextest-python-api> │ from symbolica import * │
  1265. 43.31 s gammaloop-nextest-python-api> │ request_trial_license('NAME', 'EMAIL', 'EMPLOYER') │
  1266. 43.31 s gammaloop-nextest-python-api> │ │
  1267. 43.31 s gammaloop-nextest-python-api> │ See https://symbolica.io/docs/get_started.html#license │
  1268. 43.31 s gammaloop-nextest-python-api> └────────────────────────────────────────────────────────┘
  1269. 43.31 s gammaloop-nextest-python-api> ┌───────────────────────────────────────────────────────────────────────────────────────────────────────────┐
  1270. 43.31 s gammaloop-nextest-python-api> │ Cannot start new unlicensed Symbolica instance since there is already another one running on the machine. │
  1271. 43.31 s gammaloop-nextest-python-api> └───────────────────────────────────────────────────────────────────────────────────────────────────────────┘
  1272. 43.31 s gammaloop-nextest-python-api>
  1273. 43.31 s gammaloop-nextest-python-api> stderr:
  1274. 43.31 s gammaloop-nextest-python-api>
  1275. 43.31 s gammaloop-nextest-python-api> ┌───────────────────────────────────────────────────────────┐
  1276. 43.31 s gammaloop-nextest-python-api> │ Could not resolve the IP of the Symbolica license server. │
  1277. 43.31 s gammaloop-nextest-python-api> │ │
  1278. 43.31 s gammaloop-nextest-python-api> │ Please check your DNS configuration. │
  1279. 43.31 s gammaloop-nextest-python-api> └───────────────────────────────────────────────────────────┘
  1280. 43.31 s gammaloop-nextest-python-api> Error: failed to lookup address information: Temporary failure in name resolution
  1281. 43.31 s gammaloop-nextest-python-api>
  1282. 43.31 s gammaloop-nextest-python-api>
  1283. 43.31 s gammaloop-nextest-python-api> Location:
  1284. 43.31 s gammaloop-nextest-python-api> tests/tests/test_python_api.rs:156:20
  1285. 43.31 s gammaloop-nextest-python-api> system-out
  1286. 43.31 s gammaloop-nextest-python-api> running 1 test
  1287. 43.31 s gammaloop-nextest-python-api> test python_settings_wrappers_expose_nested_runtime_and_global_settings ... FAILED
  1288. 43.31 s gammaloop-nextest-python-api>
  1289. 43.31 s gammaloop-nextest-python-api> failures:
  1290. 43.31 s gammaloop-nextest-python-api>
  1291. 43.31 s gammaloop-nextest-python-api> failures:
  1292. 43.31 s gammaloop-nextest-python-api> python_settings_wrappers_expose_nested_runtime_and_global_settings
  1293. 43.31 s gammaloop-nextest-python-api>
  1294. 43.31 s gammaloop-nextest-python-api> test result: FAILED. 0 passed; 1 failed; 0 ignored; 0 measured; 4 filtered out; finished in 0.18s
  1295. 43.31 s gammaloop-nextest-python-api> system-err
  1296. 43.31 s gammaloop-nextest-python-api> Error: Python API test subprocess failed.
  1297. 43.31 s gammaloop-nextest-python-api> stdout:
  1298. 43.31 s gammaloop-nextest-python-api> ┌────────────────────────────────────────────────────────┐
  1299. 43.31 s gammaloop-nextest-python-api> │ You are running a restricted Symbolica instance. │
  1300. 43.31 s gammaloop-nextest-python-api> │ │
  1301. 43.31 s gammaloop-nextest-python-api> │ This mode is only permitted for non-commercial use and │
  1302. 43.31 s gammaloop-nextest-python-api> │ is limited to one instance and core per machine. │
  1303. 43.31 s gammaloop-nextest-python-api> │ │
  1304. 43.31 s gammaloop-nextest-python-api> │ Hobbyists can easily acquire a free license key │
  1305. 43.31 s gammaloop-nextest-python-api> │ that unlocks all cores and removes this banner: │
  1306. 43.31 s gammaloop-nextest-python-api> │ │
  1307. 43.31 s gammaloop-nextest-python-api> │ from symbolica import * │
  1308. 43.31 s gammaloop-nextest-python-api> │ request_hobbyist_license('YOUR_NAME', 'YOUR_EMAIL') │
  1309. 43.31 s gammaloop-nextest-python-api> │ │
  1310. 43.31 s gammaloop-nextest-python-api> │ All other users can obtain a free 30-day trial key: │
  1311. 43.31 s gammaloop-nextest-python-api> │ │
  1312. 43.31 s gammaloop-nextest-python-api> │ from symbolica import * │
  1313. 43.31 s gammaloop-nextest-python-api> │ request_trial_license('NAME', 'EMAIL', 'EMPLOYER') │
  1314. 43.31 s gammaloop-nextest-python-api> │ │
  1315. 43.31 s gammaloop-nextest-python-api> │ See https://symbolica.io/docs/get_started.html#license │
  1316. 43.31 s gammaloop-nextest-python-api> └────────────────────────────────────────────────────────┘
  1317. 43.31 s gammaloop-nextest-python-api> ┌───────────────────────────────────────────────────────────────────────────────────────────────────────────┐
  1318. 43.31 s gammaloop-nextest-python-api> │ Cannot start new unlicensed Symbolica instance since there is already another one running on the machine. │
  1319. 43.31 s gammaloop-nextest-python-api> └───────────────────────────────────────────────────────────────────────────────────────────────────────────┘
  1320. 43.31 s gammaloop-nextest-python-api>
  1321. 43.31 s gammaloop-nextest-python-api> stderr:
  1322. 43.31 s gammaloop-nextest-python-api>
  1323. 43.31 s gammaloop-nextest-python-api> ┌───────────────────────────────────────────────────────────┐
  1324. 43.31 s gammaloop-nextest-python-api> │ Could not resolve the IP of the Symbolica license server. │
  1325. 43.31 s gammaloop-nextest-python-api> │ │
  1326. 43.31 s gammaloop-nextest-python-api> │ Please check your DNS configuration. │
  1327. 43.31 s gammaloop-nextest-python-api> └───────────────────────────────────────────────────────────┘
  1328. 43.31 s gammaloop-nextest-python-api> Error: failed to lookup address information: Temporary failure in name resolution
  1329. 43.31 s gammaloop-nextest-python-api>
  1330. 43.31 s gammaloop-nextest-python-api>
  1331. 43.31 s gammaloop-nextest-python-api> Location:
  1332. 43.31 s gammaloop-nextest-python-api> tests/tests/test_python_api.rs:156:20
  1333. 43.31 s gammaloop-nextest-python-api> =========================================
  1334. 43.39 s error: Cannot build '/nix/store/92rfrz53xqdm3bwmdf3dq8zbdzxy8f7a-gammaloop-nextest-python-api.drv'.
  1335. 43.39 s Reason: builder failed with exit code 100.
  1336. 43.39 s Output paths:
  1337. 43.39 s /nix/store/w3fd1akvf23gm7zw29z27n42xvm2dm2l-gammaloop-nextest-python-api
  1338. 43.39 s Last 1041 log lines:
  1339. 43.39 s > Extracting 3 binaries (including 2 non-test binaries), 1 build script output directory, and 3 linked paths to /build/nextest-archive-8zvA0E
  1340. 43.39 s > Extracted 22 files to /build/nextest-archive-8zvA0E in 0.22s
  1341. 43.39 s > ------------
  1342. 43.39 s > Nextest run ID 4c692186-877a-41ee-81bd-2e8a3e11660c with nextest profile: ci_gammaloop
  1343. 43.39 s > Starting 5 tests across 1 binary
  1344. 43.39 s > FAIL [ 0.116s] (1/5) gammaloop-integration-tests::test_python_api python_session_getters_return_live_toml_and_command_blocks
  1345. 43.39 s > stdout ---
  1346. 43.39 s >
  1347. 43.39 s > running 1 test
  1348. 43.39 s > test python_session_getters_return_live_toml_and_command_blocks ... FAILED
  1349. 43.39 s >
  1350. 43.39 s > failures:
  1351. 43.39 s >
  1352. 43.39 s > failures:
  1353. 43.39 s > python_session_getters_return_live_toml_and_command_blocks
  1354. 43.39 s >
  1355. 43.39 s > test result: FAILED. 0 passed; 1 failed; 0 ignored; 0 measured; 4 filtered out; finished in 0.11s
  1356. 43.39 s >
  1357. 43.39 s > stderr ---
  1358. 43.39 s > Error: Python API test subprocess failed.
  1359. 43.39 s > stdout:
  1360. 43.39 s > ┌────────────────────────────────────────────────────────┐
  1361. 43.39 s > │ You are running a restricted Symbolica instance. │
  1362. 43.39 s > │ │
  1363. 43.39 s > │ This mode is only permitted for non-commercial use and │
  1364. 43.39 s > │ is limited to one instance and core per machine. │
  1365. 43.39 s > │ │
  1366. 43.39 s > │ Hobbyists can easily acquire a free license key │
  1367. 43.39 s > │ that unlocks all cores and removes this banner: │
  1368. 43.39 s > │ │
  1369. 43.39 s > │ from symbolica import * │
  1370. 43.39 s > │ request_hobbyist_license('YOUR_NAME', 'YOUR_EMAIL') │
  1371. 43.39 s > │ │
  1372. 43.39 s > │ All other users can obtain a free 30-day trial key: │
  1373. 43.39 s > │ │
  1374. 43.39 s > │ from symbolica import * │
  1375. 43.39 s > │ request_trial_license('NAME', 'EMAIL', 'EMPLOYER') │
  1376. 43.39 s > │ │
  1377. 43.39 s > │ See https://symbolica.io/docs/get_started.html#license │
  1378. 43.39 s > └────────────────────────────────────────────────────────┘
  1379. 43.39 s > ┌───────────────────────────────────────────────────────────────────────────────────────────────────────────┐
  1380. 43.39 s > │ Cannot start new unlicensed Symbolica instance since there is already another one running on the machine. │
  1381. 43.39 s > └───────────────────────────────────────────────────────────────────────────────────────────────────────────┘
  1382. 43.39 s >
  1383. 43.39 s > stderr:
  1384. 43.39 s >
  1385. 43.39 s > ┌───────────────────────────────────────────────────────────┐
  1386. 43.39 s > │ Could not resolve the IP of the Symbolica license server. │
  1387. 43.39 s > │ │
  1388. 43.39 s > │ Please check your DNS configuration. │
  1389. 43.39 s > └───────────────────────────────────────────────────────────┘
  1390. 43.39 s > Error: failed to lookup address information: Temporary failure in name resolution
  1391. 43.39 s >
  1392. 43.39 s >
  1393. 43.39 s > Location:
  1394. 43.39 s > tests/tests/test_python_api.rs:156:20
  1395. 43.39 s >
  1396. 43.39 s > FAIL [ 0.118s] (2/5) gammaloop-integration-tests::test_python_api python_evaluate_sample_honors_generate_events_and_observable_snapshots
  1397. 43.39 s > stdout ---
  1398. 43.39 s >
  1399. 43.39 s > running 1 test
  1400. 43.39 s > test python_evaluate_sample_honors_generate_events_and_observable_snapshots ... FAILED
  1401. 43.39 s >
  1402. 43.39 s > failures:
  1403. 43.39 s >
  1404. 43.39 s > failures:
  1405. 43.39 s > python_evaluate_sample_honors_generate_events_and_observable_snapshots
  1406. 43.39 s >
  1407. 43.39 s > test result: FAILED. 0 passed; 1 failed; 0 ignored; 0 measured; 4 filtered out; finished in 0.11s
  1408. 43.39 s >
  1409. 43.39 s > stderr ---
  1410. 43.39 s > Error: Python API test subprocess failed.
  1411. 43.39 s > stdout:
  1412. 43.39 s > ┌────────────────────────────────────────────────────────┐
  1413. 43.39 s > │ You are running a restricted Symbolica instance. │
  1414. 43.39 s > │ │
  1415. 43.39 s > │ This mode is only permitted for non-commercial use and │
  1416. 43.39 s > │ is limited to one instance and core per machine. │
  1417. 43.39 s > │ │
  1418. 43.39 s > │ Hobbyists can easily acquire a free license key │
  1419. 43.39 s > │ that unlocks all cores and removes this banner: │
  1420. 43.39 s > │ │
  1421. 43.39 s > │ from symbolica import * │
  1422. 43.39 s > │ request_hobbyist_license('YOUR_NAME', 'YOUR_EMAIL') │
  1423. 43.39 s > │ │
  1424. 43.39 s > │ All other users can obtain a free 30-day trial key: │
  1425. 43.39 s > │ │
  1426. 43.39 s > │ from symbolica import * │
  1427. 43.39 s > │ request_trial_license('NAME', 'EMAIL', 'EMPLOYER') │
  1428. 43.39 s > │ │
  1429. 43.39 s > │ See https://symbolica.io/docs/get_started.html#license │
  1430. 43.39 s > └────────────────────────────────────────────────────────┘
  1431. 43.39 s > ┌───────────────────────────────────────────────────────────────────────────────────────────────────────────┐
  1432. 43.39 s > │ Cannot start new unlicensed Symbolica instance since there is already another one running on the machine. │
  1433. 43.39 s > └───────────────────────────────────────────────────────────────────────────────────────────────────────────┘
  1434. 43.39 s >
  1435. 43.39 s > stderr:
  1436. 43.39 s >
  1437. 43.39 s > ┌───────────────────────────────────────────────────────────┐
  1438. 43.39 s > │ Could not resolve the IP of the Symbolica license server. │
  1439. 43.39 s > │ │
  1440. 43.39 s > │ Please check your DNS configuration. │
  1441. 43.39 s > └───────────────────────────────────────────────────────────┘
  1442. 43.39 s > Error: failed to lookup address information: Temporary failure in name resolution
  1443. 43.39 s >
  1444. 43.39 s >
  1445. 43.39 s > Location:
  1446. 43.39 s > tests/tests/test_python_api.rs:156:20
  1447. 43.39 s >
  1448. 43.39 s > FAIL [ 0.118s] (3/5) gammaloop-integration-tests::test_python_api python_evaluate_samples_batch_and_momentum_space_have_expected_shape
  1449. 43.39 s > stdout ---
  1450. 43.39 s >
  1451. 43.39 s > running 1 test
  1452. 43.39 s > test python_evaluate_samples_batch_and_momentum_space_have_expected_shape ... FAILED
  1453. 43.39 s >
  1454. 43.39 s > failures:
  1455. 43.39 s >
  1456. 43.39 s > failures:
  1457. 43.39 s > python_evaluate_samples_batch_and_momentum_space_have_expected_shape
  1458. 43.39 s >
  1459. 43.39 s > test result: FAILED. 0 passed; 1 failed; 0 ignored; 0 measured; 4 filtered out; finished in 0.11s
  1460. 43.39 s >
  1461. 43.39 s > stderr ---
  1462. 43.39 s > Error: Python API test subprocess failed.
  1463. 43.39 s > stdout:
  1464. 43.39 s > ┌────────────────────────────────────────────────────────┐
  1465. 43.39 s > │ You are running a restricted Symbolica instance. │
  1466. 43.39 s > │ │
  1467. 43.39 s > │ This mode is only permitted for non-commercial use and │
  1468. 43.39 s > │ is limited to one instance and core per machine. │
  1469. 43.39 s > │ │
  1470. 43.39 s > │ Hobbyists can easily acquire a free license key │
  1471. 43.39 s > │ that unlocks all cores and removes this banner: │
  1472. 43.39 s > │ │
  1473. 43.39 s > │ from symbolica import * │
  1474. 43.39 s > │ request_hobbyist_license('YOUR_NAME', 'YOUR_EMAIL') │
  1475. 43.39 s > │ │
  1476. 43.39 s > │ All other users can obtain a free 30-day trial key: │
  1477. 43.39 s > │ │
  1478. 43.39 s > │ from symbolica import * │
  1479. 43.39 s > │ request_trial_license('NAME', 'EMAIL', 'EMPLOYER') │
  1480. 43.39 s > │ │
  1481. 43.39 s > │ See https://symbolica.io/docs/get_started.html#license │
  1482. 43.39 s > └────────────────────────────────────────────────────────┘
  1483. 43.39 s > ┌───────────────────────────────────────────────────────────────────────────────────────────────────────────┐
  1484. 43.39 s > │ Cannot start new unlicensed Symbolica instance since there is already another one running on the machine. │
  1485. 43.39 s > └───────────────────────────────────────────────────────────────────────────────────────────────────────────┘
  1486. 43.39 s >
  1487. 43.39 s > stderr:
  1488. 43.39 s >
  1489. 43.39 s > ┌───────────────────────────────────────────────────────────┐
  1490. 43.39 s > │ Could not resolve the IP of the Symbolica license server. │
  1491. 43.39 s > │ │
  1492. 43.39 s > │ Please check your DNS configuration. │
  1493. 43.39 s > └───────────────────────────────────────────────────────────┘
  1494. 43.39 s > Error: failed to lookup address information: Temporary failure in name resolution
  1495. 43.39 s >
  1496. 43.39 s >
  1497. 43.39 s > Location:
  1498. 43.39 s > tests/tests/test_python_api.rs:156:20
  1499. 43.39 s >
  1500. 43.39 s > FAIL [ 0.182s] (4/5) gammaloop-integration-tests::test_python_api python_evaluate_sample_preserves_graph_grouping_and_incoming_pdgs
  1501. 43.39 s > stdout ---
  1502. 43.39 s >
  1503. 43.39 s > running 1 test
  1504. 43.39 s > test python_evaluate_sample_preserves_graph_grouping_and_incoming_pdgs ... FAILED
  1505. 43.39 s >
  1506. 43.39 s > failures:
  1507. 43.39 s >
  1508. 43.39 s > failures:
  1509. 43.39 s > python_evaluate_sample_preserves_graph_grouping_and_incoming_pdgs
  1510. 43.39 s >
  1511. 43.39 s > test result: FAILED. 0 passed; 1 failed; 0 ignored; 0 measured; 4 filtered out; finished in 0.18s
  1512. 43.39 s >
  1513. 43.39 s > stderr ---
  1514. 43.39 s > Error: Python API test subprocess failed.
  1515. 43.39 s > stdout:
  1516. 43.39 s > ┌────────────────────────────────────────────────────────┐
  1517. 43.39 s > │ You are running a restricted Symbolica instance. │
  1518. 43.39 s > │ │
  1519. 43.39 s > │ This mode is only permitted for non-commercial use and │
  1520. 43.39 s > │ is limited to one instance and core per machine. │
  1521. 43.39 s > │ │
  1522. 43.39 s > │ Hobbyists can easily acquire a free license key │
  1523. 43.39 s > │ that unlocks all cores and removes this banner: │
  1524. 43.39 s > │ │
  1525. 43.39 s > │ from symbolica import * │
  1526. 43.39 s > │ request_hobbyist_license('YOUR_NAME', 'YOUR_EMAIL') │
  1527. 43.39 s > │ │
  1528. 43.39 s > │ All other users can obtain a free 30-day trial key: │
  1529. 43.39 s > │ │
  1530. 43.39 s > │ from symbolica import * │
  1531. 43.39 s > │ request_trial_license('NAME', 'EMAIL', 'EMPLOYER') │
  1532. 43.39 s > │ │
  1533. 43.39 s > │ See https://symbolica.io/docs/get_started.html#license │
  1534. 43.39 s > └────────────────────────────────────────────────────────┘
  1535. 43.39 s > ┌───────────────────────────────────────────────────────────────────────────────────────────────────────────┐
  1536. 43.39 s > │ Cannot start new unlicensed Symbolica instance since there is already another one running on the machine. │
  1537. 43.39 s > └───────────────────────────────────────────────────────────────────────────────────────────────────────────┘
  1538. 43.39 s >
  1539. 43.39 s > stderr:
  1540. 43.39 s >
  1541. 43.39 s > ┌───────────────────────────────────────────────────────────┐
  1542. 43.39 s > │ Could not resolve the IP of the Symbolica license server. │
  1543. 43.39 s > │ │
  1544. 43.39 s > │ Please check your DNS configuration. │
  1545. 43.39 s > └───────────────────────────────────────────────────────────┘
  1546. 43.39 s > Error: failed to lookup address information: Temporary failure in name resolution
  1547. 43.39 s > [2026-09-03 15:34:09.885] @gammaloop_api::se... INFO : Running command import model sm-default
  1548. 43.39 s > [2026-09-03 15:34:09.885] @import::model INFO : Loading built-in JSON model sm-default
  1549. 43.39 s > [2026-09-03 15:34:09.918] @gammalooprs::model INFO : The following 11 external parameters were forced to zero by the restriction card:
  1550. 43.39 s > lamWS, AWS, rhoWS, etaWS, ymc, yme, ymm, MC, Me, MM, WTau
  1551. 43.39 s > [2026-09-03 15:34:09.918] @gammalooprs::model INFO : The following 34 vertex rules were removed by the restriction card:
  1552. 43.39 s > V_82 -> (c~, d, G+) | V_83 -> (t~, d, G+) | V_84 -> (c~, s, G+) | V_85 -> (t~, s, G+) | V_86 -> (u~, b, G+) | V_87 -> (c~, b, G+) | V_90 -> (c~, d, W+) | V_91 -> (t~, d, W+) | V_92 -> (u~, s, W+) | V_94 -> (t~, s, W+) | V_95 -> (u~, b, W+) | V_96 -> (c~, b, W+) | V_101 -> (e+, e-, G0) | V_102 -> (mu+, mu-, G0) | V_104 -> (e+, e-, H) | V_105 -> (mu+, mu-, H) | V_110 -> (ve~, e-, G+) | V_111 -> (vm~, mu-, G+) | V_116 -> (b~, u, G-) | V_117 -> (d~, c, G-) | V_118 -> (s~, c, G-) | V_119 -> (b~, c, G-) | V_120 -> (d~, t, G-) | V_121 -> (s~, t, G-) | V_124 -> (s~, u, W-) | V_125 -> (b~, u, W-) | V_126 -> (d~, c, W-) | V_128 -> (b~, c, W-) | V_129 -> (d~, t, W-) | V_130 -> (s~, t, W-) | V_138 -> (c~, c, G0) | V_140 -> (c~, c, H) | V_145 -> (e+, ve, G-) | V_146 -> (mu+, vm, G-)
  1553. 43.39 s > [2026-09-03 15:34:09.918] @gammalooprs::model INFO : The following 36 couplings were removed by the restriction card:
  1554. 43.39 s > GC_13, GC_14, GC_16, GC_17, GC_18, GC_19, GC_20, GC_22, GC_23, GC_24, GC_25, GC_26, GC_28, GC_29, GC_42, GC_43, GC_44, GC_46, GC_47, GC_48, GC_84, GC_85, GC_86, GC_87, GC_88, GC_89, GC_90, GC_91, GC_92, GC_93, GC_101, GC_102, GC_103, GC_105, GC_106, GC_107
  1555. 43.39 s > [2026-09-03 15:34:09.918] @gammaloop_api::se... INFO : Running command set default-runtime kv kinematics.externals='{"type":"constant","data":{"momenta":[[32.0,0.0,0.0,32.0],[32.0,0.0,0.0,-32.0]],"helicities":[1,1]}}'
  1556. 43.39 s > [2026-09-03 15:34:09.919] @gammaloop_api::se... INFO : Running command set default-runtime kv subtraction.disable_threshold_subtraction=true
  1557. 43.39 s > [2026-09-03 15:34:09.920] @gammaloop_api::se... INFO : Running command generate xs e+ e- > d d~ g | e- a d g QED^2==4 [{{2}} QCD=0] --numerator-grouping group_identical_graphs_up_to_sign --clear-existing-processes --only-diagrams
  1558. 43.39 s > [2026-09-03 15:34:09.922] @feyngen::diagram_... INFO : 0s | Δ=0s | Starting Feynman graph generation with Symbolica...
  1559. 43.39 s > [2026-09-03 15:34:09.924] @feyngen::diagram_... INFO : 0s | Δ=0s | Number of graphs resulting from Symbolica generation: 246
  1560. 43.39 s > [2026-09-03 15:34:09.925] @feyngen::diagram_... INFO : 0s | Δ=0s | Number of graphs retained after enforcing supergraph particle content: 8
  1561. 43.39 s > [2026-09-03 15:34:09.925] @feyngen::diagram_... INFO : 0s | Δ=0s | Number of graphs retained after removal of vetoed topologies: 8
  1562. 43.39 s > [2026-09-03 15:34:09.925] @feyngen::diagram_... INFO : 0s | Δ=0s | Number of graphs after vertex info assignment: 8
  1563. 43.39 s > [2026-09-03 15:34:09.925] @feyngen::diagram_... INFO : 0s | Δ=0s | Number of graphs after all complete graphs filters are applied: 8
  1564. 43.39 s >
  1565. 43.39 s >
  1566. 43.39 s > Location:
  1567. 43.39 s > tests/tests/test_python_api.rs:156:20
  1568. 43.39 s >
  1569. 43.39 s > FAIL [ 0.185s] (5/5) gammaloop-integration-tests::test_python_api python_settings_wrappers_expose_nested_runtime_and_global_settings
  1570. 43.39 s > stdout ---
  1571. 43.39 s >
  1572. 43.39 s > running 1 test
  1573. 43.39 s > test python_settings_wrappers_expose_nested_runtime_and_global_settings ... FAILED
  1574. 43.39 s >
  1575. 43.39 s > failures:
  1576. 43.39 s >
  1577. 43.39 s > failures:
  1578. 43.39 s > python_settings_wrappers_expose_nested_runtime_and_global_settings
  1579. 43.39 s >
  1580. 43.39 s > test result: FAILED. 0 passed; 1 failed; 0 ignored; 0 measured; 4 filtered out; finished in 0.18s
  1581. 43.39 s >
  1582. 43.39 s > stderr ---
  1583. 43.39 s > Error: Python API test subprocess failed.
  1584. 43.39 s > stdout:
  1585. 43.39 s > ┌────────────────────────────────────────────────────────┐
  1586. 43.39 s > │ You are running a restricted Symbolica instance. │
  1587. 43.39 s > │ │
  1588. 43.39 s > │ This mode is only permitted for non-commercial use and │
  1589. 43.39 s > │ is limited to one instance and core per machine. │
  1590. 43.39 s > │ │
  1591. 43.39 s > │ Hobbyists can easily acquire a free license key │
  1592. 43.39 s > │ that unlocks all cores and removes this banner: │
  1593. 43.39 s > │ │
  1594. 43.39 s > │ from symbolica import * │
  1595. 43.39 s > │ request_hobbyist_license('YOUR_NAME', 'YOUR_EMAIL') │
  1596. 43.39 s > │ │
  1597. 43.39 s > │ All other users can obtain a free 30-day trial key: │
  1598. 43.39 s > │ │
  1599. 43.39 s > │ from symbolica import * │
  1600. 43.39 s > │ request_trial_license('NAME', 'EMAIL', 'EMPLOYER') │
  1601. 43.39 s > │ │
  1602. 43.39 s > │ See https://symbolica.io/docs/get_started.html#license │
  1603. 43.39 s > └────────────────────────────────────────────────────────┘
  1604. 43.39 s > ┌───────────────────────────────────────────────────────────────────────────────────────────────────────────┐
  1605. 43.39 s > │ Cannot start new unlicensed Symbolica instance since there is already another one running on the machine. │
  1606. 43.39 s > └───────────────────────────────────────────────────────────────────────────────────────────────────────────┘
  1607. 43.39 s >
  1608. 43.39 s > stderr:
  1609. 43.39 s >
  1610. 43.39 s > ┌───────────────────────────────────────────────────────────┐
  1611. 43.39 s > │ Could not resolve the IP of the Symbolica license server. │
  1612. 43.39 s > │ │
  1613. 43.39 s > │ Please check your DNS configuration. │
  1614. 43.39 s > └───────────────────────────────────────────────────────────┘
  1615. 43.39 s > Error: failed to lookup address information: Temporary failure in name resolution
  1616. 43.39 s >
  1617. 43.39 s >
  1618. 43.39 s > Location:
  1619. 43.39 s > tests/tests/test_python_api.rs:156:20
  1620. 43.39 s >
  1621. 43.39 s > ------------
  1622. 43.39 s > Summary [ 0.186s] 5 tests run: 0 passed, 5 failed, 0 skipped
  1623. 43.39 s > FAIL [ 0.116s] (1/5) gammaloop-integration-tests::test_python_api python_session_getters_return_live_toml_and_command_blocks
  1624. 43.39 s > stdout ---
  1625. 43.39 s >
  1626. 43.39 s > running 1 test
  1627. 43.39 s > test python_session_getters_return_live_toml_and_command_blocks ... FAILED
  1628. 43.39 s >
  1629. 43.39 s > failures:
  1630. 43.39 s >
  1631. 43.39 s > failures:
  1632. 43.39 s > python_session_getters_return_live_toml_and_command_blocks
  1633. 43.39 s >
  1634. 43.39 s > test result: FAILED. 0 passed; 1 failed; 0 ignored; 0 measured; 4 filtered out; finished in 0.11s
  1635. 43.39 s >
  1636. 43.39 s > stderr ---
  1637. 43.39 s > Error: Python API test subprocess failed.
  1638. 43.39 s > stdout:
  1639. 43.39 s > ┌────────────────────────────────────────────────────────┐
  1640. 43.39 s > │ You are running a restricted Symbolica instance. │
  1641. 43.39 s > │ │
  1642. 43.39 s > │ This mode is only permitted for non-commercial use and │
  1643. 43.39 s > │ is limited to one instance and core per machine. │
  1644. 43.39 s > │ │
  1645. 43.39 s > │ Hobbyists can easily acquire a free license key │
  1646. 43.39 s > │ that unlocks all cores and removes this banner: │
  1647. 43.39 s > │ │
  1648. 43.39 s > │ from symbolica import * │
  1649. 43.39 s > │ request_hobbyist_license('YOUR_NAME', 'YOUR_EMAIL') │
  1650. 43.39 s > │ │
  1651. 43.39 s > │ All other users can obtain a free 30-day trial key: │
  1652. 43.39 s > │ │
  1653. 43.39 s > │ from symbolica import * │
  1654. 43.39 s > │ request_trial_license('NAME', 'EMAIL', 'EMPLOYER') │
  1655. 43.39 s > │ │
  1656. 43.39 s > │ See https://symbolica.io/docs/get_started.html#license │
  1657. 43.39 s > └────────────────────────────────────────────────────────┘
  1658. 43.39 s > ┌───────────────────────────────────────────────────────────────────────────────────────────────────────────┐
  1659. 43.39 s > │ Cannot start new unlicensed Symbolica instance since there is already another one running on the machine. │
  1660. 43.39 s > └───────────────────────────────────────────────────────────────────────────────────────────────────────────┘
  1661. 43.39 s >
  1662. 43.39 s > stderr:
  1663. 43.39 s >
  1664. 43.39 s > ┌───────────────────────────────────────────────────────────┐
  1665. 43.39 s > │ Could not resolve the IP of the Symbolica license server. │
  1666. 43.39 s > │ │
  1667. 43.39 s > │ Please check your DNS configuration. │
  1668. 43.39 s > └───────────────────────────────────────────────────────────┘
  1669. 43.39 s > Error: failed to lookup address information: Temporary failure in name resolution
  1670. 43.39 s >
  1671. 43.39 s >
  1672. 43.39 s > Location:
  1673. 43.39 s > tests/tests/test_python_api.rs:156:20
  1674. 43.39 s >
  1675. 43.39 s > FAIL [ 0.118s] (2/5) gammaloop-integration-tests::test_python_api python_evaluate_sample_honors_generate_events_and_observable_snapshots
  1676. 43.39 s > stdout ---
  1677. 43.39 s >
  1678. 43.39 s > running 1 test
  1679. 43.39 s > test python_evaluate_sample_honors_generate_events_and_observable_snapshots ... FAILED
  1680. 43.39 s >
  1681. 43.39 s > failures:
  1682. 43.39 s >
  1683. 43.39 s > failures:
  1684. 43.39 s > python_evaluate_sample_honors_generate_events_and_observable_snapshots
  1685. 43.39 s >
  1686. 43.39 s > test result: FAILED. 0 passed; 1 failed; 0 ignored; 0 measured; 4 filtered out; finished in 0.11s
  1687. 43.39 s >
  1688. 43.39 s > stderr ---
  1689. 43.39 s > Error: Python API test subprocess failed.
  1690. 43.39 s > stdout:
  1691. 43.39 s > ┌────────────────────────────────────────────────────────┐
  1692. 43.39 s > │ You are running a restricted Symbolica instance. │
  1693. 43.39 s > │ │
  1694. 43.39 s > │ This mode is only permitted for non-commercial use and │
  1695. 43.39 s > │ is limited to one instance and core per machine. │
  1696. 43.39 s > │ │
  1697. 43.39 s > │ Hobbyists can easily acquire a free license key │
  1698. 43.39 s > │ that unlocks all cores and removes this banner: │
  1699. 43.39 s > │ │
  1700. 43.39 s > │ from symbolica import * │
  1701. 43.39 s > │ request_hobbyist_license('YOUR_NAME', 'YOUR_EMAIL') │
  1702. 43.39 s > │ │
  1703. 43.39 s > │ All other users can obtain a free 30-day trial key: │
  1704. 43.39 s > │ │
  1705. 43.39 s > │ from symbolica import * │
  1706. 43.39 s > │ request_trial_license('NAME', 'EMAIL', 'EMPLOYER') │
  1707. 43.39 s > │ │
  1708. 43.39 s > │ See https://symbolica.io/docs/get_started.html#license │
  1709. 43.39 s > └────────────────────────────────────────────────────────┘
  1710. 43.39 s > ┌───────────────────────────────────────────────────────────────────────────────────────────────────────────┐
  1711. 43.39 s > │ Cannot start new unlicensed Symbolica instance since there is already another one running on the machine. │
  1712. 43.39 s > └───────────────────────────────────────────────────────────────────────────────────────────────────────────┘
  1713. 43.39 s >
  1714. 43.39 s > stderr:
  1715. 43.39 s >
  1716. 43.39 s > ┌───────────────────────────────────────────────────────────┐
  1717. 43.39 s > │ Could not resolve the IP of the Symbolica license server. │
  1718. 43.39 s > │ │
  1719. 43.39 s > │ Please check your DNS configuration. │
  1720. 43.39 s > └───────────────────────────────────────────────────────────┘
  1721. 43.39 s > Error: failed to lookup address information: Temporary failure in name resolution
  1722. 43.39 s >
  1723. 43.39 s >
  1724. 43.39 s > Location:
  1725. 43.39 s > tests/tests/test_python_api.rs:156:20
  1726. 43.39 s >
  1727. 43.39 s > FAIL [ 0.118s] (3/5) gammaloop-integration-tests::test_python_api python_evaluate_samples_batch_and_momentum_space_have_expected_shape
  1728. 43.39 s > stdout ---
  1729. 43.39 s >
  1730. 43.39 s > running 1 test
  1731. 43.39 s > test python_evaluate_samples_batch_and_momentum_space_have_expected_shape ... FAILED
  1732. 43.39 s >
  1733. 43.39 s > failures:
  1734. 43.39 s >
  1735. 43.39 s > failures:
  1736. 43.39 s > python_evaluate_samples_batch_and_momentum_space_have_expected_shape
  1737. 43.39 s >
  1738. 43.39 s > test result: FAILED. 0 passed; 1 failed; 0 ignored; 0 measured; 4 filtered out; finished in 0.11s
  1739. 43.39 s >
  1740. 43.39 s > stderr ---
  1741. 43.39 s > Error: Python API test subprocess failed.
  1742. 43.39 s > stdout:
  1743. 43.39 s > ┌────────────────────────────────────────────────────────┐
  1744. 43.39 s > │ You are running a restricted Symbolica instance. │
  1745. 43.39 s > │ │
  1746. 43.39 s > │ This mode is only permitted for non-commercial use and │
  1747. 43.39 s > │ is limited to one instance and core per machine. │
  1748. 43.39 s > │ │
  1749. 43.39 s > │ Hobbyists can easily acquire a free license key │
  1750. 43.39 s > │ that unlocks all cores and removes this banner: │
  1751. 43.39 s > │ │
  1752. 43.39 s > │ from symbolica import * │
  1753. 43.39 s > │ request_hobbyist_license('YOUR_NAME', 'YOUR_EMAIL') │
  1754. 43.39 s > │ │
  1755. 43.39 s > │ All other users can obtain a free 30-day trial key: │
  1756. 43.39 s > │ │
  1757. 43.39 s > │ from symbolica import * │
  1758. 43.39 s > │ request_trial_license('NAME', 'EMAIL', 'EMPLOYER') │
  1759. 43.39 s > │ │
  1760. 43.39 s > │ See https://symbolica.io/docs/get_started.html#license │
  1761. 43.39 s > └────────────────────────────────────────────────────────┘
  1762. 43.39 s > ┌───────────────────────────────────────────────────────────────────────────────────────────────────────────┐
  1763. 43.39 s > │ Cannot start new unlicensed Symbolica instance since there is already another one running on the machine. │
  1764. 43.39 s > └───────────────────────────────────────────────────────────────────────────────────────────────────────────┘
  1765. 43.39 s >
  1766. 43.39 s > stderr:
  1767. 43.39 s >
  1768. 43.39 s > ┌───────────────────────────────────────────────────────────┐
  1769. 43.39 s > │ Could not resolve the IP of the Symbolica license server. │
  1770. 43.39 s > │ │
  1771. 43.39 s > │ Please check your DNS configuration. │
  1772. 43.39 s > └───────────────────────────────────────────────────────────┘
  1773. 43.39 s > Error: failed to lookup address information: Temporary failure in name resolution
  1774. 43.39 s >
  1775. 43.39 s >
  1776. 43.39 s > Location:
  1777. 43.39 s > tests/tests/test_python_api.rs:156:20
  1778. 43.39 s >
  1779. 43.39 s > FAIL [ 0.182s] (4/5) gammaloop-integration-tests::test_python_api python_evaluate_sample_preserves_graph_grouping_and_incoming_pdgs
  1780. 43.39 s > stdout ---
  1781. 43.39 s >
  1782. 43.39 s > running 1 test
  1783. 43.39 s > test python_evaluate_sample_preserves_graph_grouping_and_incoming_pdgs ... FAILED
  1784. 43.39 s >
  1785. 43.39 s > failures:
  1786. 43.39 s >
  1787. 43.39 s > failures:
  1788. 43.39 s > python_evaluate_sample_preserves_graph_grouping_and_incoming_pdgs
  1789. 43.39 s >
  1790. 43.39 s > test result: FAILED. 0 passed; 1 failed; 0 ignored; 0 measured; 4 filtered out; finished in 0.18s
  1791. 43.39 s >
  1792. 43.39 s > stderr ---
  1793. 43.39 s > Error: Python API test subprocess failed.
  1794. 43.39 s > stdout:
  1795. 43.39 s > ┌────────────────────────────────────────────────────────┐
  1796. 43.39 s > │ You are running a restricted Symbolica instance. │
  1797. 43.39 s > │ │
  1798. 43.39 s > │ This mode is only permitted for non-commercial use and │
  1799. 43.39 s > │ is limited to one instance and core per machine. │
  1800. 43.39 s > │ │
  1801. 43.39 s > │ Hobbyists can easily acquire a free license key │
  1802. 43.39 s > │ that unlocks all cores and removes this banner: │
  1803. 43.39 s > │ │
  1804. 43.39 s > │ from symbolica import * │
  1805. 43.39 s > │ request_hobbyist_license('YOUR_NAME', 'YOUR_EMAIL') │
  1806. 43.39 s > │ │
  1807. 43.39 s > │ All other users can obtain a free 30-day trial key: │
  1808. 43.39 s > │ │
  1809. 43.39 s > │ from symbolica import * │
  1810. 43.39 s > │ request_trial_license('NAME', 'EMAIL', 'EMPLOYER') │
  1811. 43.39 s > │ │
  1812. 43.39 s > │ See https://symbolica.io/docs/get_started.html#license │
  1813. 43.39 s > └────────────────────────────────────────────────────────┘
  1814. 43.39 s > ┌───────────────────────────────────────────────────────────────────────────────────────────────────────────┐
  1815. 43.39 s > │ Cannot start new unlicensed Symbolica instance since there is already another one running on the machine. │
  1816. 43.39 s > └───────────────────────────────────────────────────────────────────────────────────────────────────────────┘
  1817. 43.39 s >
  1818. 43.39 s > stderr:
  1819. 43.39 s >
  1820. 43.39 s > ┌───────────────────────────────────────────────────────────┐
  1821. 43.39 s > │ Could not resolve the IP of the Symbolica license server. │
  1822. 43.39 s > │ │
  1823. 43.39 s > │ Please check your DNS configuration. │
  1824. 43.39 s > └───────────────────────────────────────────────────────────┘
  1825. 43.39 s > Error: failed to lookup address information: Temporary failure in name resolution
  1826. 43.39 s > [2026-09-03 15:34:09.885] @gammaloop_api::se... INFO : Running command import model sm-default
  1827. 43.39 s > [2026-09-03 15:34:09.885] @import::model INFO : Loading built-in JSON model sm-default
  1828. 43.39 s > [2026-09-03 15:34:09.918] @gammalooprs::model INFO : The following 11 external parameters were forced to zero by the restriction card:
  1829. 43.39 s > lamWS, AWS, rhoWS, etaWS, ymc, yme, ymm, MC, Me, MM, WTau
  1830. 43.39 s > [2026-09-03 15:34:09.918] @gammalooprs::model INFO : The following 34 vertex rules were removed by the restriction card:
  1831. 43.39 s > V_82 -> (c~, d, G+) | V_83 -> (t~, d, G+) | V_84 -> (c~, s, G+) | V_85 -> (t~, s, G+) | V_86 -> (u~, b, G+) | V_87 -> (c~, b, G+) | V_90 -> (c~, d, W+) | V_91 -> (t~, d, W+) | V_92 -> (u~, s, W+) | V_94 -> (t~, s, W+) | V_95 -> (u~, b, W+) | V_96 -> (c~, b, W+) | V_101 -> (e+, e-, G0) | V_102 -> (mu+, mu-, G0) | V_104 -> (e+, e-, H) | V_105 -> (mu+, mu-, H) | V_110 -> (ve~, e-, G+) | V_111 -> (vm~, mu-, G+) | V_116 -> (b~, u, G-) | V_117 -> (d~, c, G-) | V_118 -> (s~, c, G-) | V_119 -> (b~, c, G-) | V_120 -> (d~, t, G-) | V_121 -> (s~, t, G-) | V_124 -> (s~, u, W-) | V_125 -> (b~, u, W-) | V_126 -> (d~, c, W-) | V_128 -> (b~, c, W-) | V_129 -> (d~, t, W-) | V_130 -> (s~, t, W-) | V_138 -> (c~, c, G0) | V_140 -> (c~, c, H) | V_145 -> (e+, ve, G-) | V_146 -> (mu+, vm, G-)
  1832. 43.39 s > [2026-09-03 15:34:09.918] @gammalooprs::model INFO : The following 36 couplings were removed by the restriction card:
  1833. 43.39 s > GC_13, GC_14, GC_16, GC_17, GC_18, GC_19, GC_20, GC_22, GC_23, GC_24, GC_25, GC_26, GC_28, GC_29, GC_42, GC_43, GC_44, GC_46, GC_47, GC_48, GC_84, GC_85, GC_86, GC_87, GC_88, GC_89, GC_90, GC_91, GC_92, GC_93, GC_101, GC_102, GC_103, GC_105, GC_106, GC_107
  1834. 43.39 s > [2026-09-03 15:34:09.918] @gammaloop_api::se... INFO : Running command set default-runtime kv kinematics.externals='{"type":"constant","data":{"momenta":[[32.0,0.0,0.0,32.0],[32.0,0.0,0.0,-32.0]],"helicities":[1,1]}}'
  1835. 43.39 s > [2026-09-03 15:34:09.919] @gammaloop_api::se... INFO : Running command set default-runtime kv subtraction.disable_threshold_subtraction=true
  1836. 43.39 s > [2026-09-03 15:34:09.920] @gammaloop_api::se... INFO : Running command generate xs e+ e- > d d~ g | e- a d g QED^2==4 [{{2}} QCD=0] --numerator-grouping group_identical_graphs_up_to_sign --clear-existing-processes --only-diagrams
  1837. 43.39 s > [2026-09-03 15:34:09.922] @feyngen::diagram_... INFO : 0s | Δ=0s | Starting Feynman graph generation with Symbolica...
  1838. 43.39 s > [2026-09-03 15:34:09.924] @feyngen::diagram_... INFO : 0s | Δ=0s | Number of graphs resulting from Symbolica generation: 246
  1839. 43.39 s > [2026-09-03 15:34:09.925] @feyngen::diagram_... INFO : 0s | Δ=0s | Number of graphs retained after enforcing supergraph particle content: 8
  1840. 43.39 s > [2026-09-03 15:34:09.925] @feyngen::diagram_... INFO : 0s | Δ=0s | Number of graphs retained after removal of vetoed topologies: 8
  1841. 43.39 s > [2026-09-03 15:34:09.925] @feyngen::diagram_... INFO : 0s | Δ=0s | Number of graphs after vertex info assignment: 8
  1842. 43.39 s > [2026-09-03 15:34:09.925] @feyngen::diagram_... INFO : 0s | Δ=0s | Number of graphs after all complete graphs filters are applied: 8
  1843. 43.39 s >
  1844. 43.39 s >
  1845. 43.39 s > Location:
  1846. 43.39 s > tests/tests/test_python_api.rs:156:20
  1847. 43.39 s >
  1848. 43.39 s > FAIL [ 0.185s] (5/5) gammaloop-integration-tests::test_python_api python_settings_wrappers_expose_nested_runtime_and_global_settings
  1849. 43.39 s > stdout ---
  1850. 43.39 s >
  1851. 43.39 s > running 1 test
  1852. 43.39 s > test python_settings_wrappers_expose_nested_runtime_and_global_settings ... FAILED
  1853. 43.39 s >
  1854. 43.39 s > failures:
  1855. 43.39 s >
  1856. 43.39 s > failures:
  1857. 43.39 s > python_settings_wrappers_expose_nested_runtime_and_global_settings
  1858. 43.39 s >
  1859. 43.39 s > test result: FAILED. 0 passed; 1 failed; 0 ignored; 0 measured; 4 filtered out; finished in 0.18s
  1860. 43.39 s >
  1861. 43.39 s > stderr ---
  1862. 43.39 s > Error: Python API test subprocess failed.
  1863. 43.39 s > stdout:
  1864. 43.39 s > ┌────────────────────────────────────────────────────────┐
  1865. 43.39 s > │ You are running a restricted Symbolica instance. │
  1866. 43.39 s > │ │
  1867. 43.39 s > │ This mode is only permitted for non-commercial use and │
  1868. 43.39 s > │ is limited to one instance and core per machine. │
  1869. 43.39 s > │ │
  1870. 43.39 s > │ Hobbyists can easily acquire a free license key │
  1871. 43.39 s > │ that unlocks all cores and removes this banner: │
  1872. 43.39 s > │ │
  1873. 43.39 s > │ from symbolica import * │
  1874. 43.39 s > │ request_hobbyist_license('YOUR_NAME', 'YOUR_EMAIL') │
  1875. 43.39 s > │ │
  1876. 43.39 s > │ All other users can obtain a free 30-day trial key: │
  1877. 43.39 s > │ │
  1878. 43.39 s > │ from symbolica import * │
  1879. 43.39 s > │ request_trial_license('NAME', 'EMAIL', 'EMPLOYER') │
  1880. 43.39 s > │ │
  1881. 43.39 s > │ See https://symbolica.io/docs/get_started.html#license │
  1882. 43.39 s > └────────────────────────────────────────────────────────┘
  1883. 43.39 s > ┌───────────────────────────────────────────────────────────────────────────────────────────────────────────┐
  1884. 43.39 s > │ Cannot start new unlicensed Symbolica instance since there is already another one running on the machine. │
  1885. 43.39 s > └───────────────────────────────────────────────────────────────────────────────────────────────────────────┘
  1886. 43.39 s >
  1887. 43.39 s > stderr:
  1888. 43.39 s >
  1889. 43.39 s > ┌───────────────────────────────────────────────────────────┐
  1890. 43.39 s > │ Could not resolve the IP of the Symbolica license server. │
  1891. 43.39 s > │ │
  1892. 43.39 s > │ Please check your DNS configuration. │
  1893. 43.39 s > └───────────────────────────────────────────────────────────┘
  1894. 43.39 s > Error: failed to lookup address information: Temporary failure in name resolution
  1895. 43.39 s >
  1896. 43.39 s >
  1897. 43.39 s > Location:
  1898. 43.39 s > tests/tests/test_python_api.rs:156:20
  1899. 43.39 s >
  1900. 43.39 s > error: test run failed
  1901. 43.39 s >
  1902. 43.39 s > ========== nextest test summary ==========
  1903. 43.39 s > report: target/nextest/ci_gammaloop/junit.xml
  1904. 43.39 s > tests: 5, failures: 5, errors: 0
  1905. 43.39 s >
  1906. 43.39 s > 1. gammaloop-integration-tests::test_python_api::python_session_getters_return_live_toml_and_command_blocks
  1907. 43.39 s > failure: test failure with exit code 101
  1908. 43.39 s > Error: Python API test subprocess failed.
  1909. 43.39 s > stdout:
  1910. 43.39 s > ┌────────────────────────────────────────────────────────┐
  1911. 43.39 s > │ You are running a restricted Symbolica instance. │
  1912. 43.39 s > │ │
  1913. 43.39 s > │ This mode is only permitted for non-commercial use and │
  1914. 43.39 s > │ is limited to one instance and core per machine. │
  1915. 43.39 s > │ │
  1916. 43.39 s > │ Hobbyists can easily acquire a free license key │
  1917. 43.39 s > │ that unlocks all cores and removes this banner: │
  1918. 43.39 s > │ │
  1919. 43.39 s > │ from symbolica import * │
  1920. 43.39 s > │ request_hobbyist_license('YOUR_NAME', 'YOUR_EMAIL') │
  1921. 43.39 s > │ │
  1922. 43.39 s > │ All other users can obtain a free 30-day trial key: │
  1923. 43.39 s > │ │
  1924. 43.39 s > │ from symbolica import * │
  1925. 43.39 s > │ request_trial_license('NAME', 'EMAIL', 'EMPLOYER') │
  1926. 43.39 s > │ │
  1927. 43.39 s > │ See https://symbolica.io/docs/get_started.html#license │
  1928. 43.39 s > └────────────────────────────────────────────────────────┘
  1929. 43.39 s > ┌───────────────────────────────────────────────────────────────────────────────────────────────────────────┐
  1930. 43.39 s > │ Cannot start new unlicensed Symbolica instance since there is already another one running on the machine. │
  1931. 43.39 s > └───────────────────────────────────────────────────────────────────────────────────────────────────────────┘
  1932. 43.39 s >
  1933. 43.39 s > stderr:
  1934. 43.39 s >
  1935. 43.39 s > ┌───────────────────────────────────────────────────────────┐
  1936. 43.39 s > │ Could not resolve the IP of the Symbolica license server. │
  1937. 43.39 s > │ │
  1938. 43.39 s > │ Please check your DNS configuration. │
  1939. 43.39 s > └───────────────────────────────────────────────────────────┘
  1940. 43.39 s > Error: failed to lookup address information: Temporary failure in name resolution
  1941. 43.39 s >
  1942. 43.39 s >
  1943. 43.39 s > Location:
  1944. 43.39 s > tests/tests/test_python_api.rs:156:20
  1945. 43.39 s > system-out
  1946. 43.39 s > running 1 test
  1947. 43.39 s > test python_session_getters_return_live_toml_and_command_blocks ... FAILED
  1948. 43.39 s >
  1949. 43.39 s > failures:
  1950. 43.39 s >
  1951. 43.39 s > failures:
  1952. 43.39 s > python_session_getters_return_live_toml_and_command_blocks
  1953. 43.39 s >
  1954. 43.39 s > test result: FAILED. 0 passed; 1 failed; 0 ignored; 0 measured; 4 filtered out; finished in 0.11s
  1955. 43.39 s > system-err
  1956. 43.39 s > Error: Python API test subprocess failed.
  1957. 43.39 s > stdout:
  1958. 43.39 s > ┌────────────────────────────────────────────────────────┐
  1959. 43.39 s > │ You are running a restricted Symbolica instance. │
  1960. 43.39 s > │ │
  1961. 43.39 s > │ This mode is only permitted for non-commercial use and │
  1962. 43.39 s > │ is limited to one instance and core per machine. │
  1963. 43.39 s > │ │
  1964. 43.39 s > │ Hobbyists can easily acquire a free license key │
  1965. 43.39 s > │ that unlocks all cores and removes this banner: │
  1966. 43.39 s > │ │
  1967. 43.39 s > │ from symbolica import * │
  1968. 43.39 s > │ request_hobbyist_license('YOUR_NAME', 'YOUR_EMAIL') │
  1969. 43.39 s > │ │
  1970. 43.39 s > │ All other users can obtain a free 30-day trial key: │
  1971. 43.39 s > │ │
  1972. 43.39 s > │ from symbolica import * │
  1973. 43.39 s > │ request_trial_license('NAME', 'EMAIL', 'EMPLOYER') │
  1974. 43.39 s > │ │
  1975. 43.39 s > │ See https://symbolica.io/docs/get_started.html#license │
  1976. 43.39 s > └────────────────────────────────────────────────────────┘
  1977. 43.39 s > ┌───────────────────────────────────────────────────────────────────────────────────────────────────────────┐
  1978. 43.39 s > │ Cannot start new unlicensed Symbolica instance since there is already another one running on the machine. │
  1979. 43.39 s > └───────────────────────────────────────────────────────────────────────────────────────────────────────────┘
  1980. 43.39 s >
  1981. 43.39 s > stderr:
  1982. 43.39 s >
  1983. 43.39 s > ┌───────────────────────────────────────────────────────────┐
  1984. 43.39 s > │ Could not resolve the IP of the Symbolica license server. │
  1985. 43.39 s > │ │
  1986. 43.39 s > │ Please check your DNS configuration. │
  1987. 43.39 s > └───────────────────────────────────────────────────────────┘
  1988. 43.39 s > Error: failed to lookup address information: Temporary failure in name resolution
  1989. 43.39 s >
  1990. 43.39 s >
  1991. 43.39 s > Location:
  1992. 43.39 s > tests/tests/test_python_api.rs:156:20
  1993. 43.39 s >
  1994. 43.39 s > 2. gammaloop-integration-tests::test_python_api::python_evaluate_sample_honors_generate_events_and_observable_snapshots
  1995. 43.39 s > failure: test failure with exit code 101
  1996. 43.39 s > Error: Python API test subprocess failed.
  1997. 43.39 s > stdout:
  1998. 43.39 s > ┌────────────────────────────────────────────────────────┐
  1999. 43.39 s > │ You are running a restricted Symbolica instance. │
  2000. 43.39 s > │ │
  2001. 43.39 s > │ This mode is only permitted for non-commercial use and │
  2002. 43.39 s > │ is limited to one instance and core per machine. │
  2003. 43.39 s > │ │
  2004. 43.39 s > │ Hobbyists can easily acquire a free license key │
  2005. 43.39 s > │ that unlocks all cores and removes this banner: │
  2006. 43.39 s > │ │
  2007. 43.39 s > │ from symbolica import * │
  2008. 43.39 s > │ request_hobbyist_license('YOUR_NAME', 'YOUR_EMAIL') │
  2009. 43.39 s > │ │
  2010. 43.39 s > │ All other users can obtain a free 30-day trial key: │
  2011. 43.39 s > │ │
  2012. 43.39 s > │ from symbolica import * │
  2013. 43.39 s > │ request_trial_license('NAME', 'EMAIL', 'EMPLOYER') │
  2014. 43.39 s > │ │
  2015. 43.39 s > │ See https://symbolica.io/docs/get_started.html#license │
  2016. 43.39 s > └────────────────────────────────────────────────────────┘
  2017. 43.39 s > ┌───────────────────────────────────────────────────────────────────────────────────────────────────────────┐
  2018. 43.39 s > │ Cannot start new unlicensed Symbolica instance since there is already another one running on the machine. │
  2019. 43.39 s > └───────────────────────────────────────────────────────────────────────────────────────────────────────────┘
  2020. 43.39 s >
  2021. 43.39 s > stderr:
  2022. 43.39 s >
  2023. 43.39 s > ┌───────────────────────────────────────────────────────────┐
  2024. 43.39 s > │ Could not resolve the IP of the Symbolica license server. │
  2025. 43.39 s > │ │
  2026. 43.39 s > │ Please check your DNS configuration. │
  2027. 43.39 s > └───────────────────────────────────────────────────────────┘
  2028. 43.39 s > Error: failed to lookup address information: Temporary failure in name resolution
  2029. 43.39 s >
  2030. 43.39 s >
  2031. 43.39 s > Location:
  2032. 43.39 s > tests/tests/test_python_api.rs:156:20
  2033. 43.39 s > system-out
  2034. 43.39 s > running 1 test
  2035. 43.39 s > test python_evaluate_sample_honors_generate_events_and_observable_snapshots ... FAILED
  2036. 43.39 s >
  2037. 43.39 s > failures:
  2038. 43.39 s >
  2039. 43.39 s > failures:
  2040. 43.39 s > python_evaluate_sample_honors_generate_events_and_observable_snapshots
  2041. 43.39 s >
  2042. 43.39 s > test result: FAILED. 0 passed; 1 failed; 0 ignored; 0 measured; 4 filtered out; finished in 0.11s
  2043. 43.39 s > system-err
  2044. 43.39 s > Error: Python API test subprocess failed.
  2045. 43.39 s > stdout:
  2046. 43.39 s > ┌────────────────────────────────────────────────────────┐
  2047. 43.39 s > │ You are running a restricted Symbolica instance. │
  2048. 43.39 s > │ │
  2049. 43.39 s > │ This mode is only permitted for non-commercial use and │
  2050. 43.39 s > │ is limited to one instance and core per machine. │
  2051. 43.39 s > │ │
  2052. 43.39 s > │ Hobbyists can easily acquire a free license key │
  2053. 43.39 s > │ that unlocks all cores and removes this banner: │
  2054. 43.39 s > │ │
  2055. 43.39 s > │ from symbolica import * │
  2056. 43.39 s > │ request_hobbyist_license('YOUR_NAME', 'YOUR_EMAIL') │
  2057. 43.39 s > │ │
  2058. 43.39 s > │ All other users can obtain a free 30-day trial key: │
  2059. 43.39 s > │ │
  2060. 43.39 s > │ from symbolica import * │
  2061. 43.39 s > │ request_trial_license('NAME', 'EMAIL', 'EMPLOYER') │
  2062. 43.39 s > │ │
  2063. 43.39 s > │ See https://symbolica.io/docs/get_started.html#license │
  2064. 43.39 s > └────────────────────────────────────────────────────────┘
  2065. 43.39 s > ┌───────────────────────────────────────────────────────────────────────────────────────────────────────────┐
  2066. 43.39 s > │ Cannot start new unlicensed Symbolica instance since there is already another one running on the machine. │
  2067. 43.39 s > └───────────────────────────────────────────────────────────────────────────────────────────────────────────┘
  2068. 43.39 s >
  2069. 43.39 s > stderr:
  2070. 43.39 s >
  2071. 43.39 s > ┌───────────────────────────────────────────────────────────┐
  2072. 43.39 s > │ Could not resolve the IP of the Symbolica license server. │
  2073. 43.39 s > │ │
  2074. 43.39 s > │ Please check your DNS configuration. │
  2075. 43.39 s > └───────────────────────────────────────────────────────────┘
  2076. 43.39 s > Error: failed to lookup address information: Temporary failure in name resolution
  2077. 43.39 s >
  2078. 43.39 s >
  2079. 43.39 s > Location:
  2080. 43.39 s > tests/tests/test_python_api.rs:156:20
  2081. 43.39 s >
  2082. 43.39 s > 3. gammaloop-integration-tests::test_python_api::python_evaluate_samples_batch_and_momentum_space_have_expected_shape
  2083. 43.39 s > failure: test failure with exit code 101
  2084. 43.39 s > Error: Python API test subprocess failed.
  2085. 43.39 s > stdout:
  2086. 43.39 s > ┌────────────────────────────────────────────────────────┐
  2087. 43.39 s > │ You are running a restricted Symbolica instance. │
  2088. 43.39 s > │ │
  2089. 43.39 s > │ This mode is only permitted for non-commercial use and │
  2090. 43.39 s > │ is limited to one instance and core per machine. │
  2091. 43.39 s > │ │
  2092. 43.39 s > │ Hobbyists can easily acquire a free license key │
  2093. 43.39 s > │ that unlocks all cores and removes this banner: │
  2094. 43.39 s > │ │
  2095. 43.39 s > │ from symbolica import * │
  2096. 43.39 s > │ request_hobbyist_license('YOUR_NAME', 'YOUR_EMAIL') │
  2097. 43.39 s > │ │
  2098. 43.39 s > │ All other users can obtain a free 30-day trial key: │
  2099. 43.39 s > │ │
  2100. 43.39 s > │ from symbolica import * │
  2101. 43.39 s > │ request_trial_license('NAME', 'EMAIL', 'EMPLOYER') │
  2102. 43.39 s > │ │
  2103. 43.39 s > │ See https://symbolica.io/docs/get_started.html#license │
  2104. 43.39 s > └────────────────────────────────────────────────────────┘
  2105. 43.39 s > ┌───────────────────────────────────────────────────────────────────────────────────────────────────────────┐
  2106. 43.39 s > │ Cannot start new unlicensed Symbolica instance since there is already another one running on the machine. │
  2107. 43.39 s > └───────────────────────────────────────────────────────────────────────────────────────────────────────────┘
  2108. 43.39 s >
  2109. 43.39 s > stderr:
  2110. 43.39 s >
  2111. 43.39 s > ┌───────────────────────────────────────────────────────────┐
  2112. 43.39 s > │ Could not resolve the IP of the Symbolica license server. │
  2113. 43.39 s > │ │
  2114. 43.39 s > │ Please check your DNS configuration. │
  2115. 43.39 s > └───────────────────────────────────────────────────────────┘
  2116. 43.39 s > Error: failed to lookup address information: Temporary failure in name resolution
  2117. 43.39 s >
  2118. 43.39 s >
  2119. 43.39 s > Location:
  2120. 43.39 s > tests/tests/test_python_api.rs:156:20
  2121. 43.39 s > system-out
  2122. 43.39 s > running 1 test
  2123. 43.39 s > test python_evaluate_samples_batch_and_momentum_space_have_expected_shape ... FAILED
  2124. 43.39 s >
  2125. 43.39 s > failures:
  2126. 43.39 s >
  2127. 43.39 s > failures:
  2128. 43.39 s > python_evaluate_samples_batch_and_momentum_space_have_expected_shape
  2129. 43.39 s >
  2130. 43.39 s > test result: FAILED. 0 passed; 1 failed; 0 ignored; 0 measured; 4 filtered out; finished in 0.11s
  2131. 43.39 s > system-err
  2132. 43.39 s > Error: Python API test subprocess failed.
  2133. 43.39 s > stdout:
  2134. 43.39 s > ┌────────────────────────────────────────────────────────┐
  2135. 43.39 s > │ You are running a restricted Symbolica instance. │
  2136. 43.39 s > │ │
  2137. 43.39 s > │ This mode is only permitted for non-commercial use and │
  2138. 43.39 s > │ is limited to one instance and core per machine. │
  2139. 43.39 s > │ │
  2140. 43.39 s > │ Hobbyists can easily acquire a free license key │
  2141. 43.39 s > │ that unlocks all cores and removes this banner: │
  2142. 43.39 s > │ │
  2143. 43.39 s > │ from symbolica import * │
  2144. 43.39 s > │ request_hobbyist_license('YOUR_NAME', 'YOUR_EMAIL') │
  2145. 43.39 s > │ │
  2146. 43.39 s > │ All other users can obtain a free 30-day trial key: │
  2147. 43.39 s > │ │
  2148. 43.39 s > │ from symbolica import * │
  2149. 43.39 s > │ request_trial_license('NAME', 'EMAIL', 'EMPLOYER') │
  2150. 43.39 s > │ │
  2151. 43.39 s > │ See https://symbolica.io/docs/get_started.html#license │
  2152. 43.39 s > └────────────────────────────────────────────────────────┘
  2153. 43.39 s > ┌───────────────────────────────────────────────────────────────────────────────────────────────────────────┐
  2154. 43.39 s > │ Cannot start new unlicensed Symbolica instance since there is already another one running on the machine. │
  2155. 43.39 s > └───────────────────────────────────────────────────────────────────────────────────────────────────────────┘
  2156. 43.39 s >
  2157. 43.39 s > stderr:
  2158. 43.39 s >
  2159. 43.39 s > ┌───────────────────────────────────────────────────────────┐
  2160. 43.39 s > │ Could not resolve the IP of the Symbolica license server. │
  2161. 43.39 s > │ │
  2162. 43.39 s > │ Please check your DNS configuration. │
  2163. 43.39 s > └───────────────────────────────────────────────────────────┘
  2164. 43.39 s > Error: failed to lookup address information: Temporary failure in name resolution
  2165. 43.39 s >
  2166. 43.39 s >
  2167. 43.39 s > Location:
  2168. 43.39 s > tests/tests/test_python_api.rs:156:20
  2169. 43.39 s >
  2170. 43.39 s > 4. gammaloop-integration-tests::test_python_api::python_evaluate_sample_preserves_graph_grouping_and_incoming_pdgs
  2171. 43.39 s > failure: test failure with exit code 101
  2172. 43.39 s > Error: Python API test subprocess failed.
  2173. 43.39 s > stdout:
  2174. 43.39 s > ┌────────────────────────────────────────────────────────┐
  2175. 43.39 s > │ You are running a restricted Symbolica instance. │
  2176. 43.39 s > │ │
  2177. 43.39 s > │ This mode is only permitted for non-commercial use and │
  2178. 43.39 s > │ is limited to one instance and core per machine. │
  2179. 43.39 s > │ │
  2180. 43.39 s > │ Hobbyists can easily acquire a free license key │
  2181. 43.39 s > │ that unlocks all cores and removes this banner: │
  2182. 43.39 s > │ │
  2183. 43.39 s > │ from symbolica import * │
  2184. 43.39 s > │ request_hobbyist_license('YOUR_NAME', 'YOUR_EMAIL') │
  2185. 43.39 s > │ │
  2186. 43.39 s > │ All other users can obtain a free 30-day trial key: │
  2187. 43.39 s > │ │
  2188. 43.39 s > │ from symbolica import * │
  2189. 43.39 s > │ request_trial_license('NAME', 'EMAIL', 'EMPLOYER') │
  2190. 43.39 s > │ │
  2191. 43.39 s > │ See https://symbolica.io/docs/get_started.html#license │
  2192. 43.39 s > └────────────────────────────────────────────────────────┘
  2193. 43.39 s > ┌───────────────────────────────────────────────────────────────────────────────────────────────────────────┐
  2194. 43.39 s > │ Cannot start new unlicensed Symbolica instance since there is already another one running on the machine. │
  2195. 43.39 s > └───────────────────────────────────────────────────────────────────────────────────────────────────────────┘
  2196. 43.39 s >
  2197. 43.39 s > stderr:
  2198. 43.39 s >
  2199. 43.39 s > ┌───────────────────────────────────────────────────────────┐
  2200. 43.39 s > │ Could not resolve the IP of the Symbolica license server. │
  2201. 43.39 s > │ │
  2202. 43.39 s > │ Please check your DNS configuration. │
  2203. 43.39 s > └───────────────────────────────────────────────────────────┘
  2204. 43.39 s > Error: failed to lookup address information: Temporary failure in name resolution
  2205. 43.39 s > [2026-09-03 15:34:09.885] @gammaloop_api::se... INFO : Running command import model sm-default
  2206. 43.39 s > [2026-09-03 15:34:09.885] @import::model INFO : Loading built-in JSON model sm-default
  2207. 43.39 s > [2026-09-03 15:34:09.918] @gammalooprs::model INFO : The following 11 external parameters were forced to zero by the restriction card:
  2208. 43.39 s > lamWS, AWS, rhoWS, etaWS, ymc, yme, ymm, MC, Me, MM, WTau
  2209. 43.39 s > [2026-09-03 15:34:09.918] @gammalooprs::model INFO : The following 34 vertex rules were removed by the restriction card:
  2210. 43.39 s > V_82 -> (c~, d, G+) | V_83 -> (t~, d, G+) | V_84 -> (c~, s, G+) | V_85 -> (t~, s, G+) | V_86 -> (u~, b, G+) | V_87 -> (c~, b, G+) | V_90 -> (c~, d, W+) | V_91 -> (t~, d, W+) | V_92 -> (u~, s, W+) | V_94 -> (t~, s, W+) | V_95 -> (u~, b, W+) | V_96 -> (c~, b, W+) | V_101 -> (e+, e-, G0) | V_102 -> (mu+, mu-, G0) | V_104 -> (e+, e-, H) | V_105 -> (mu+, mu-, H) | V_110 -> (ve~, e-, G+) | V_111 -> (vm~, mu-, G+) | V_116 -> (b~, u, G-) | V_117 -> (d~, c, G-) | V_118 -> (s~, c, G-) | V_119 -> (b~, c, G-) | V_120 -> (d~, t, G-) | V_121 -> (s~, t, G-) | V_124 -> (s~, u, W-) | V_125 -> (b~, u, W-) | V_126 -> (d~, c, W-) | V_128 -> (b~, c, W-) | V_129 -> (d~, t, W-) | V_130 -> (s~, t, W-) | V_138 -> (c~, c, G0) | V_140 -> (c~, c, H) | V_145 -> (e+, ve, G-) | V_146 -> (mu+, vm, G-)
  2211. 43.39 s > [2026-09-03 15:34:09.918] @gammalooprs::model INFO : The following 36 couplings were removed by the restriction card:
  2212. 43.39 s > GC_13, GC_14, GC_16, GC_17, GC_18, GC_19, GC_20, GC_22, GC_23, GC_24, GC_25, GC_26, GC_28, GC_29, GC_42, GC_43, GC_44, GC_46, GC_47, GC_48, GC_84, GC_85, GC_86, GC_87, GC_88, GC_89, GC_90, GC_91, GC_92, GC_93, GC_101, GC_102, GC_103, GC_105, GC_106, GC_107
  2213. 43.39 s > [2026-09-03 15:34:09.918] @gammaloop_api::se... INFO : Running command set default-runtime kv kinematics.externals='{"type":"constant","data":{"momenta":[[32.0,0.0,0.0,32.0],[32.0,0.0,0.0,-32.0]],"helicities":[1,1]}}'
  2214. 43.39 s > [2026-09-03 15:34:09.919] @gammaloop_api::se... INFO : Running command set default-runtime kv subtraction.disable_threshold_subtraction=true
  2215. 43.39 s > [2026-09-03 15:34:09.920] @gammaloop_api::se... INFO : Running command generate xs e+ e- > d d~ g | e- a d g QED^2==4 [{{2}} QCD=0] --numerator-grouping group_identical_graphs_up_to_sign --clear-existing-processes --only-diagrams
  2216. 43.39 s > [2026-09-03 15:34:09.922] @feyngen::diagram_... INFO : 0s | Δ=0s | Starting Feynman graph generation with Symbolica...
  2217. 43.39 s > [2026-09-03 15:34:09.924] @feyngen::diagram_... INFO : 0s | Δ=0s | Number of graphs resulting from Symbolica generation: 246
  2218. 43.39 s > [2026-09-03 15:34:09.925] @feyngen::diagram_... INFO : 0s | Δ=0s | Number of graphs retained after enforcing supergraph particle content: 8
  2219. 43.39 s > [2026-09-03 15:34:09.925] @feyngen::diagram_... INFO : 0s | Δ=0s | Number of graphs retained after removal of vetoed topologies: 8
  2220. 43.39 s > [2026-09-03 15:34:09.925] @feyngen::diagram_... INFO : 0s | Δ=0s | Number of graphs after vertex info assignment: 8
  2221. 43.39 s > [2026-09-03 15:34:09.925] @feyngen::diagram_... INFO : 0s | Δ=0s | Number of graphs after all complete graphs filters are applied: 8
  2222. 43.39 s >
  2223. 43.39 s >
  2224. 43.39 s > Location:
  2225. 43.39 s > tests/tests/test_python_api.rs:156:20
  2226. 43.39 s > system-out
  2227. 43.39 s > running 1 test
  2228. 43.39 s > test python_evaluate_sample_preserves_graph_grouping_and_incoming_pdgs ... FAILED
  2229. 43.39 s >
  2230. 43.39 s > failures:
  2231. 43.39 s >
  2232. 43.39 s > failures:
  2233. 43.39 s > python_evaluate_sample_preserves_graph_grouping_and_incoming_pdgs
  2234. 43.39 s >
  2235. 43.39 s > test result: FAILED. 0 passed; 1 failed; 0 ignored; 0 measured; 4 filtered out; finished in 0.18s
  2236. 43.39 s > system-err
  2237. 43.39 s > Error: Python API test subprocess failed.
  2238. 43.39 s > stdout:
  2239. 43.39 s > ┌────────────────────────────────────────────────────────┐
  2240. 43.39 s > │ You are running a restricted Symbolica instance. │
  2241. 43.39 s > │ │
  2242. 43.39 s > │ This mode is only permitted for non-commercial use and │
  2243. 43.39 s > │ is limited to one instance and core per machine. │
  2244. 43.39 s > │ │
  2245. 43.39 s > │ Hobbyists can easily acquire a free license key │
  2246. 43.39 s > │ that unlocks all cores and removes this banner: │
  2247. 43.39 s > │ │
  2248. 43.39 s > │ from symbolica import * │
  2249. 43.39 s > │ request_hobbyist_license('YOUR_NAME', 'YOUR_EMAIL') │
  2250. 43.39 s > │ │
  2251. 43.39 s > │ All other users can obtain a free 30-day trial key: │
  2252. 43.39 s > │ │
  2253. 43.39 s > │ from symbolica import * │
  2254. 43.39 s > │ request_trial_license('NAME', 'EMAIL', 'EMPLOYER') │
  2255. 43.39 s > │ │
  2256. 43.39 s > │ See https://symbolica.io/docs/get_started.html#license │
  2257. 43.39 s > └────────────────────────────────────────────────────────┘
  2258. 43.39 s > ┌───────────────────────────────────────────────────────────────────────────────────────────────────────────┐
  2259. 43.39 s > │ Cannot start new unlicensed Symbolica instance since there is already another one running on the machine. │
  2260. 43.39 s > └───────────────────────────────────────────────────────────────────────────────────────────────────────────┘
  2261. 43.39 s >
  2262. 43.39 s > stderr:
  2263. 43.39 s >
  2264. 43.39 s > ┌───────────────────────────────────────────────────────────┐
  2265. 43.39 s > │ Could not resolve the IP of the Symbolica license server. │
  2266. 43.39 s > │ │
  2267. 43.39 s > │ Please check your DNS configuration. │
  2268. 43.39 s > └───────────────────────────────────────────────────────────┘
  2269. 43.39 s > Error: failed to lookup address information: Temporary failure in name resolution
  2270. 43.39 s > [2026-09-03 15:34:09.885] @gammaloop_api::se... INFO : Running command import model sm-default
  2271. 43.39 s > [2026-09-03 15:34:09.885] @import::model INFO : Loading built-in JSON model sm-default
  2272. 43.39 s > [2026-09-03 15:34:09.918] @gammalooprs::model INFO : The following 11 external parameters were forced to zero by the restriction card:
  2273. 43.39 s > lamWS, AWS, rhoWS, etaWS, ymc, yme, ymm, MC, Me, MM, WTau
  2274. 43.39 s > [2026-09-03 15:34:09.918] @gammalooprs::model INFO : The following 34 vertex rules were removed by the restriction card:
  2275. 43.39 s > V_82 -> (c~, d, G+) | V_83 -> (t~, d, G+) | V_84 -> (c~, s, G+) | V_85 -> (t~, s, G+) | V_86 -> (u~, b, G+) | V_87 -> (c~, b, G+) | V_90 -> (c~, d, W+) | V_91 -> (t~, d, W+) | V_92 -> (u~, s, W+) | V_94 -> (t~, s, W+) | V_95 -> (u~, b, W+) | V_96 -> (c~, b, W+) | V_101 -> (e+, e-, G0) | V_102 -> (mu+, mu-, G0) | V_104 -> (e+, e-, H) | V_105 -> (mu+, mu-, H) | V_110 -> (ve~, e-, G+) | V_111 -> (vm~, mu-, G+) | V_116 -> (b~, u, G-) | V_117 -> (d~, c, G-) | V_118 -> (s~, c, G-) | V_119 -> (b~, c, G-) | V_120 -> (d~, t, G-) | V_121 -> (s~, t, G-) | V_124 -> (s~, u, W-) | V_125 -> (b~, u, W-) | V_126 -> (d~, c, W-) | V_128 -> (b~, c, W-) | V_129 -> (d~, t, W-) | V_130 -> (s~, t, W-) | V_138 -> (c~, c, G0) | V_140 -> (c~, c, H) | V_145 -> (e+, ve, G-) | V_146 -> (mu+, vm, G-)
  2276. 43.39 s > [2026-09-03 15:34:09.918] @gammalooprs::model INFO : The following 36 couplings were removed by the restriction card:
  2277. 43.39 s > GC_13, GC_14, GC_16, GC_17, GC_18, GC_19, GC_20, GC_22, GC_23, GC_24, GC_25, GC_26, GC_28, GC_29, GC_42, GC_43, GC_44, GC_46, GC_47, GC_48, GC_84, GC_85, GC_86, GC_87, GC_88, GC_89, GC_90, GC_91, GC_92, GC_93, GC_101, GC_102, GC_103, GC_105, GC_106, GC_107
  2278. 43.39 s > [2026-09-03 15:34:09.918] @gammaloop_api::se... INFO : Running command set default-runtime kv kinematics.externals='{"type":"constant","data":{"momenta":[[32.0,0.0,0.0,32.0],[32.0,0.0,0.0,-32.0]],"helicities":[1,1]}}'
  2279. 43.39 s > [2026-09-03 15:34:09.919] @gammaloop_api::se... INFO : Running command set default-runtime kv subtraction.disable_threshold_subtraction=true
  2280. 43.39 s > [2026-09-03 15:34:09.920] @gammaloop_api::se... INFO : Running command generate xs e+ e- > d d~ g | e- a d g QED^2==4 [{{2}} QCD=0] --numerator-grouping group_identical_graphs_up_to_sign --clear-existing-processes --only-diagrams
  2281. 43.39 s > [2026-09-03 15:34:09.922] @feyngen::diagram_... INFO : 0s | Δ=0s | Starting Feynman graph generation with Symbolica...
  2282. 43.39 s > [2026-09-03 15:34:09.924] @feyngen::diagram_... INFO : 0s | Δ=0s | Number of graphs resulting from Symbolica generation: 246
  2283. 43.39 s > [2026-09-03 15:34:09.925] @feyngen::diagram_... INFO : 0s | Δ=0s | Number of graphs retained after enforcing supergraph particle content: 8
  2284. 43.39 s > [2026-09-03 15:34:09.925] @feyngen::diagram_... INFO : 0s | Δ=0s | Number of graphs retained after removal of vetoed topologies: 8
  2285. 43.39 s > [2026-09-03 15:34:09.925] @feyngen::diagram_... INFO : 0s | Δ=0s | Number of graphs after vertex info assignment: 8
  2286. 43.39 s > [2026-09-03 15:34:09.925] @feyngen::diagram_... INFO : 0s | Δ=0s | Number of graphs after all complete graphs filters are applied: 8
  2287. 43.39 s >
  2288. 43.39 s >
  2289. 43.39 s > Location:
  2290. 43.39 s > tests/tests/test_python_api.rs:156:20
  2291. 43.39 s >
  2292. 43.39 s > 5. gammaloop-integration-tests::test_python_api::python_settings_wrappers_expose_nested_runtime_and_global_settings
  2293. 43.39 s > failure: test failure with exit code 101
  2294. 43.39 s > Error: Python API test subprocess failed.
  2295. 43.39 s > stdout:
  2296. 43.39 s > ┌────────────────────────────────────────────────────────┐
  2297. 43.39 s > │ You are running a restricted Symbolica instance. │
  2298. 43.39 s > │ │
  2299. 43.39 s > │ This mode is only permitted for non-commercial use and │
  2300. 43.39 s > │ is limited to one instance and core per machine. │
  2301. 43.39 s > │ │
  2302. 43.39 s > │ Hobbyists can easily acquire a free license key │
  2303. 43.39 s > │ that unlocks all cores and removes this banner: │
  2304. 43.39 s > │ │
  2305. 43.39 s > │ from symbolica import * │
  2306. 43.39 s > │ request_hobbyist_license('YOUR_NAME', 'YOUR_EMAIL') │
  2307. 43.39 s > │ │
  2308. 43.39 s > │ All other users can obtain a free 30-day trial key: │
  2309. 43.39 s > │ │
  2310. 43.39 s > │ from symbolica import * │
  2311. 43.39 s > │ request_trial_license('NAME', 'EMAIL', 'EMPLOYER') │
  2312. 43.39 s > │ │
  2313. 43.39 s > │ See https://symbolica.io/docs/get_started.html#license │
  2314. 43.39 s > └────────────────────────────────────────────────────────┘
  2315. 43.39 s > ┌───────────────────────────────────────────────────────────────────────────────────────────────────────────┐
  2316. 43.39 s > │ Cannot start new unlicensed Symbolica instance since there is already another one running on the machine. │
  2317. 43.39 s > └───────────────────────────────────────────────────────────────────────────────────────────────────────────┘
  2318. 43.39 s >
  2319. 43.39 s > stderr:
  2320. 43.39 s >
  2321. 43.39 s > ┌───────────────────────────────────────────────────────────┐
  2322. 43.39 s > │ Could not resolve the IP of the Symbolica license server. │
  2323. 43.39 s > │ │
  2324. 43.39 s > │ Please check your DNS configuration. │
  2325. 43.39 s > └───────────────────────────────────────────────────────────┘
  2326. 43.39 s > Error: failed to lookup address information: Temporary failure in name resolution
  2327. 43.39 s >
  2328. 43.39 s >
  2329. 43.39 s > Location:
  2330. 43.39 s > tests/tests/test_python_api.rs:156:20
  2331. 43.39 s > system-out
  2332. 43.39 s > running 1 test
  2333. 43.39 s > test python_settings_wrappers_expose_nested_runtime_and_global_settings ... FAILED
  2334. 43.39 s >
  2335. 43.39 s > failures:
  2336. 43.39 s >
  2337. 43.39 s > failures:
  2338. 43.39 s > python_settings_wrappers_expose_nested_runtime_and_global_settings
  2339. 43.39 s >
  2340. 43.39 s > test result: FAILED. 0 passed; 1 failed; 0 ignored; 0 measured; 4 filtered out; finished in 0.18s
  2341. 43.39 s > system-err
  2342. 43.39 s > Error: Python API test subprocess failed.
  2343. 43.39 s > stdout:
  2344. 43.39 s > ┌────────────────────────────────────────────────────────┐
  2345. 43.39 s > │ You are running a restricted Symbolica instance. │
  2346. 43.39 s > │ │
  2347. 43.39 s > │ This mode is only permitted for non-commercial use and │
  2348. 43.39 s > │ is limited to one instance and core per machine. │
  2349. 43.39 s > │ │
  2350. 43.39 s > │ Hobbyists can easily acquire a free license key │
  2351. 43.39 s > │ that unlocks all cores and removes this banner: │
  2352. 43.39 s > │ │
  2353. 43.39 s > │ from symbolica import * │
  2354. 43.39 s > │ request_hobbyist_license('YOUR_NAME', 'YOUR_EMAIL') │
  2355. 43.39 s > │ │
  2356. 43.39 s > │ All other users can obtain a free 30-day trial key: │
  2357. 43.39 s > │ │
  2358. 43.39 s > │ from symbolica import * │
  2359. 43.39 s > │ request_trial_license('NAME', 'EMAIL', 'EMPLOYER') │
  2360. 43.39 s > │ │
  2361. 43.39 s > │ See https://symbolica.io/docs/get_started.html#license │
  2362. 43.39 s > └────────────────────────────────────────────────────────┘
  2363. 43.39 s > ┌───────────────────────────────────────────────────────────────────────────────────────────────────────────┐
  2364. 43.39 s > │ Cannot start new unlicensed Symbolica instance since there is already another one running on the machine. │
  2365. 43.39 s > └───────────────────────────────────────────────────────────────────────────────────────────────────────────┘
  2366. 43.39 s >
  2367. 43.39 s > stderr:
  2368. 43.39 s >
  2369. 43.39 s > ┌───────────────────────────────────────────────────────────┐
  2370. 43.39 s > │ Could not resolve the IP of the Symbolica license server. │
  2371. 43.39 s > │ │
  2372. 43.39 s > │ Please check your DNS configuration. │
  2373. 43.39 s > └───────────────────────────────────────────────────────────┘
  2374. 43.39 s > Error: failed to lookup address information: Temporary failure in name resolution
  2375. 43.39 s >
  2376. 43.39 s >
  2377. 43.39 s > Location:
  2378. 43.39 s > tests/tests/test_python_api.rs:156:20
  2379. 43.39 s > =========================================
  2380. 43.39 s For full logs, run:
  2381. 43.39 s nix log /nix/store/92rfrz53xqdm3bwmdf3dq8zbdzxy8f7a-gammaloop-nextest-python-api.drv
  2382. 43.49 s [7 built (1 failed), 76 Run failed.