test packages.x86_64-linux.nix-ci-check-gammaloop-nextest-core

Reproduce this run
Retry Run
  1. 0.00 s $ /nix/store/9ypz3flqsrl5xl495mm8h645gadjsxi1-coreutils-9.11/bin/timeout --kill-after=15s 7200s /nix/store/23zk8sgzamrbmj1fday15szf7f2279s8-nix-2.34.7/bin/nix --extra-experimental-features nix-command --extra-experimental-features flakes flake clone git+https://github.com/alphal00p/gammaloop --dest /tmp/nix-ci-worker/stable-pwd/repo/
  2. 0.07 s Cloning into '/tmp/nix-ci-worker/stable-pwd/repo'...
  3. 0.92 s remote: Enumerating objects: 87989, done.
  4. 1.04 s remote: Counting objects: 0% (1/10557) remote: Counting objects: 1% (106/10557) remote: Counting objects: 2% (212/10557) remote: Counting objects: 3% (317/10557) remote: Counting objects: 4% (423/10557) remote: Counting objects: 5% (528/10557) remote: Counting objects: 6% (634/10557) remote: Counting objects: 7% (739/10557) remote: Counting objects: 8% (845/10557) remote: Counting objects: 9% (951/10557) remote: Counting objects: 10% (1056/10557) remote: Counting objects: 11% (1162/10557) remote: Counting objects: 12% (1267/10557) remote: Counting objects: 13% (1373/10557) remote: Counting objects: 14% (1478/10557) remote: Counting objects: 15% (1584/10557) remote: Counting objects: 16% (1690/10557) remote: Counting objects: 17% (1795/10557) remote: Counting objects: 18% (1901/10557) remote: Counting objects: 19% (2006/10557) remote: Counting objects: 20% (2112/10557) remote: Counting objects: 21% (2217/10557) remote: Counting objects: 22% (2323/10557) remote: Counting objects: 23% (2429/10557) remote: Counting objects: 24% (2534/10557) remote: Counting objects: 25% (2640/10557) remote: Counting objects: 26% (2745/10557) remote: Counting objects: 27% (2851/10557) remote: Counting objects: 28% (2956/10557) remote: Counting objects: 29% (3062/10557) remote: Counting objects: 30% (3168/10557) remote: Counting objects: 31% (3273/10557) remote: Counting objects: 32% (3379/10557) remote: Counting objects: 33% (3484/10557) remote: Counting objects: 34% (3590/10557) remote: Counting objects: 35% (3695/10557) remote: Counting objects: 36% (3801/10557) remote: Counting objects: 37% (3907/10557) remote: Counting objects: 38% (4012/10557) remote: Counting objects: 39% (4118/10557) remote: Counting objects: 40% (4223/10557) remote: Counting objects: 41% (4329/10557) remote: Counting objects: 42% (4434/10557) remote: Counting objects: 43% (4540/10557) remote: Counting objects: 44% (4646/10557) remote: Counting objects: 45% (4751/10557) remote: Counting objects: 46% (4857/10557) remote: Counting objects: 47% (4962/10557) remote: Counting objects: 48% (5068/10557) remote: Counting objects: 49% (5173/10557) remote: Counting objects: 50% (5279/10557) remote: Counting objects: 51% (5385/10557) remote: Counting objects: 52% (5490/10557) remote: Counting objects: 53% (5596/10557) remote: Counting objects: 54% (5701/10557) remote: Counting objects: 55% (5807/10557) remote: Counting objects: 56% (5912/10557) remote: Counting objects: 57% (6018/10557) remote: Counting objects: 58% (6124/10557) remote: Counting objects: 59% (6229/10557) remote: Counting objects: 60% (6335/10557) remote: Counting objects: 61% (6440/10557) remote: Counting objects: 62% (6546/10557) remote: Counting objects: 63% (6651/10557) remote: Counting objects: 64% (6757/10557) remote: Counting objects: 65% (6863/10557) remote: Counting objects: 66% (6968/10557) remote: Counting objects: 67% (7074/10557) remote: Counting objects: 68% (7179/10557) remote: Counting objects: 69% (7285/10557) remote: Counting objects: 70% (7390/10557) remote: Counting objects: 71% (7496/10557) remote: Counting objects: 72% (7602/10557) remote: Counting objects: 73% (7707/10557) remote: Counting objects: 74% (7813/10557) remote: Counting objects: 75% (7918/10557) remote: Counting objects: 76% (8024/10557) remote: Counting objects: 77% (8129/10557) remote: Counting objects: 78% (8235/10557) remote: Counting objects: 79% (8341/10557) remote: Counting objects: 80% (8446/10557) remote: Counting objects: 81% (8552/10557) remote: Counting objects: 82% (8657/10557) remote: Counting objects: 83% (8763/10557) remote: Counting objects: 84% (8868/10557) remote: Counting objects: 85% (8974/10557) remote: Counting objects: 86% (9080/10557) remote: Counting objects: 87% (9185/10557) remote: Counting objects: 88% (9291/10557) remote: Counting objects: 89% (9396/10557) remote: Counting objects: 90% (9502/10557) remote: Counting objects: 91% (9607/10557) remote: Counting objects: 92% (9713/10557) remote: Counting objects: 93% (9819/10557) remote: Counting objects: 94% (9924/10557) remote: Counting objects: 95% (10030/10557) remote: Counting objects: 96% (10135/10557) remote: Counting objects: 97% (10241/10557) remote: Counting objects: 98% (10346/10557) remote: Counting objects: 99% (10452/10557) remote: Counting objects: 100% (10557/10557) remote: Counting objects: 100% (10557/10557), done.
  5. 4.43 s remote: Compressing objects: 0% (1/2952) remote: Compressing objects: 1% (30/2952) remote: Compressing objects: 2% (60/2952) remote: Compressing objects: 3% (89/2952) remote: Compressing objects: 4% (119/2952) remote: Compressing objects: 5% (148/2952) remote: Compressing objects: 6% (178/2952) remote: Compressing objects: 7% (207/2952) remote: Compressing objects: 8% (237/2952) remote: Compressing objects: 9% (266/2952) remote: Compressing objects: 10% (296/2952) remote: Compressing objects: 11% (325/2952) remote: Compressing objects: 12% (355/2952) remote: Compressing objects: 13% (384/2952) remote: Compressing objects: 14% (414/2952) remote: Compressing objects: 14% (429/2952) remote: Compressing objects: 15% (443/2952) remote: Compressing objects: 16% (473/2952) remote: Compressing objects: 17% (502/2952) remote: Compressing objects: 18% (532/2952) remote: Compressing objects: 19% (561/2952) remote: Compressing objects: 20% (591/2952) remote: Compressing objects: 21% (620/2952) remote: Compressing objects: 22% (650/2952) remote: Compressing objects: 23% (679/2952) remote: Compressing objects: 24% (709/2952) remote: Compressing objects: 24% (737/2952) remote: Compressing objects: 25% (738/2952) remote: Compressing objects: 26% (768/2952) remote: Compressing objects: 27% (798/2952) remote: Compressing objects: 28% (827/2952) remote: Compressing objects: 29% (857/2952) remote: Compressing objects: 30% (886/2952) remote: Compressing objects: 31% (916/2952) remote: Compressing objects: 31% (929/2952) remote: Compressing objects: 32% (945/2952) remote: Compressing objects: 33% (975/2952) remote: Compressing objects: 34% (1004/2952) remote: Compressing objects: 35% (1034/2952) remote: Compressing objects: 36% (1063/2952) remote: Compressing objects: 37% (1093/2952) remote: Compressing objects: 38% (1122/2952) remote: Compressing objects: 39% (1152/2952) remote: Compressing objects: 40% (1181/2952) remote: Compressing objects: 41% (1211/2952) remote: Compressing objects: 42% (1240/2952) remote: Compressing objects: 43% (1270/2952) remote: Compressing objects: 44% (1299/2952) remote: Compressing objects: 45% (1329/2952) remote: Compressing objects: 46% (1358/2952) remote: Compressing objects: 47% (1388/2952) remote: Compressing objects: 48% (1417/2952) remote: Compressing objects: 49% (1447/2952) remote: Compressing objects: 50% (1476/2952) remote: Compressing objects: 51% (1506/2952) remote: Compressing objects: 52% (1536/2952) remote: Compressing objects: 53% (1565/2952) remote: Compressing objects: 54% (1595/2952) remote: Compressing objects: 55% (1624/2952) remote: Compressing objects: 56% (1654/2952) remote: Compressing objects: 57% (1683/2952) remote: Compressing objects: 58% (1713/2952) remote: Compressing objects: 59% (1742/2952) remote: Compressing objects: 60% (1772/2952) remote: Compressing objects: 61% (1801/2952) remote: Compressing objects: 62% (1831/2952) remote: Compressing objects: 63% (1860/2952) remote: Compressing objects: 64% (1890/2952) remote: Compressing objects: 65% (1919/2952) remote: Compressing objects: 66% (1949/2952) remote: Compressing objects: 67% (1978/2952) remote: Compressing objects: 68% (2008/2952) remote: Compressing objects: 69% (2037/2952) remote: Compressing objects: 70% (2067/2952) remote: Compressing objects: 71% (2096/2952) remote: Compressing objects: 72% (2126/2952) remote: Compressing objects: 73% (2155/2952) remote: Compressing objects: 74% (2185/2952) remote: Compressing objects: 75% (2214/2952) remote: Compressing objects: 76% (2244/2952) remote: Compressing objects: 77% (2274/2952) remote: Compressing objects: 78% (2303/2952) remote: Compressing objects: 79% (2333/2952) remote: Compressing objects: 80% (2362/2952) remote: Compressing objects: 81% (2392/2952) remote: Compressing objects: 82% (2421/2952) remote: Compressing objects: 83% (2451/2952) remote: Compressing objects: 84% (2480/2952) remote: Compressing objects: 85% (2510/2952) remote: Compressing objects: 86% (2539/2952) remote: Compressing objects: 87% (2569/2952) remote: Compressing objects: 88% (2598/2952) remote: Compressing objects: 89% (2628/2952) remote: Compressing objects: 90% (2657/2952) remote: Compressing objects: 91% (2687/2952) remote: Compressing objects: 92% (2716/2952) remote: Compressing objects: 93% (2746/2952) remote: Compressing objects: 94% (2775/2952) remote: Compressing objects: 95% (2805/2952) remote: Compressing objects: 96% (2834/2952) remote: Compressing objects: 97% (2864/2952) remote: Compressing objects: 98% (2893/2952) remote: Compressing objects: 99% (2923/2952) remote: Compressing objects: 100% (2952/2952) remote: Compressing objects: 100% (2952/2952), done.
  6. 10.30 s Receiving objects: 0% (1/87989) Receiving objects: 1% (880/87989) Receiving objects: 2% (1760/87989) Receiving objects: 3% (2640/87989) Receiving objects: 4% (3520/87989) Receiving objects: 5% (4400/87989) Receiving objects: 6% (5280/87989), 8.92 MiB | 17.83 MiB/s Receiving objects: 7% (6160/87989), 8.92 MiB | 17.83 MiB/s Receiving objects: 8% (7040/87989), 8.92 MiB | 17.83 MiB/s Receiving objects: 9% (7920/87989), 8.92 MiB | 17.83 MiB/s Receiving objects: 10% (8799/87989), 8.92 MiB | 17.83 MiB/s Receiving objects: 11% (9679/87989), 8.92 MiB | 17.83 MiB/s Receiving objects: 12% (10559/87989), 8.92 MiB | 17.83 MiB/s Receiving objects: 13% (11439/87989), 8.92 MiB | 17.83 MiB/s Receiving objects: 14% (12319/87989), 8.92 MiB | 17.83 MiB/s Receiving objects: 15% (13199/87989), 8.92 MiB | 17.83 MiB/s Receiving objects: 16% (14079/87989), 8.92 MiB | 17.83 MiB/s Receiving objects: 17% (14959/87989), 8.92 MiB | 17.83 MiB/s Receiving objects: 18% (15839/87989), 8.92 MiB | 17.83 MiB/s Receiving objects: 19% (16718/87989), 8.92 MiB | 17.83 MiB/s Receiving objects: 20% (17598/87989), 8.92 MiB | 17.83 MiB/s Receiving objects: 21% (18478/87989), 8.92 MiB | 17.83 MiB/s Receiving objects: 22% (19358/87989), 8.92 MiB | 17.83 MiB/s Receiving objects: 23% (20238/87989), 8.92 MiB | 17.83 MiB/s Receiving objects: 24% (21118/87989), 8.92 MiB | 17.83 MiB/s Receiving objects: 25% (21998/87989), 8.92 MiB | 17.83 MiB/s Receiving objects: 25% (22798/87989), 8.92 MiB | 17.83 MiB/s Receiving objects: 26% (22878/87989), 8.92 MiB | 17.83 MiB/s Receiving objects: 27% (23758/87989), 25.71 MiB | 25.71 MiB/s Receiving objects: 28% (24637/87989), 25.71 MiB | 25.71 MiB/s Receiving objects: 29% (25517/87989), 25.71 MiB | 25.71 MiB/s Receiving objects: 30% (26397/87989), 25.71 MiB | 25.71 MiB/s Receiving objects: 31% (27277/87989), 25.71 MiB | 25.71 MiB/s Receiving objects: 32% (28157/87989), 25.71 MiB | 25.71 MiB/s Receiving objects: 33% (29037/87989), 25.71 MiB | 25.71 MiB/s Receiving objects: 34% (29917/87989), 25.71 MiB | 25.71 MiB/s Receiving objects: 35% (30797/87989), 25.71 MiB | 25.71 MiB/s Receiving objects: 36% (31677/87989), 25.71 MiB | 25.71 MiB/s Receiving objects: 37% (32556/87989), 25.71 MiB | 25.71 MiB/s Receiving objects: 38% (33436/87989), 25.71 MiB | 25.71 MiB/s Receiving objects: 39% (34316/87989), 25.71 MiB | 25.71 MiB/s Receiving objects: 40% (35196/87989), 25.71 MiB | 25.71 MiB/s Receiving objects: 41% (36076/87989), 25.71 MiB | 25.71 MiB/s Receiving objects: 42% (36956/87989), 25.71 MiB | 25.71 MiB/s Receiving objects: 43% (37836/87989), 40.96 MiB | 26.83 MiB/s Receiving objects: 44% (38716/87989), 40.96 MiB | 26.83 MiB/s Receiving objects: 45% (39596/87989), 40.96 MiB | 26.83 MiB/s Receiving objects: 46% (40475/87989), 40.96 MiB | 26.83 MiB/s Receiving objects: 47% (41355/87989), 40.96 MiB | 26.83 MiB/s Receiving objects: 48% (42235/87989), 40.96 MiB | 26.83 MiB/s Receiving objects: 49% (43115/87989), 40.96 MiB | 26.83 MiB/s Receiving objects: 50% (43995/87989), 40.96 MiB | 26.83 MiB/s Receiving objects: 51% (44875/87989), 40.96 MiB | 26.83 MiB/s Receiving objects: 52% (45755/87989), 40.96 MiB | 26.83 MiB/s Receiving objects: 52% (46286/87989), 40.96 MiB | 26.83 MiB/s Receiving objects: 53% (46635/87989), 56.74 MiB | 27.96 MiB/s Receiving objects: 54% (47515/87989), 56.74 MiB | 27.96 MiB/s Receiving objects: 55% (48394/87989), 56.74 MiB | 27.96 MiB/s Receiving objects: 56% (49274/87989), 56.74 MiB | 27.96 MiB/s Receiving objects: 57% (50154/87989), 56.74 MiB | 27.96 MiB/s Receiving objects: 58% (51034/87989), 56.74 MiB | 27.96 MiB/s Receiving objects: 59% (51914/87989), 72.60 MiB | 28.70 MiB/s Receiving objects: 60% (52794/87989), 72.60 MiB | 28.70 MiB/s Receiving objects: 61% (53674/87989), 72.60 MiB | 28.70 MiB/s Receiving objects: 62% (54554/87989), 72.60 MiB | 28.70 MiB/s Receiving objects: 63% (55434/87989), 72.60 MiB | 28.70 MiB/s Receiving objects: 64% (56313/87989), 72.60 MiB | 28.70 MiB/s Receiving objects: 65% (57193/87989), 72.60 MiB | 28.70 MiB/s Receiving objects: 65% (57359/87989), 87.59 MiB | 28.91 MiB/s Receiving objects: 66% (58073/87989), 102.91 MiB | 29.16 MiB/s Receiving objects: 67% (58953/87989), 102.91 MiB | 29.16 MiB/s Receiving objects: 68% (59833/87989), 102.91 MiB | 29.16 MiB/s Receiving objects: 69% (60713/87989), 102.91 MiB | 29.16 MiB/s Receiving objects: 70% (61593/87989), 102.91 MiB | 29.16 MiB/s Receiving objects: 71% (62473/87989), 102.91 MiB | 29.16 MiB/s Receiving objects: 71% (63231/87989), 118.54 MiB | 29.38 MiB/s Receiving objects: 72% (63353/87989), 118.54 MiB | 29.38 MiB/s Receiving objects: 73% (64232/87989), 118.54 MiB | 29.38 MiB/s Receiving objects: 74% (65112/87989), 118.54 MiB | 29.38 MiB/s Receiving objects: 75% (65992/87989), 118.54 MiB | 29.38 MiB/s Receiving objects: 76% (66872/87989), 118.54 MiB | 29.38 MiB/s Receiving objects: 77% (67752/87989), 118.54 MiB | 29.38 MiB/s Receiving objects: 78% (68632/87989), 118.54 MiB | 29.38 MiB/s Receiving objects: 79% (69512/87989), 134.82 MiB | 29.73 MiB/s Receiving objects: 80% (70392/87989), 134.82 MiB | 29.73 MiB/s Receiving objects: 81% (71272/87989), 134.82 MiB | 29.73 MiB/s Receiving objects: 82% (72151/87989), 134.82 MiB | 29.73 MiB/s Receiving objects: 83% (73031/87989), 134.82 MiB | 29.73 MiB/s Receiving objects: 84% (73911/87989), 134.82 MiB | 29.73 MiB/s Receiving objects: 85% (74791/87989), 134.82 MiB | 29.73 MiB/s Receiving objects: 86% (75671/87989), 134.82 MiB | 29.73 MiB/s Receiving objects: 87% (76551/87989), 134.82 MiB | 29.73 MiB/s Receiving objects: 87% (77326/87989), 134.82 MiB | 29.73 MiB/s Receiving objects: 88% (77431/87989), 134.82 MiB | 29.73 MiB/s Receiving objects: 89% (78311/87989), 134.82 MiB | 29.73 MiB/s Receiving objects: 90% (79191/87989), 134.82 MiB | 29.73 MiB/s Receiving objects: 91% (80070/87989), 134.82 MiB | 29.73 MiB/s Receiving objects: 92% (80950/87989), 134.82 MiB | 29.73 MiB/s Receiving objects: 93% (81830/87989), 150.77 MiB | 31.28 MiB/s Receiving objects: 94% (82710/87989), 150.77 MiB | 31.28 MiB/s Receiving objects: 95% (83590/87989), 150.77 MiB | 31.28 MiB/s Receiving objects: 96% (84470/87989), 150.77 MiB | 31.28 MiB/s Receiving objects: 97% (85350/87989), 150.77 MiB | 31.28 MiB/s Receiving objects: 98% (86230/87989), 150.77 MiB | 31.28 MiB/s Receiving objects: 99% (87110/87989), 167.20 MiB | 31.21 MiB/s remote: Total 87989 (delta 8613), reused 8381 (delta 7579), pack-reused 77432 (from 3)
  7. 10.30 s Receiving objects: 100% (87989/87989), 167.20 MiB | 31.21 MiB/s Receiving objects: 100% (87989/87989), 176.53 MiB | 30.24 MiB/s, done.
  8. 11.27 s Resolving deltas: 0% (0/59508) Resolving deltas: 1% (596/59508) Resolving deltas: 2% (1191/59508) Resolving deltas: 3% (1786/59508) Resolving deltas: 4% (2382/59508) Resolving deltas: 5% (2976/59508) Resolving deltas: 6% (3571/59508) Resolving deltas: 7% (4166/59508) Resolving deltas: 8% (4761/59508) Resolving deltas: 9% (5358/59508) Resolving deltas: 10% (5951/59508) Resolving deltas: 11% (6546/59508) Resolving deltas: 12% (7141/59508) Resolving deltas: 13% (7737/59508) Resolving deltas: 14% (8332/59508) Resolving deltas: 15% (8929/59508) Resolving deltas: 16% (9523/59508) Resolving deltas: 17% (10117/59508) Resolving deltas: 18% (10712/59508) Resolving deltas: 19% (11307/59508) Resolving deltas: 20% (11902/59508) Resolving deltas: 21% (12497/59508) Resolving deltas: 22% (13092/59508) Resolving deltas: 23% (13687/59508) Resolving deltas: 24% (14282/59508) Resolving deltas: 25% (14877/59508) Resolving deltas: 26% (15473/59508) Resolving deltas: 27% (16068/59508) Resolving deltas: 28% (16663/59508) Resolving deltas: 29% (17258/59508) Resolving deltas: 30% (17854/59508) Resolving deltas: 31% (18448/59508) Resolving deltas: 32% (19043/59508) Resolving deltas: 33% (19640/59508) Resolving deltas: 34% (20233/59508) Resolving deltas: 35% (20830/59508) Resolving deltas: 36% (21424/59508) Resolving deltas: 37% (22019/59508) Resolving deltas: 38% (22614/59508) Resolving deltas: 39% (23209/59508) Resolving deltas: 40% (23804/59508) Resolving deltas: 41% (24399/59508) Resolving deltas: 42% (24996/59508) Resolving deltas: 43% (25589/59508) Resolving deltas: 44% (26184/59508) Resolving deltas: 45% (26779/59508) Resolving deltas: 46% (27374/59508) Resolving deltas: 47% (27969/59508) Resolving deltas: 48% (28564/59508) Resolving deltas: 49% (29160/59508) Resolving deltas: 50% (29754/59508) Resolving deltas: 51% (30350/59508) Resolving deltas: 52% (30945/59508) Resolving deltas: 53% (31540/59508) Resolving deltas: 54% (32135/59508) Resolving deltas: 55% (32730/59508) Resolving deltas: 56% (33326/59508) Resolving deltas: 57% (33921/59508) Resolving deltas: 58% (34515/59508) Resolving deltas: 59% (35110/59508) Resolving deltas: 60% (35705/59508) Resolving deltas: 61% (36300/59508) Resolving deltas: 62% (36895/59508) Resolving deltas: 63% (37491/59508) Resolving deltas: 64% (38086/59508) Resolving deltas: 65% (38681/59508) Resolving deltas: 66% (39276/59508) Resolving deltas: 67% (39871/59508) Resolving deltas: 68% (40466/59508) Resolving deltas: 69% (41061/59508) Resolving deltas: 70% (41656/59508) Resolving deltas: 71% (42251/59508) Resolving deltas: 72% (42846/59508) Resolving deltas: 73% (43441/59508) Resolving deltas: 74% (44036/59508) Resolving deltas: 75% (44631/59508) Resolving deltas: 76% (45227/59508) Resolving deltas: 77% (45822/59508) Resolving deltas: 78% (46417/59508) Resolving deltas: 79% (47014/59508) Resolving deltas: 80% (47608/59508) Resolving deltas: 81% (48204/59508) Resolving deltas: 82% (48797/59508) Resolving deltas: 83% (49394/59508) Resolving deltas: 84% (49987/59508) Resolving deltas: 85% (50582/59508) Resolving deltas: 86% (51177/59508) Resolving deltas: 87% (51772/59508) Resolving deltas: 88% (52368/59508) Resolving deltas: 89% (52963/59508) Resolving deltas: 90% (53558/59508) Resolving deltas: 91% (54153/59508) Resolving deltas: 92% (54748/59508) Resolving deltas: 93% (55343/59508) Resolving deltas: 94% (55939/59508) Resolving deltas: 95% (56533/59508) Resolving deltas: 96% (57128/59508) Resolving deltas: 97% (57724/59508) Resolving deltas: 98% (58318/59508) Resolving deltas: 99% (58913/59508) Resolving deltas: 100% (59508/59508) Resolving deltas: 100% (59508/59508), done.
  9. 11.64 s Fetching commit 4338252f3f6441dd1159617dee545403b8fb24d4 for docs ...
  10. 11.64 s $ /nix/store/bcnisk3ydfgv26v2gw3zlky24g00yww2-git-2.54.0/bin/git fetch origin 4338252f3f6441dd1159617dee545403b8fb24d4
  11. 12.11 s From https://github.com/alphal00p/gammaloop
  12. 12.11 s * branch 4338252f3f6441dd1159617dee545403b8fb24d4 -> FETCH_HEAD
  13. 12.12 s $ /nix/store/9ypz3flqsrl5xl495mm8h645gadjsxi1-coreutils-9.11/bin/timeout --kill-after=15s 7200s /nix/store/bcnisk3ydfgv26v2gw3zlky24g00yww2-git-2.54.0/bin/git -c advice.detachedHead=false checkout 4338252f3f6441dd1159617dee545403b8fb24d4
  14. 12.33 s HEAD is now at 4338252f3 embed live WASM notebooks in the product guides
  15. 12.33 s $ /nix/store/9ypz3flqsrl5xl495mm8h645gadjsxi1-coreutils-9.11/bin/timeout --kill-after=15s 7200s /nix/store/23zk8sgzamrbmj1fday15szf7f2279s8-nix-2.34.7/bin/nix --extra-experimental-features nix-command --extra-experimental-features flakes --log-format internal-json run .#packages.x86_64-linux.nix-ci-check-gammaloop-nextest-core --print-build-logs
  16. 16.35 s
  17. 16.50 s Downloading cached gammaloop-nextest-binaries-core-gammaloop-api from https://cache.nix-ci.com
  18. 16.50 s Downloading cached gammaloop-nextest-binaries-core-gammaloop-tracing-filter from https://cache.nix-ci.com
  19. 16.50 s Downloading cached gammaloop-nextest-binaries-core-gammaloop-tracing-filter-macros from https://cache.nix-ci.com
  20. 16.50 s Downloading cached gammaloop-nextest-binaries-core-gammalooprs from https://cache.nix-ci.com
  21. 16.80 s Downloaded cached gammaloop-nextest-binaries-core-gammaloop-tracing-filter-macros (2.2 MiB) in 302ms
  22. 16.80 s Progress: 0 of 1 built, 1 of 6 downloaded from cache (3 downloading)
  23. 17.95 s Downloaded cached gammaloop-nextest-binaries-core-gammalooprs (81.3 MiB) in 1.4s
  24. 17.95 s Progress: 0 of 1 built, 2 of 6 downloaded from cache (2 downloading)
  25. 18.33 s Downloaded cached gammaloop-nextest-binaries-core-gammaloop-tracing-filter (8.5 MiB) in 1.8s
  26. 18.33 s Progress: 0 of 1 built, 3 of 6 downloaded from cache (1 downloading)
  27. 18.85 s Downloaded cached gammaloop-nextest-binaries-core-gammaloop-api (70.6 MiB) in 2.3s
  28. 18.85 s Progress: 0 of 1 built, 4 of 6 downloaded from cache
  29. 18.85 s Downloading cached gammaloop-nextest-binaries-core from https://cache.nix-ci.com
  30. 18.90 s Downloaded cached gammaloop-nextest-binaries-core (1640 B) in 54ms
  31. 18.90 s Progress: 0 of 1 built, 5 of 6 downloaded from cache
  32. 18.90 s Downloading cached nix-ci-check-gammaloop-nextest-core from https://cache.nix-ci.com
  33. 18.97 s Downloaded cached nix-ci-check-gammaloop-nextest-core (1016 B) in 67ms
  34. 18.97 s Progress: 0 of 1 built, 6 of 6 downloaded from cache
  35. 24.15 s evaluating derivation 'g copying '/nix/store/bgss evaluating derivation 'g copying '/nix/store/bgss evaluating derivation 'g copying '/nix/store/bgss evaluating derivation 'g copying '/nix/store/bgss evaluating derivation 'g copying '/nix/store/bgss evaluating derivation 'g copying '/nix/store/bgss evaluating derivation 'g copying '/nix/store/bgss evaluating derivation 'g querying gammaloop-nexte [0.0 KiB DL] [0/1 built, 0.0 KiB DL] [1/0/1 built, 0.0 KiB DLgammaloop-nextest-core> Extracting 4 binaries (including 2 non-test binaries), 1 build script output directory, and 2 linked paths to /build/source
  36. 24.57 s gammaloop-nextest-core> Extracted 20 files to /build/source in 0.42s
  37. 24.58 s gammaloop-nextest-core> ------------
  38. 24.58 s gammaloop-nextest-core> Nextest run ID 6038990f-e876-4dc3-944b-6e9ecc178ba9 with nextest profile: ci_gammaloop
  39. 24.58 s gammaloop-nextest-core> Starting 339 tests across 2 binaries (1 test skipped)
  40. 24.87 s gammaloop-nextest-core> FAIL [ 0.022s] (248/339) gammaloop-api repl::tests::completion_shows_type_hint_for_non_boolean_settings_leaf
  41. 24.87 s gammaloop-nextest-core> stdout ---
  42. 24.87 s gammaloop-nextest-core>
  43. 24.87 s gammaloop-nextest-core> running 1 test
  44. 24.87 s gammaloop-nextest-core> test repl::tests::completion_shows_type_hint_for_non_boolean_settings_leaf ... FAILED
  45. 24.87 s gammaloop-nextest-core>
  46. 24.87 s gammaloop-nextest-core> failures:
  47. 24.87 s gammaloop-nextest-core>
  48. 24.87 s gammaloop-nextest-core> failures:
  49. 24.87 s gammaloop-nextest-core> repl::tests::completion_shows_type_hint_for_non_boolean_settings_leaf
  50. 24.87 s gammaloop-nextest-core>
  51. 24.87 s gammaloop-nextest-core> test result: FAILED. 0 passed; 1 failed; 0 ignored; 0 measured; 339 filtered out; finished in 0.01s
  52. 24.87 s gammaloop-nextest-core>
  53. 24.87 s gammaloop-nextest-core> stderr ---
  54. 24.87 s gammaloop-nextest-core>
  55. 24.87 s gammaloop-nextest-core> thread 'repl::tests::completion_shows_type_hint_for_non_boolean_settings_leaf' (779) panicked at crates/gammaloop-api/src/repl.rs:5772:9:
  56. 24.87 s gammaloop-nextest-core> [Suggestion { value: "", description: Some("expects an integer"), style: None, extra: None, span: Span { start: 42, end: 42 }, append_whitespace: false }]
  57. 24.87 s gammaloop-nextest-core> stack backtrace:
  58. 24.87 s gammaloop-nextest-core> 0: __rustc::rust_begin_unwind
  59. 24.87 s gammaloop-nextest-core> 1: core::panicking::panic_fmt
  60. 24.87 s gammaloop-nextest-core> 2: gammaloop_api::repl::tests::completion_shows_type_hint_for_non_boolean_settings_leaf
  61. 24.87 s gammaloop-nextest-core> 3: <gammaloop_api::repl::tests::completion_shows_type_hint_for_non_boolean_settings_leaf::{closure#0} as core::ops::function::FnOnce<()>>::call_once
  62. 24.87 s gammaloop-nextest-core> note: Some details are omitted, run with `RUST_BACKTRACE=full` for a verbose backtrace.
  63. 24.87 s gammaloop-nextest-core>
  64. 25.02 s gammaloop-nextest-core> ------------
  65. 25.02 s gammaloop-nextest-core> Summary [ 0.439s] 339 tests run: 338 passed, 1 failed, 1 skipped
  66. 25.02 s gammaloop-nextest-core> FAIL [ 0.022s] (248/339) gammaloop-api repl::tests::completion_shows_type_hint_for_non_boolean_settings_leaf
  67. 25.02 s gammaloop-nextest-core> stdout ---
  68. 25.02 s gammaloop-nextest-core>
  69. 25.02 s gammaloop-nextest-core> running 1 test
  70. 25.02 s gammaloop-nextest-core> test repl::tests::completion_shows_type_hint_for_non_boolean_settings_leaf ... FAILED
  71. 25.02 s gammaloop-nextest-core>
  72. 25.02 s gammaloop-nextest-core> failures:
  73. 25.02 s gammaloop-nextest-core>
  74. 25.02 s gammaloop-nextest-core> failures:
  75. 25.02 s gammaloop-nextest-core> repl::tests::completion_shows_type_hint_for_non_boolean_settings_leaf
  76. 25.02 s gammaloop-nextest-core>
  77. 25.02 s gammaloop-nextest-core> test result: FAILED. 0 passed; 1 failed; 0 ignored; 0 measured; 339 filtered out; finished in 0.01s
  78. 25.02 s gammaloop-nextest-core>
  79. 25.02 s gammaloop-nextest-core> stderr ---
  80. 25.02 s gammaloop-nextest-core>
  81. 25.02 s gammaloop-nextest-core> thread 'repl::tests::completion_shows_type_hint_for_non_boolean_settings_leaf' (779) panicked at crates/gammaloop-api/src/repl.rs:5772:9:
  82. 25.02 s gammaloop-nextest-core> [Suggestion { value: "", description: Some("expects an integer"), style: None, extra: None, span: Span { start: 42, end: 42 }, append_whitespace: false }]
  83. 25.02 s gammaloop-nextest-core> stack backtrace:
  84. 25.02 s gammaloop-nextest-core> 0: __rustc::rust_begin_unwind
  85. 25.02 s gammaloop-nextest-core> 1: core::panicking::panic_fmt
  86. 25.02 s gammaloop-nextest-core> 2: gammaloop_api::repl::tests::completion_shows_type_hint_for_non_boolean_settings_leaf
  87. 25.02 s gammaloop-nextest-core> 3: <gammaloop_api::repl::tests::completion_shows_type_hint_for_non_boolean_settings_leaf::{closure#0} as core::ops::function::FnOnce<()>>::call_once
  88. 25.02 s gammaloop-nextest-core> note: Some details are omitted, run with `RUST_BACKTRACE=full` for a verbose backtrace.
  89. 25.02 s gammaloop-nextest-core>
  90. 25.03 s gammaloop-nextest-core> error: test run failed
  91. 25.06 s gammaloop-nextest-core>
  92. 25.06 s gammaloop-nextest-core> ========== nextest test summary ==========
  93. 25.06 s gammaloop-nextest-core> report: target/nextest/ci_gammaloop/junit.xml
  94. 25.06 s gammaloop-nextest-core> tests: 339, failures: 1, errors: 0
  95. 25.06 s gammaloop-nextest-core>
  96. 25.06 s gammaloop-nextest-core> 1. gammaloop-api::repl::tests::completion_shows_type_hint_for_non_boolean_settings_leaf
  97. 25.06 s gammaloop-nextest-core> failure: test failure with exit code 101
  98. 25.06 s gammaloop-nextest-core> thread 'repl::tests::completion_shows_type_hint_for_non_boolean_settings_leaf' (779) panicked at crates/gammaloop-api/src/repl.rs:5772:9:
  99. 25.06 s gammaloop-nextest-core> [Suggestion { value: "", description: Some("expects an integer"), style: None, extra: None, span: Span { start: 42, end: 42 }, append_whitespace: false }]
  100. 25.06 s gammaloop-nextest-core> stack backtrace:
  101. 25.06 s gammaloop-nextest-core> 0: __rustc::rust_begin_unwind
  102. 25.06 s gammaloop-nextest-core> 1: core::panicking::panic_fmt
  103. 25.06 s gammaloop-nextest-core> 2: gammaloop_api::repl::tests::completion_shows_type_hint_for_non_boolean_settings_leaf
  104. 25.06 s gammaloop-nextest-core> 3: <gammaloop_api::repl::tests::completion_shows_type_hint_for_non_boolean_settings_leaf::{closure#0} as core::ops::function::FnOnce<()>>::call_once
  105. 25.06 s gammaloop-nextest-core> note: Some details are omitted, run with `RUST_BACKTRACE=full` for a verbose backtrace.
  106. 25.06 s gammaloop-nextest-core> system-out
  107. 25.06 s gammaloop-nextest-core> running 1 test
  108. 25.06 s gammaloop-nextest-core> test repl::tests::completion_shows_type_hint_for_non_boolean_settings_leaf ... FAILED
  109. 25.06 s gammaloop-nextest-core>
  110. 25.06 s gammaloop-nextest-core> failures:
  111. 25.06 s gammaloop-nextest-core>
  112. 25.06 s gammaloop-nextest-core> failures:
  113. 25.06 s gammaloop-nextest-core> repl::tests::completion_shows_type_hint_for_non_boolean_settings_leaf
  114. 25.06 s gammaloop-nextest-core>
  115. 25.06 s gammaloop-nextest-core> test result: FAILED. 0 passed; 1 failed; 0 ignored; 0 measured; 339 filtered out; finished in 0.01s
  116. 25.06 s gammaloop-nextest-core> system-err
  117. 25.06 s gammaloop-nextest-core> thread 'repl::tests::completion_shows_type_hint_for_non_boolean_settings_leaf' (779) panicked at crates/gammaloop-api/src/repl.rs:5772:9:
  118. 25.06 s gammaloop-nextest-core> [Suggestion { value: "", description: Some("expects an integer"), style: None, extra: None, span: Span { start: 42, end: 42 }, append_whitespace: false }]
  119. 25.06 s gammaloop-nextest-core> stack backtrace:
  120. 25.06 s gammaloop-nextest-core> 0: __rustc::rust_begin_unwind
  121. 25.06 s gammaloop-nextest-core> 1: core::panicking::panic_fmt
  122. 25.06 s gammaloop-nextest-core> 2: gammaloop_api::repl::tests::completion_shows_type_hint_for_non_boolean_settings_leaf
  123. 25.06 s gammaloop-nextest-core> 3: <gammaloop_api::repl::tests::completion_shows_type_hint_for_non_boolean_settings_leaf::{closure#0} as core::ops::function::FnOnce<()>>::call_once
  124. 25.06 s gammaloop-nextest-core> note: Some details are omitted, run with `RUST_BACKTRACE=full` for a verbose backtrace.
  125. 25.06 s gammaloop-nextest-core> =========================================
  126. 25.07 s gammaloop-nextest-core> Extracting 1 binary and 1 linked path to /build/source
  127. 25.14 s gammaloop-nextest-core> Extracted 7 files to /build/source in 0.07s
  128. 25.16 s gammaloop-nextest-core> ------------
  129. 25.16 s gammaloop-nextest-core> Nextest run ID 479bdf14-0de9-4397-aec3-938028ab79d9 with nextest profile: ci_gammaloop
  130. 25.16 s gammaloop-nextest-core> Starting 19 tests across 1 binary
  131. 25.17 s gammaloop-nextest-core> ------------
  132. 25.17 s gammaloop-nextest-core> Summary [ 0.011s] 19 tests run: 19 passed, 0 skipped
  133. 25.20 s gammaloop-nextest-core>
  134. 25.20 s gammaloop-nextest-core> ========== nextest test summary ==========
  135. 25.20 s gammaloop-nextest-core> report: target/nextest/ci_gammaloop/junit.xml
  136. 25.20 s gammaloop-nextest-core> tests: 19, failures: 0, errors: 0
  137. 25.20 s gammaloop-nextest-core> No failing testcases found.
  138. 25.20 s gammaloop-nextest-core> =========================================
  139. 25.21 s gammaloop-nextest-core> Extracting 1 binary to /build/source
  140. 25.24 s gammaloop-nextest-core> Extracted 4 files to /build/source in 0.03s
  141. 25.25 s gammaloop-nextest-core> ------------
  142. 25.25 s gammaloop-nextest-core> Nextest run ID 2f0680b5-6150-4734-a5cb-da2524cfdfd8 with nextest profile: ci_gammaloop
  143. 25.25 s gammaloop-nextest-core> Starting 0 tests across 1 binary
  144. 25.25 s gammaloop-nextest-core> ------------
  145. 25.25 s gammaloop-nextest-core> Summary [ 0.000s] 0 tests run: 0 passed, 0 skipped
  146. 25.28 s gammaloop-nextest-core>
  147. 25.28 s gammaloop-nextest-core> ========== nextest test summary ==========
  148. 25.28 s gammaloop-nextest-core> report: target/nextest/ci_gammaloop/junit.xml
  149. 25.28 s gammaloop-nextest-core> tests: 0, failures: 0, errors: 0
  150. 25.28 s gammaloop-nextest-core> No failing testcases found.
  151. 25.28 s gammaloop-nextest-core> =========================================
  152. 25.29 s gammaloop-nextest-core> Extracting 5 binaries (including 1 non-test binary), 1 build script output directory, and 2 linked paths to /build/source
  153. 25.74 s gammaloop-nextest-core> Extracted 20 files to /build/source in 0.44s
  154. 25.75 s gammaloop-nextest-core> ------------
  155. 25.75 s gammaloop-nextest-core> Nextest run ID 04e44091-0db6-4924-bc7d-7fc736847e4f with nextest profile: ci_gammaloop
  156. 25.75 s gammaloop-nextest-core> Starting 456 tests across 4 binaries (61 tests skipped, including 60 tests via profile.ci_gammaloop.default-filter)
  157. 33.58 s gammaloop-nextest-core> ------------
  158. 33.58 s gammaloop-nextest-core> Summary [ 7.832s] 456 tests run: 456 passed, 61 skipped
  159. 33.61 s gammaloop-nextest-core>
  160. 33.61 s gammaloop-nextest-core> ========== nextest test summary ==========
  161. 33.61 s gammaloop-nextest-core> report: target/nextest/ci_gammaloop/junit.xml
  162. 33.61 s gammaloop-nextest-core> tests: 456, failures: 0, errors: 0
  163. 33.61 s gammaloop-nextest-core> No failing testcases found.
  164. 33.61 s gammaloop-nextest-core> =========================================
  165. 33.77 s error: Cannot build '/nix/store/02car8gk7i8dx2vfklks1bn8vxkmhh2r-gammaloop-nextest-core.drv'.
  166. 33.77 s Reason: builder failed with exit code 100.
  167. 33.77 s Output paths:
  168. 33.77 s /nix/store/mmzjp7789sw5r7w83acrb3ly0aj0pkbl-gammaloop-nextest-core
  169. 33.77 s Last 130 log lines:
  170. 33.77 s > Extracting 4 binaries (including 2 non-test binaries), 1 build script output directory, and 2 linked paths to /build/source
  171. 33.77 s > Extracted 20 files to /build/source in 0.42s
  172. 33.77 s > ------------
  173. 33.77 s > Nextest run ID 6038990f-e876-4dc3-944b-6e9ecc178ba9 with nextest profile: ci_gammaloop
  174. 33.77 s > Starting 339 tests across 2 binaries (1 test skipped)
  175. 33.77 s > FAIL [ 0.022s] (248/339) gammaloop-api repl::tests::completion_shows_type_hint_for_non_boolean_settings_leaf
  176. 33.77 s > stdout ---
  177. 33.77 s >
  178. 33.77 s > running 1 test
  179. 33.77 s > test repl::tests::completion_shows_type_hint_for_non_boolean_settings_leaf ... FAILED
  180. 33.77 s >
  181. 33.77 s > failures:
  182. 33.77 s >
  183. 33.77 s > failures:
  184. 33.77 s > repl::tests::completion_shows_type_hint_for_non_boolean_settings_leaf
  185. 33.77 s >
  186. 33.77 s > test result: FAILED. 0 passed; 1 failed; 0 ignored; 0 measured; 339 filtered out; finished in 0.01s
  187. 33.77 s >
  188. 33.77 s > stderr ---
  189. 33.77 s >
  190. 33.77 s > thread 'repl::tests::completion_shows_type_hint_for_non_boolean_settings_leaf' (779) panicked at crates/gammaloop-api/src/repl.rs:5772:9:
  191. 33.77 s > [Suggestion { value: "", description: Some("expects an integer"), style: None, extra: None, span: Span { start: 42, end: 42 }, append_whitespace: false }]
  192. 33.77 s > stack backtrace:
  193. 33.77 s > 0: __rustc::rust_begin_unwind
  194. 33.77 s > 1: core::panicking::panic_fmt
  195. 33.77 s > 2: gammaloop_api::repl::tests::completion_shows_type_hint_for_non_boolean_settings_leaf
  196. 33.77 s > 3: <gammaloop_api::repl::tests::completion_shows_type_hint_for_non_boolean_settings_leaf::{closure#0} as core::ops::function::FnOnce<()>>::call_once
  197. 33.77 s > note: Some details are omitted, run with `RUST_BACKTRACE=full` for a verbose backtrace.
  198. 33.77 s >
  199. 33.77 s > ------------
  200. 33.77 s > Summary [ 0.439s] 339 tests run: 338 passed, 1 failed, 1 skipped
  201. 33.77 s > FAIL [ 0.022s] (248/339) gammaloop-api repl::tests::completion_shows_type_hint_for_non_boolean_settings_leaf
  202. 33.77 s > stdout ---
  203. 33.77 s >
  204. 33.77 s > running 1 test
  205. 33.77 s > test repl::tests::completion_shows_type_hint_for_non_boolean_settings_leaf ... FAILED
  206. 33.77 s >
  207. 33.77 s > failures:
  208. 33.77 s >
  209. 33.77 s > failures:
  210. 33.77 s > repl::tests::completion_shows_type_hint_for_non_boolean_settings_leaf
  211. 33.77 s >
  212. 33.77 s > test result: FAILED. 0 passed; 1 failed; 0 ignored; 0 measured; 339 filtered out; finished in 0.01s
  213. 33.77 s >
  214. 33.77 s > stderr ---
  215. 33.77 s >
  216. 33.77 s > thread 'repl::tests::completion_shows_type_hint_for_non_boolean_settings_leaf' (779) panicked at crates/gammaloop-api/src/repl.rs:5772:9:
  217. 33.77 s > [Suggestion { value: "", description: Some("expects an integer"), style: None, extra: None, span: Span { start: 42, end: 42 }, append_whitespace: false }]
  218. 33.77 s > stack backtrace:
  219. 33.77 s > 0: __rustc::rust_begin_unwind
  220. 33.77 s > 1: core::panicking::panic_fmt
  221. 33.77 s > 2: gammaloop_api::repl::tests::completion_shows_type_hint_for_non_boolean_settings_leaf
  222. 33.77 s > 3: <gammaloop_api::repl::tests::completion_shows_type_hint_for_non_boolean_settings_leaf::{closure#0} as core::ops::function::FnOnce<()>>::call_once
  223. 33.77 s > note: Some details are omitted, run with `RUST_BACKTRACE=full` for a verbose backtrace.
  224. 33.77 s >
  225. 33.77 s > error: test run failed
  226. 33.77 s >
  227. 33.77 s > ========== nextest test summary ==========
  228. 33.77 s > report: target/nextest/ci_gammaloop/junit.xml
  229. 33.77 s > tests: 339, failures: 1, errors: 0
  230. 33.77 s >
  231. 33.77 s > 1. gammaloop-api::repl::tests::completion_shows_type_hint_for_non_boolean_settings_leaf
  232. 33.77 s > failure: test failure with exit code 101
  233. 33.77 s > thread 'repl::tests::completion_shows_type_hint_for_non_boolean_settings_leaf' (779) panicked at crates/gammaloop-api/src/repl.rs:5772:9:
  234. 33.77 s > [Suggestion { value: "", description: Some("expects an integer"), style: None, extra: None, span: Span { start: 42, end: 42 }, append_whitespace: false }]
  235. 33.77 s > stack backtrace:
  236. 33.77 s > 0: __rustc::rust_begin_unwind
  237. 33.77 s > 1: core::panicking::panic_fmt
  238. 33.77 s > 2: gammaloop_api::repl::tests::completion_shows_type_hint_for_non_boolean_settings_leaf
  239. 33.77 s > 3: <gammaloop_api::repl::tests::completion_shows_type_hint_for_non_boolean_settings_leaf::{closure#0} as core::ops::function::FnOnce<()>>::call_once
  240. 33.77 s > note: Some details are omitted, run with `RUST_BACKTRACE=full` for a verbose backtrace.
  241. 33.77 s > system-out
  242. 33.77 s > running 1 test
  243. 33.77 s > test repl::tests::completion_shows_type_hint_for_non_boolean_settings_leaf ... FAILED
  244. 33.77 s >
  245. 33.77 s > failures:
  246. 33.77 s >
  247. 33.77 s > failures:
  248. 33.77 s > repl::tests::completion_shows_type_hint_for_non_boolean_settings_leaf
  249. 33.77 s >
  250. 33.77 s > test result: FAILED. 0 passed; 1 failed; 0 ignored; 0 measured; 339 filtered out; finished in 0.01s
  251. 33.77 s > system-err
  252. 33.77 s > thread 'repl::tests::completion_shows_type_hint_for_non_boolean_settings_leaf' (779) panicked at crates/gammaloop-api/src/repl.rs:5772:9:
  253. 33.77 s > [Suggestion { value: "", description: Some("expects an integer"), style: None, extra: None, span: Span { start: 42, end: 42 }, append_whitespace: false }]
  254. 33.77 s > stack backtrace:
  255. 33.77 s > 0: __rustc::rust_begin_unwind
  256. 33.77 s > 1: core::panicking::panic_fmt
  257. 33.77 s > 2: gammaloop_api::repl::tests::completion_shows_type_hint_for_non_boolean_settings_leaf
  258. 33.77 s > 3: <gammaloop_api::repl::tests::completion_shows_type_hint_for_non_boolean_settings_leaf::{closure#0} as core::ops::function::FnOnce<()>>::call_once
  259. 33.77 s > note: Some details are omitted, run with `RUST_BACKTRACE=full` for a verbose backtrace.
  260. 33.77 s > =========================================
  261. 33.77 s > Extracting 1 binary and 1 linked path to /build/source
  262. 33.77 s > Extracted 7 files to /build/source in 0.07s
  263. 33.77 s > ------------
  264. 33.77 s > Nextest run ID 479bdf14-0de9-4397-aec3-938028ab79d9 with nextest profile: ci_gammaloop
  265. 33.77 s > Starting 19 tests across 1 binary
  266. 33.77 s > ------------
  267. 33.77 s > Summary [ 0.011s] 19 tests run: 19 passed, 0 skipped
  268. 33.77 s >
  269. 33.77 s > ========== nextest test summary ==========
  270. 33.77 s > report: target/nextest/ci_gammaloop/junit.xml
  271. 33.77 s > tests: 19, failures: 0, errors: 0
  272. 33.77 s > No failing testcases found.
  273. 33.77 s > =========================================
  274. 33.77 s > Extracting 1 binary to /build/source
  275. 33.77 s > Extracted 4 files to /build/source in 0.03s
  276. 33.77 s > ------------
  277. 33.77 s > Nextest run ID 2f0680b5-6150-4734-a5cb-da2524cfdfd8 with nextest profile: ci_gammaloop
  278. 33.77 s > Starting 0 tests across 1 binary
  279. 33.77 s > ------------
  280. 33.77 s > Summary [ 0.000s] 0 tests run: 0 passed, 0 skipped
  281. 33.77 s >
  282. 33.77 s > ========== nextest test summary ==========
  283. 33.77 s > report: target/nextest/ci_gammaloop/junit.xml
  284. 33.77 s > tests: 0, failures: 0, errors: 0
  285. 33.77 s > No failing testcases found.
  286. 33.77 s > =========================================
  287. 33.77 s > Extracting 5 binaries (including 1 non-test binary), 1 build script output directory, and 2 linked paths to /build/source
  288. 33.77 s > Extracted 20 files to /build/source in 0.44s
  289. 33.77 s > ------------
  290. 33.77 s > Nextest run ID 04e44091-0db6-4924-bc7d-7fc736847e4f with nextest profile: ci_gammaloop
  291. 33.77 s > Starting 456 tests across 4 binaries (61 tests skipped, including 60 tests via profile.ci_gammaloop.default-filter)
  292. 33.77 s > ------------
  293. 33.77 s > Summary [ 7.832s] 456 tests run: 456 passed, 61 skipped
  294. 33.77 s >
  295. 33.77 s > ========== nextest test summary ==========
  296. 33.77 s > report: target/nextest/ci_gammaloop/junit.xml
  297. 33.77 s > tests: 456, failures: 0, errors: 0
  298. 33.77 s > No failing testcases found.
  299. 33.77 s > =========================================
  300. 33.77 s For full logs, run:
  301. 33.77 s nix log /nix/store/02car8gk7i8dx2vfklks1bn8vxkmhh2r-gammaloop-nextest-core.drv
  302. 33.88 s [0 built (1 failed), 0.0Run failed.