test packages.x86_64-linux.nix-ci-check-gammaloop-nextest-linnet
0.00 s
$ /nix/store/9ypz3flqsrl5xl495mm8h645gadjsxi1-coreutils-9.11/bin/timeout --kill-after=15s 7200s /nix/store/23zk8sgzamrbmj1fday15szf7f2279s8-nix-2.34.7/bin/nix --extra-experimental-features nix-command --extra-experimental-features flakes flake clone git+https://github.com/alphal00p/gammaloop --dest /tmp/nix-ci-worker/stable-pwd/repo/
0.08 s
Cloning into '/tmp/nix-ci-worker/stable-pwd/repo'...
1.04 s
remote: Enumerating objects: 87989, done.
1.61 s
remote: Counting objects: 0% (1/10587)
remote: Counting objects: 1% (106/10587)
remote: Counting objects: 2% (212/10587)
remote: Counting objects: 3% (318/10587)
remote: Counting objects: 4% (424/10587)
remote: Counting objects: 5% (530/10587)
remote: Counting objects: 6% (636/10587)
remote: Counting objects: 7% (742/10587)
remote: Counting objects: 8% (847/10587)
remote: Counting objects: 9% (953/10587)
remote: Counting objects: 10% (1059/10587)
remote: Counting objects: 11% (1165/10587)
remote: Counting objects: 12% (1271/10587)
remote: Counting objects: 13% (1377/10587)
remote: Counting objects: 14% (1483/10587)
remote: Counting objects: 15% (1589/10587)
remote: Counting objects: 16% (1694/10587)
remote: Counting objects: 17% (1800/10587)
remote: Counting objects: 18% (1906/10587)
remote: Counting objects: 19% (2012/10587)
remote: Counting objects: 20% (2118/10587)
remote: Counting objects: 21% (2224/10587)
remote: Counting objects: 22% (2330/10587)
remote: Counting objects: 23% (2436/10587)
remote: Counting objects: 24% (2541/10587)
remote: Counting objects: 25% (2647/10587)
remote: Counting objects: 26% (2753/10587)
remote: Counting objects: 27% (2859/10587)
remote: Counting objects: 28% (2965/10587)
remote: Counting objects: 29% (3071/10587)
remote: Counting objects: 30% (3177/10587)
remote: Counting objects: 31% (3282/10587)
remote: Counting objects: 32% (3388/10587)
remote: Counting objects: 33% (3494/10587)
remote: Counting objects: 34% (3600/10587)
remote: Counting objects: 35% (3706/10587)
remote: Counting objects: 36% (3812/10587)
remote: Counting objects: 37% (3918/10587)
remote: Counting objects: 38% (4024/10587)
remote: Counting objects: 39% (4129/10587)
remote: Counting objects: 40% (4235/10587)
remote: Counting objects: 41% (4341/10587)
remote: Counting objects: 42% (4447/10587)
remote: Counting objects: 43% (4553/10587)
remote: Counting objects: 44% (4659/10587)
remote: Counting objects: 45% (4765/10587)
remote: Counting objects: 46% (4871/10587)
remote: Counting objects: 47% (4976/10587)
remote: Counting objects: 48% (5082/10587)
remote: Counting objects: 49% (5188/10587)
remote: Counting objects: 50% (5294/10587)
remote: Counting objects: 51% (5400/10587)
remote: Counting objects: 52% (5506/10587)
remote: Counting objects: 53% (5612/10587)
remote: Counting objects: 54% (5717/10587)
remote: Counting objects: 55% (5823/10587)
remote: Counting objects: 56% (5929/10587)
remote: Counting objects: 57% (6035/10587)
remote: Counting objects: 58% (6141/10587)
remote: Counting objects: 59% (6247/10587)
remote: Counting objects: 60% (6353/10587)
remote: Counting objects: 61% (6459/10587)
remote: Counting objects: 62% (6564/10587)
remote: Counting objects: 63% (6670/10587)
remote: Counting objects: 64% (6776/10587)
remote: Counting objects: 65% (6882/10587)
remote: Counting objects: 66% (6988/10587)
remote: Counting objects: 67% (7094/10587)
remote: Counting objects: 68% (7200/10587)
remote: Counting objects: 69% (7306/10587)
remote: Counting objects: 70% (7411/10587)
remote: Counting objects: 71% (7517/10587)
remote: Counting objects: 72% (7623/10587)
remote: Counting objects: 73% (7729/10587)
remote: Counting objects: 74% (7835/10587)
remote: Counting objects: 75% (7941/10587)
remote: Counting objects: 76% (8047/10587)
remote: Counting objects: 77% (8152/10587)
remote: Counting objects: 78% (8258/10587)
remote: Counting objects: 79% (8364/10587)
remote: Counting objects: 80% (8470/10587)
remote: Counting objects: 81% (8576/10587)
remote: Counting objects: 82% (8682/10587)
remote: Counting objects: 83% (8788/10587)
remote: Counting objects: 84% (8894/10587)
remote: Counting objects: 85% (8999/10587)
remote: Counting objects: 86% (9105/10587)
remote: Counting objects: 87% (9211/10587)
remote: Counting objects: 88% (9317/10587)
remote: Counting objects: 89% (9423/10587)
remote: Counting objects: 90% (9529/10587)
remote: Counting objects: 91% (9635/10587)
remote: Counting objects: 92% (9741/10587)
remote: Counting objects: 93% (9846/10587)
remote: Counting objects: 94% (9952/10587)
remote: Counting objects: 95% (10058/10587)
remote: Counting objects: 96% (10164/10587)
remote: Counting objects: 97% (10270/10587)
remote: Counting objects: 98% (10376/10587)
remote: Counting objects: 99% (10482/10587)
remote: Counting objects: 100% (10587/10587)
remote: Counting objects: 100% (10587/10587), done.
4.12 s
remote: Compressing objects: 0% (1/2956)
remote: Compressing objects: 1% (30/2956)
remote: Compressing objects: 2% (60/2956)
remote: Compressing objects: 3% (89/2956)
remote: Compressing objects: 4% (119/2956)
remote: Compressing objects: 5% (148/2956)
remote: Compressing objects: 6% (178/2956)
remote: Compressing objects: 7% (207/2956)
remote: Compressing objects: 8% (237/2956)
remote: Compressing objects: 9% (267/2956)
remote: Compressing objects: 10% (296/2956)
remote: Compressing objects: 11% (326/2956)
remote: Compressing objects: 12% (355/2956)
remote: Compressing objects: 13% (385/2956)
remote: Compressing objects: 14% (414/2956)
remote: Compressing objects: 14% (437/2956)
remote: Compressing objects: 15% (444/2956)
remote: Compressing objects: 16% (473/2956)
remote: Compressing objects: 17% (503/2956)
remote: Compressing objects: 18% (533/2956)
remote: Compressing objects: 19% (562/2956)
remote: Compressing objects: 20% (592/2956)
remote: Compressing objects: 21% (621/2956)
remote: Compressing objects: 22% (651/2956)
remote: Compressing objects: 23% (680/2956)
remote: Compressing objects: 24% (710/2956)
remote: Compressing objects: 25% (739/2956)
remote: Compressing objects: 26% (769/2956)
remote: Compressing objects: 26% (772/2956)
remote: Compressing objects: 27% (799/2956)
remote: Compressing objects: 28% (828/2956)
remote: Compressing objects: 29% (858/2956)
remote: Compressing objects: 30% (887/2956)
remote: Compressing objects: 31% (917/2956)
remote: Compressing objects: 32% (946/2956)
remote: Compressing objects: 33% (976/2956)
remote: Compressing objects: 34% (1006/2956)
remote: Compressing objects: 35% (1035/2956)
remote: Compressing objects: 36% (1065/2956)
remote: Compressing objects: 37% (1094/2956)
remote: Compressing objects: 38% (1124/2956)
remote: Compressing objects: 39% (1153/2956)
remote: Compressing objects: 40% (1183/2956)
remote: Compressing objects: 41% (1212/2956)
remote: Compressing objects: 42% (1242/2956)
remote: Compressing objects: 43% (1272/2956)
remote: Compressing objects: 44% (1301/2956)
remote: Compressing objects: 45% (1331/2956)
remote: Compressing objects: 46% (1360/2956)
remote: Compressing objects: 47% (1390/2956)
remote: Compressing objects: 48% (1419/2956)
remote: Compressing objects: 49% (1449/2956)
remote: Compressing objects: 50% (1478/2956)
remote: Compressing objects: 51% (1508/2956)
remote: Compressing objects: 52% (1538/2956)
remote: Compressing objects: 53% (1567/2956)
remote: Compressing objects: 54% (1597/2956)
remote: Compressing objects: 55% (1626/2956)
remote: Compressing objects: 56% (1656/2956)
remote: Compressing objects: 57% (1685/2956)
remote: Compressing objects: 58% (1715/2956)
remote: Compressing objects: 59% (1745/2956)
remote: Compressing objects: 60% (1774/2956)
remote: Compressing objects: 61% (1804/2956)
remote: Compressing objects: 62% (1833/2956)
remote: Compressing objects: 63% (1863/2956)
remote: Compressing objects: 64% (1892/2956)
remote: Compressing objects: 65% (1922/2956)
remote: Compressing objects: 66% (1951/2956)
remote: Compressing objects: 67% (1981/2956)
remote: Compressing objects: 68% (2011/2956)
remote: Compressing objects: 69% (2040/2956)
remote: Compressing objects: 70% (2070/2956)
remote: Compressing objects: 71% (2099/2956)
remote: Compressing objects: 71% (2107/2956)
remote: Compressing objects: 72% (2129/2956)
remote: Compressing objects: 73% (2158/2956)
remote: Compressing objects: 74% (2188/2956)
remote: Compressing objects: 75% (2217/2956)
remote: Compressing objects: 76% (2247/2956)
remote: Compressing objects: 77% (2277/2956)
remote: Compressing objects: 78% (2306/2956)
remote: Compressing objects: 79% (2336/2956)
remote: Compressing objects: 80% (2365/2956)
remote: Compressing objects: 81% (2395/2956)
remote: Compressing objects: 82% (2424/2956)
remote: Compressing objects: 83% (2454/2956)
remote: Compressing objects: 84% (2484/2956)
remote: Compressing objects: 85% (2513/2956)
remote: Compressing objects: 86% (2543/2956)
remote: Compressing objects: 87% (2572/2956)
remote: Compressing objects: 88% (2602/2956)
remote: Compressing objects: 89% (2631/2956)
remote: Compressing objects: 90% (2661/2956)
remote: Compressing objects: 91% (2690/2956)
remote: Compressing objects: 92% (2720/2956)
remote: Compressing objects: 93% (2750/2956)
remote: Compressing objects: 94% (2779/2956)
remote: Compressing objects: 95% (2809/2956)
remote: Compressing objects: 96% (2838/2956)
remote: Compressing objects: 97% (2868/2956)
remote: Compressing objects: 98% (2897/2956)
remote: Compressing objects: 99% (2927/2956)
remote: Compressing objects: 100% (2956/2956)
remote: Compressing objects: 100% (2956/2956), done.
9.55 s
Receiving objects: 0% (1/87989)
Receiving objects: 1% (880/87989)
Receiving objects: 2% (1760/87989)
Receiving objects: 3% (2640/87989)
Receiving objects: 4% (3520/87989)
Receiving objects: 5% (4400/87989)
Receiving objects: 6% (5280/87989)
Receiving objects: 7% (6160/87989)
Receiving objects: 8% (7040/87989)
Receiving objects: 9% (7920/87989), 11.71 MiB | 23.41 MiB/s
Receiving objects: 10% (8799/87989), 11.71 MiB | 23.41 MiB/s
Receiving objects: 11% (9679/87989), 11.71 MiB | 23.41 MiB/s
Receiving objects: 12% (10559/87989), 11.71 MiB | 23.41 MiB/s
Receiving objects: 13% (11439/87989), 11.71 MiB | 23.41 MiB/s
Receiving objects: 14% (12319/87989), 11.71 MiB | 23.41 MiB/s
Receiving objects: 15% (13199/87989), 11.71 MiB | 23.41 MiB/s
Receiving objects: 16% (14079/87989), 11.71 MiB | 23.41 MiB/s
Receiving objects: 17% (14959/87989), 11.71 MiB | 23.41 MiB/s
Receiving objects: 18% (15839/87989), 11.71 MiB | 23.41 MiB/s
Receiving objects: 19% (16718/87989), 11.71 MiB | 23.41 MiB/s
Receiving objects: 20% (17598/87989), 11.71 MiB | 23.41 MiB/s
Receiving objects: 21% (18478/87989), 11.71 MiB | 23.41 MiB/s
Receiving objects: 22% (19358/87989), 11.71 MiB | 23.41 MiB/s
Receiving objects: 23% (20238/87989), 11.71 MiB | 23.41 MiB/s
Receiving objects: 24% (21118/87989), 11.71 MiB | 23.41 MiB/s
Receiving objects: 25% (21998/87989), 11.71 MiB | 23.41 MiB/s
Receiving objects: 26% (22878/87989), 11.71 MiB | 23.41 MiB/s
Receiving objects: 27% (23758/87989), 11.71 MiB | 23.41 MiB/s
Receiving objects: 28% (24637/87989), 11.71 MiB | 23.41 MiB/s
Receiving objects: 29% (25517/87989), 11.71 MiB | 23.41 MiB/s
Receiving objects: 30% (26397/87989), 11.71 MiB | 23.41 MiB/s
Receiving objects: 31% (27277/87989), 11.71 MiB | 23.41 MiB/s
Receiving objects: 32% (28157/87989), 11.71 MiB | 23.41 MiB/s
Receiving objects: 33% (29037/87989), 11.71 MiB | 23.41 MiB/s
Receiving objects: 34% (29917/87989), 11.71 MiB | 23.41 MiB/s
Receiving objects: 35% (30797/87989), 11.71 MiB | 23.41 MiB/s
Receiving objects: 36% (31677/87989), 11.71 MiB | 23.41 MiB/s
Receiving objects: 37% (32556/87989), 11.71 MiB | 23.41 MiB/s
Receiving objects: 38% (33436/87989), 11.71 MiB | 23.41 MiB/s
Receiving objects: 38% (33890/87989), 11.71 MiB | 23.41 MiB/s
Receiving objects: 39% (34316/87989), 32.61 MiB | 32.06 MiB/s
Receiving objects: 40% (35196/87989), 32.61 MiB | 32.06 MiB/s
Receiving objects: 41% (36076/87989), 32.61 MiB | 32.06 MiB/s
Receiving objects: 42% (36956/87989), 32.61 MiB | 32.06 MiB/s
Receiving objects: 43% (37836/87989), 32.61 MiB | 32.06 MiB/s
Receiving objects: 44% (38716/87989), 32.61 MiB | 32.06 MiB/s
Receiving objects: 45% (39596/87989), 32.61 MiB | 32.06 MiB/s
Receiving objects: 46% (40475/87989), 32.61 MiB | 32.06 MiB/s
Receiving objects: 47% (41355/87989), 49.08 MiB | 32.23 MiB/s
Receiving objects: 48% (42235/87989), 49.08 MiB | 32.23 MiB/s
Receiving objects: 49% (43115/87989), 49.08 MiB | 32.23 MiB/s
Receiving objects: 50% (43995/87989), 49.08 MiB | 32.23 MiB/s
Receiving objects: 51% (44875/87989), 49.08 MiB | 32.23 MiB/s
Receiving objects: 52% (45755/87989), 49.08 MiB | 32.23 MiB/s
Receiving objects: 53% (46635/87989), 49.08 MiB | 32.23 MiB/s
Receiving objects: 54% (47515/87989), 49.08 MiB | 32.23 MiB/s
Receiving objects: 55% (48394/87989), 49.08 MiB | 32.23 MiB/s
Receiving objects: 55% (48725/87989), 65.62 MiB | 32.44 MiB/s
Receiving objects: 56% (49274/87989), 65.62 MiB | 32.44 MiB/s
Receiving objects: 57% (50154/87989), 65.62 MiB | 32.44 MiB/s
Receiving objects: 58% (51034/87989), 65.62 MiB | 32.44 MiB/s
Receiving objects: 59% (51914/87989), 65.62 MiB | 32.44 MiB/s
Receiving objects: 60% (52794/87989), 65.62 MiB | 32.44 MiB/s
Receiving objects: 61% (53674/87989), 65.62 MiB | 32.44 MiB/s
Receiving objects: 62% (54554/87989), 65.62 MiB | 32.44 MiB/s
Receiving objects: 63% (55434/87989), 65.62 MiB | 32.44 MiB/s
Receiving objects: 64% (56313/87989), 65.62 MiB | 32.44 MiB/s
Receiving objects: 65% (57193/87989), 82.44 MiB | 32.68 MiB/s
Receiving objects: 65% (57330/87989), 98.58 MiB | 32.61 MiB/s
Receiving objects: 66% (58073/87989), 98.58 MiB | 32.61 MiB/s
Receiving objects: 67% (58953/87989), 98.58 MiB | 32.61 MiB/s
Receiving objects: 68% (59833/87989), 98.58 MiB | 32.61 MiB/s
Receiving objects: 69% (60713/87989), 98.58 MiB | 32.61 MiB/s
Receiving objects: 70% (61593/87989), 98.58 MiB | 32.61 MiB/s
Receiving objects: 71% (62473/87989), 114.85 MiB | 32.52 MiB/s
Receiving objects: 72% (63353/87989), 114.85 MiB | 32.52 MiB/s
Receiving objects: 73% (64232/87989), 114.85 MiB | 32.52 MiB/s
Receiving objects: 73% (64305/87989), 114.85 MiB | 32.52 MiB/s
Receiving objects: 74% (65112/87989), 129.67 MiB | 32.12 MiB/s
Receiving objects: 75% (65992/87989), 129.67 MiB | 32.12 MiB/s
Receiving objects: 76% (66872/87989), 129.67 MiB | 32.12 MiB/s
Receiving objects: 77% (67752/87989), 129.67 MiB | 32.12 MiB/s
Receiving objects: 78% (68632/87989), 129.67 MiB | 32.12 MiB/s
Receiving objects: 79% (69512/87989), 129.67 MiB | 32.12 MiB/s
Receiving objects: 80% (70392/87989), 129.67 MiB | 32.12 MiB/s
Receiving objects: 81% (71272/87989), 129.67 MiB | 32.12 MiB/s
Receiving objects: 82% (72151/87989), 129.67 MiB | 32.12 MiB/s
Receiving objects: 83% (73031/87989), 129.67 MiB | 32.12 MiB/s
Receiving objects: 84% (73911/87989), 129.67 MiB | 32.12 MiB/s
Receiving objects: 85% (74791/87989), 146.30 MiB | 32.23 MiB/s
Receiving objects: 86% (75671/87989), 146.30 MiB | 32.23 MiB/s
Receiving objects: 87% (76551/87989), 146.30 MiB | 32.23 MiB/s
Receiving objects: 88% (77431/87989), 146.30 MiB | 32.23 MiB/s
Receiving objects: 89% (78311/87989), 146.30 MiB | 32.23 MiB/s
Receiving objects: 90% (79191/87989), 146.30 MiB | 32.23 MiB/s
Receiving objects: 91% (80070/87989), 146.30 MiB | 32.23 MiB/s
Receiving objects: 92% (80950/87989), 146.30 MiB | 32.23 MiB/s
Receiving objects: 93% (81830/87989), 146.30 MiB | 32.23 MiB/s
Receiving objects: 94% (82710/87989), 146.30 MiB | 32.23 MiB/s
Receiving objects: 95% (83590/87989), 146.30 MiB | 32.23 MiB/s
Receiving objects: 96% (84470/87989), 146.30 MiB | 32.23 MiB/s
Receiving objects: 97% (85350/87989), 146.30 MiB | 32.23 MiB/s
Receiving objects: 98% (86230/87989), 146.30 MiB | 32.23 MiB/s
Receiving objects: 98% (86607/87989), 146.30 MiB | 32.23 MiB/s
Receiving objects: 99% (87110/87989), 163.11 MiB | 33.35 MiB/s
remote: Total 87989 (delta 8644), reused 8407 (delta 7605), pack-reused 77402 (from 3)
9.55 s
Receiving objects: 100% (87989/87989), 163.11 MiB | 33.35 MiB/s
Receiving objects: 100% (87989/87989), 176.53 MiB | 32.57 MiB/s, done.
10.70 s
Resolving deltas: 0% (0/59509)
Resolving deltas: 1% (596/59509)
Resolving deltas: 2% (1191/59509)
Resolving deltas: 3% (1786/59509)
Resolving deltas: 4% (2381/59509)
Resolving deltas: 5% (2976/59509)
Resolving deltas: 6% (3571/59509)
Resolving deltas: 7% (4166/59509)
Resolving deltas: 8% (4761/59509)
Resolving deltas: 9% (5357/59509)
Resolving deltas: 10% (5951/59509)
Resolving deltas: 11% (6546/59509)
Resolving deltas: 12% (7145/59509)
Resolving deltas: 13% (7737/59509)
Resolving deltas: 14% (8332/59509)
Resolving deltas: 15% (8928/59509)
Resolving deltas: 16% (9522/59509)
Resolving deltas: 17% (10117/59509)
Resolving deltas: 18% (10712/59509)
Resolving deltas: 19% (11307/59509)
Resolving deltas: 20% (11902/59509)
Resolving deltas: 21% (12497/59509)
Resolving deltas: 22% (13092/59509)
Resolving deltas: 23% (13688/59509)
Resolving deltas: 24% (14283/59509)
Resolving deltas: 25% (14878/59509)
Resolving deltas: 26% (15474/59509)
Resolving deltas: 27% (16068/59509)
Resolving deltas: 28% (16663/59509)
Resolving deltas: 29% (17258/59509)
Resolving deltas: 30% (17853/59509)
Resolving deltas: 31% (18448/59509)
Resolving deltas: 32% (19043/59509)
Resolving deltas: 33% (19638/59509)
Resolving deltas: 34% (20234/59509)
Resolving deltas: 35% (20829/59509)
Resolving deltas: 36% (21426/59509)
Resolving deltas: 37% (22019/59509)
Resolving deltas: 38% (22614/59509)
Resolving deltas: 39% (23209/59509)
Resolving deltas: 40% (23804/59509)
Resolving deltas: 41% (24399/59509)
Resolving deltas: 42% (24994/59509)
Resolving deltas: 43% (25589/59509)
Resolving deltas: 44% (26184/59509)
Resolving deltas: 45% (26780/59509)
Resolving deltas: 46% (27376/59509)
Resolving deltas: 47% (27971/59509)
Resolving deltas: 48% (28565/59509)
Resolving deltas: 49% (29160/59509)
Resolving deltas: 50% (29755/59509)
Resolving deltas: 51% (30350/59509)
Resolving deltas: 52% (30945/59509)
Resolving deltas: 53% (31540/59509)
Resolving deltas: 54% (32135/59509)
Resolving deltas: 55% (32730/59509)
Resolving deltas: 56% (33327/59509)
Resolving deltas: 57% (33921/59509)
Resolving deltas: 58% (34516/59509)
Resolving deltas: 59% (35111/59509)
Resolving deltas: 60% (35706/59509)
Resolving deltas: 61% (36301/59509)
Resolving deltas: 62% (36896/59509)
Resolving deltas: 63% (37493/59509)
Resolving deltas: 64% (38086/59509)
Resolving deltas: 65% (38681/59509)
Resolving deltas: 66% (39276/59509)
Resolving deltas: 67% (39872/59509)
Resolving deltas: 68% (40467/59509)
Resolving deltas: 69% (41063/59509)
Resolving deltas: 70% (41659/59509)
Resolving deltas: 71% (42252/59509)
Resolving deltas: 72% (42848/59509)
Resolving deltas: 73% (43442/59509)
Resolving deltas: 74% (44038/59509)
Resolving deltas: 75% (44632/59509)
Resolving deltas: 76% (45227/59509)
Resolving deltas: 77% (45822/59509)
Resolving deltas: 78% (46418/59509)
Resolving deltas: 79% (47014/59509)
Resolving deltas: 80% (47610/59509)
Resolving deltas: 81% (48203/59509)
Resolving deltas: 82% (48799/59509)
Resolving deltas: 83% (49393/59509)
Resolving deltas: 83% (49588/59509)
Resolving deltas: 84% (49988/59509)
Resolving deltas: 85% (50583/59509)
Resolving deltas: 86% (51178/59509)
Resolving deltas: 87% (51773/59509)
Resolving deltas: 88% (52368/59509)
Resolving deltas: 89% (52968/59509)
Resolving deltas: 90% (53559/59509)
Resolving deltas: 91% (54154/59509)
Resolving deltas: 92% (54749/59509)
Resolving deltas: 93% (55345/59509)
Resolving deltas: 94% (55939/59509)
Resolving deltas: 95% (56534/59509)
Resolving deltas: 96% (57129/59509)
Resolving deltas: 97% (57728/59509)
Resolving deltas: 98% (58319/59509)
Resolving deltas: 99% (58914/59509)
Resolving deltas: 100% (59509/59509)
Resolving deltas: 100% (59509/59509), done.
11.22 s
Fetching commit 4338252f3f6441dd1159617dee545403b8fb24d4 for docs ...
11.22 s
$ /nix/store/bcnisk3ydfgv26v2gw3zlky24g00yww2-git-2.54.0/bin/git fetch origin 4338252f3f6441dd1159617dee545403b8fb24d4
11.65 s
From https://github.com/alphal00p/gammaloop
11.65 s
* branch 4338252f3f6441dd1159617dee545403b8fb24d4 -> FETCH_HEAD
11.67 s
$ /nix/store/9ypz3flqsrl5xl495mm8h645gadjsxi1-coreutils-9.11/bin/timeout --kill-after=15s 7200s /nix/store/bcnisk3ydfgv26v2gw3zlky24g00yww2-git-2.54.0/bin/git -c advice.detachedHead=false checkout 4338252f3f6441dd1159617dee545403b8fb24d4
12.00 s
HEAD is now at 4338252f3 embed live WASM notebooks in the product guides
12.00 s
$ /nix/store/9ypz3flqsrl5xl495mm8h645gadjsxi1-coreutils-9.11/bin/timeout --kill-after=15s 7200s /nix/store/23zk8sgzamrbmj1fday15szf7f2279s8-nix-2.34.7/bin/nix --extra-experimental-features nix-command --extra-experimental-features flakes --log-format internal-json run .#packages.x86_64-linux.nix-ci-check-gammaloop-nextest-linnet --print-build-logs
16.68 s
17.02 s
Downloading cached gammaloop-nextest-binaries-linnet-kurvst from https://cache.nix-ci.com
17.02 s
Downloading cached gammaloop-nextest-binaries-linnet-linnest from https://cache.nix-ci.com
17.02 s
Downloading cached gammaloop-nextest-binaries-linnet-linnet from https://cache.nix-ci.com
17.02 s
Downloading cached gammaloop-nextest-binaries-linnet-linnet-py from https://cache.nix-ci.com
17.17 s
Downloaded cached gammaloop-nextest-binaries-linnet-kurvst (3.2 MiB) in 154ms
17.17 s
Progress: 0 of 1 built, 1 of 6 downloaded from cache (3 downloading)
17.33 s
Downloaded cached gammaloop-nextest-binaries-linnet-linnest (7.4 MiB) in 306ms
17.33 s
Progress: 0 of 1 built, 2 of 6 downloaded from cache (2 downloading)
17.67 s
Downloaded cached gammaloop-nextest-binaries-linnet-linnet (20.5 MiB) in 649ms
17.67 s
Progress: 0 of 1 built, 3 of 6 downloaded from cache (1 downloading)
17.98 s
Downloaded cached gammaloop-nextest-binaries-linnet-linnet-py (37 MiB) in 955ms
17.98 s
Progress: 0 of 1 built, 4 of 6 downloaded from cache
17.98 s
Downloading cached gammaloop-nextest-binaries-linnet from https://cache.nix-ci.com
18.00 s
Downloaded cached gammaloop-nextest-binaries-linnet (1512 B) in 27ms
18.00 s
Progress: 0 of 1 built, 5 of 6 downloaded from cache
18.00 s
Downloading cached nix-ci-check-gammaloop-nextest-linnet from https://cache.nix-ci.com
18.03 s
Downloaded cached nix-ci-check-gammaloop-nextest-linnet (1016 B) in 26ms
18.03 s
Progress: 0 of 1 built, 6 of 6 downloaded from cache
23.12 s
evaluating derivation 'g
copying '/nix/store/bgss
evaluating derivation 'g
copying '/nix/store/bgss
evaluating derivation 'g
copying '/nix/store/bgss
evaluating derivation 'g
copying '/nix/store/bgss
evaluating derivation 'g
querying gammaloop-nexte
[0 /1 built, 0.0 KiB DL]
[1 /0 /1 built, 0.0 KiB DLgammaloop-nextest-linnet> Extracting 2 binaries (including 1 non-test binary) to /build/source
23.17 s
gammaloop-nextest-linnet> Extracted 6 files to /build/source in 0.05s
23.18 s
gammaloop-nextest-linnet> ------------
23.18 s
gammaloop-nextest-linnet> Nextest run ID fab76fac-11a1-4b66-ad12-da2ae173bce9 with nextest profile: ci_gammaloop
23.18 s
gammaloop-nextest-linnet> Starting 24 tests across 1 binary
23.20 s
gammaloop-nextest-linnet> ------------
23.20 s
gammaloop-nextest-linnet> Summary [ 0.020s] 24 tests run: 24 passed , 0 skipped
23.24 s
gammaloop-nextest-linnet>
23.24 s
gammaloop-nextest-linnet> ========== nextest test summary ==========
23.24 s
gammaloop-nextest-linnet> report: target/nextest/ci_gammaloop/junit.xml
23.24 s
gammaloop-nextest-linnet> tests: 24, failures: 0, errors: 0
23.24 s
gammaloop-nextest-linnet> No failing testcases found.
23.24 s
gammaloop-nextest-linnet> =========================================
23.26 s
gammaloop-nextest-linnet> Extracting 2 binaries (including 1 non-test binary) and 1 linked path to /build/source
23.42 s
gammaloop-nextest-linnet> Extracted 9 files to /build/source in 0.16s
23.43 s
gammaloop-nextest-linnet> ------------
23.43 s
gammaloop-nextest-linnet> Nextest run ID 5b05c7c1-f821-4a41-b69a-14ddae0af9af with nextest profile: ci_gammaloop
23.43 s
gammaloop-nextest-linnet> Starting 183 tests across 1 binary
23.61 s
gammaloop-nextest-linnet> ------------
23.61 s
gammaloop-nextest-linnet> Summary [ 0.188s] 183 tests run: 183 passed , 0 skipped
23.65 s
gammaloop-nextest-linnet>
23.65 s
gammaloop-nextest-linnet> ========== nextest test summary ==========
23.65 s
gammaloop-nextest-linnet> report: target/nextest/ci_gammaloop/junit.xml
23.65 s
gammaloop-nextest-linnet> tests: 183, failures: 0, errors: 0
23.65 s
gammaloop-nextest-linnet> No failing testcases found.
23.65 s
gammaloop-nextest-linnet> =========================================
23.66 s
gammaloop-nextest-linnet> Extracting 4 binaries (including 3 non-test binaries), 1 build script output directory, and 1 linked path to /build/source
23.94 s
gammaloop-nextest-linnet> Extracted 13 files to /build/source in 0.28s
23.95 s
gammaloop-nextest-linnet> ------------
23.95 s
gammaloop-nextest-linnet> Nextest run ID 9221f694-af18-45ae-b191-a245fa571807 with nextest profile: ci_gammaloop
23.95 s
gammaloop-nextest-linnet> Starting 0 tests across 1 binary
23.95 s
gammaloop-nextest-linnet> ------------
23.95 s
gammaloop-nextest-linnet> Summary [ 0.000s] 0 tests run: 0 passed , 0 skipped
23.98 s
gammaloop-nextest-linnet>
23.98 s
gammaloop-nextest-linnet> ========== nextest test summary ==========
23.98 s
gammaloop-nextest-linnet> report: target/nextest/ci_gammaloop/junit.xml
23.98 s
gammaloop-nextest-linnet> tests: 0, failures: 0, errors: 0
23.98 s
gammaloop-nextest-linnet> No failing testcases found.
23.98 s
gammaloop-nextest-linnet> =========================================
23.99 s
gammaloop-nextest-linnet> Extracting 2 binaries (including 1 non-test binary) and 1 linked path to /build/source
24.08 s
gammaloop-nextest-linnet> Extracted 9 files to /build/source in 0.08s
24.09 s
gammaloop-nextest-linnet> ------------
24.09 s
gammaloop-nextest-linnet> Nextest run ID db6721a5-8780-4d60-b1e7-05e22f17d0ee with nextest profile: ci_gammaloop
24.09 s
gammaloop-nextest-linnet> Starting 128 tests across 1 binary
24.16 s
gammaloop-nextest-linnet> FAIL [ 0.008s] (104/128) linnest tests :: test_graph_structural_axis_merge_preserves_edge_positions_and_constraints
24.16 s
gammaloop-nextest-linnet> stdout ---
24.16 s
gammaloop-nextest-linnet>
24.16 s
gammaloop-nextest-linnet> running 1 test
24.16 s
gammaloop-nextest-linnet> test tests::test_graph_structural_axis_merge_preserves_edge_positions_and_constraints ... FAILED
24.16 s
gammaloop-nextest-linnet>
24.16 s
gammaloop-nextest-linnet> failures:
24.16 s
gammaloop-nextest-linnet>
24.16 s
gammaloop-nextest-linnet> failures:
24.16 s
gammaloop-nextest-linnet> tests::test_graph_structural_axis_merge_preserves_edge_positions_and_constraints
24.16 s
gammaloop-nextest-linnet>
24.16 s
gammaloop-nextest-linnet> test result: FAILED. 0 passed; 1 failed; 0 ignored; 0 measured; 127 filtered out; finished in 0.00s
24.16 s
gammaloop-nextest-linnet>
24.16 s
gammaloop-nextest-linnet> stderr ---
24.16 s
gammaloop-nextest-linnet>
24.16 s
gammaloop-nextest-linnet> thread 'tests::test_graph_structural_axis_merge_preserves_edge_positions_and_constraints' (922) panicked at crates/linnest/src/tests.rs:1721:32:
24.16 s
gammaloop-nextest-linnet> no entry found for key
24.16 s
gammaloop-nextest-linnet> stack backtrace:
24.16 s
gammaloop-nextest-linnet> 0: __rustc::rust_begin_unwind
24.16 s
gammaloop-nextest-linnet> 1: core::panicking::panic_fmt
24.16 s
gammaloop-nextest-linnet> 2: core::option::expect_failed
24.16 s
gammaloop-nextest-linnet> 3: linnest::tests::test_graph_structural_axis_merge_preserves_edge_positions_and_constraints
24.16 s
gammaloop-nextest-linnet> 4: <linnest::tests::test_graph_structural_axis_merge_preserves_edge_positions_and_constraints::{closure#0} as core::ops::function::FnOnce<()>>::call_once
24.16 s
gammaloop-nextest-linnet> note: Some details are omitted, run with `RUST_BACKTRACE=full` for a verbose backtrace.
24.16 s
gammaloop-nextest-linnet>
24.17 s
gammaloop-nextest-linnet> ------------
24.17 s
gammaloop-nextest-linnet> Summary [ 0.081s] 128 tests run: 127 passed , 1 failed , 0 skipped
24.17 s
gammaloop-nextest-linnet> FAIL [ 0.008s] (104/128) linnest tests :: test_graph_structural_axis_merge_preserves_edge_positions_and_constraints
24.17 s
gammaloop-nextest-linnet> stdout ---
24.17 s
gammaloop-nextest-linnet>
24.17 s
gammaloop-nextest-linnet> running 1 test
24.17 s
gammaloop-nextest-linnet> test tests::test_graph_structural_axis_merge_preserves_edge_positions_and_constraints ... FAILED
24.17 s
gammaloop-nextest-linnet>
24.17 s
gammaloop-nextest-linnet> failures:
24.17 s
gammaloop-nextest-linnet>
24.17 s
gammaloop-nextest-linnet> failures:
24.17 s
gammaloop-nextest-linnet> tests::test_graph_structural_axis_merge_preserves_edge_positions_and_constraints
24.17 s
gammaloop-nextest-linnet>
24.17 s
gammaloop-nextest-linnet> test result: FAILED. 0 passed; 1 failed; 0 ignored; 0 measured; 127 filtered out; finished in 0.00s
24.17 s
gammaloop-nextest-linnet>
24.17 s
gammaloop-nextest-linnet> stderr ---
24.17 s
gammaloop-nextest-linnet>
24.17 s
gammaloop-nextest-linnet> thread 'tests::test_graph_structural_axis_merge_preserves_edge_positions_and_constraints' (922) panicked at crates/linnest/src/tests.rs:1721:32:
24.17 s
gammaloop-nextest-linnet> no entry found for key
24.17 s
gammaloop-nextest-linnet> stack backtrace:
24.17 s
gammaloop-nextest-linnet> 0: __rustc::rust_begin_unwind
24.17 s
gammaloop-nextest-linnet> 1: core::panicking::panic_fmt
24.17 s
gammaloop-nextest-linnet> 2: core::option::expect_failed
24.17 s
gammaloop-nextest-linnet> 3: linnest::tests::test_graph_structural_axis_merge_preserves_edge_positions_and_constraints
24.17 s
gammaloop-nextest-linnet> 4: <linnest::tests::test_graph_structural_axis_merge_preserves_edge_positions_and_constraints::{closure#0} as core::ops::function::FnOnce<()>>::call_once
24.17 s
gammaloop-nextest-linnet> note: Some details are omitted, run with `RUST_BACKTRACE=full` for a verbose backtrace.
24.17 s
gammaloop-nextest-linnet>
24.18 s
gammaloop-nextest-linnet> error : test run failed
24.21 s
gammaloop-nextest-linnet>
24.21 s
gammaloop-nextest-linnet> ========== nextest test summary ==========
24.21 s
gammaloop-nextest-linnet> report: target/nextest/ci_gammaloop/junit.xml
24.21 s
gammaloop-nextest-linnet> tests: 128, failures: 1, errors: 0
24.21 s
gammaloop-nextest-linnet>
24.21 s
gammaloop-nextest-linnet> 1. linnest::tests::test_graph_structural_axis_merge_preserves_edge_positions_and_constraints
24.21 s
gammaloop-nextest-linnet> failure: test failure with exit code 101
24.21 s
gammaloop-nextest-linnet> thread 'tests::test_graph_structural_axis_merge_preserves_edge_positions_and_constraints' (922) panicked at crates/linnest/src/tests.rs:1721:32:
24.21 s
gammaloop-nextest-linnet> no entry found for key
24.21 s
gammaloop-nextest-linnet> stack backtrace:
24.21 s
gammaloop-nextest-linnet> 0: __rustc::rust_begin_unwind
24.21 s
gammaloop-nextest-linnet> 1: core::panicking::panic_fmt
24.21 s
gammaloop-nextest-linnet> 2: core::option::expect_failed
24.22 s
gammaloop-nextest-linnet> 3: linnest::tests::test_graph_structural_axis_merge_preserves_edge_positions_and_constraints
24.22 s
gammaloop-nextest-linnet> 4: <linnest::tests::test_graph_structural_axis_merge_preserves_edge_positions_and_constraints::{closure#0} as core::ops::function::FnOnce<()>>::call_once
24.22 s
gammaloop-nextest-linnet> note: Some details are omitted, run with `RUST_BACKTRACE=full` for a verbose backtrace.
24.22 s
gammaloop-nextest-linnet> system-out
24.22 s
gammaloop-nextest-linnet> running 1 test
24.22 s
gammaloop-nextest-linnet> test tests::test_graph_structural_axis_merge_preserves_edge_positions_and_constraints ... FAILED
24.22 s
gammaloop-nextest-linnet>
24.22 s
gammaloop-nextest-linnet> failures:
24.22 s
gammaloop-nextest-linnet>
24.22 s
gammaloop-nextest-linnet> failures:
24.22 s
gammaloop-nextest-linnet> tests::test_graph_structural_axis_merge_preserves_edge_positions_and_constraints
24.22 s
gammaloop-nextest-linnet>
24.22 s
gammaloop-nextest-linnet> test result: FAILED. 0 passed; 1 failed; 0 ignored; 0 measured; 127 filtered out; finished in 0.00s
24.22 s
gammaloop-nextest-linnet> system-err
24.22 s
gammaloop-nextest-linnet> thread 'tests::test_graph_structural_axis_merge_preserves_edge_positions_and_constraints' (922) panicked at crates/linnest/src/tests.rs:1721:32:
24.22 s
gammaloop-nextest-linnet> no entry found for key
24.22 s
gammaloop-nextest-linnet> stack backtrace:
24.22 s
gammaloop-nextest-linnet> 0: __rustc::rust_begin_unwind
24.22 s
gammaloop-nextest-linnet> 1: core::panicking::panic_fmt
24.22 s
gammaloop-nextest-linnet> 2: core::option::expect_failed
24.22 s
gammaloop-nextest-linnet> 3: linnest::tests::test_graph_structural_axis_merge_preserves_edge_positions_and_constraints
24.22 s
gammaloop-nextest-linnet> 4: <linnest::tests::test_graph_structural_axis_merge_preserves_edge_positions_and_constraints::{closure#0} as core::ops::function::FnOnce<()>>::call_once
24.22 s
gammaloop-nextest-linnet> note: Some details are omitted, run with `RUST_BACKTRACE=full` for a verbose backtrace.
24.22 s
gammaloop-nextest-linnet> =========================================
24.32 s
error: Cannot build '/nix/store/3a6s86hhbf2g1hgbkmcq3zdrmaha78qr-gammaloop-nextest-linnet.drv '.
24.32 s
Reason: builder failed with exit code 100 .
24.32 s
Output paths:
24.32 s
/nix/store/v4cbh6ql60kq7xlziivk5va382nw7f4v-gammaloop-nextest-linnet
24.32 s
Last 134 log lines:
24.32 s
> Extracting 2 binaries (including 1 non-test binary) to /build/source
24.32 s
> Extracted 6 files to /build/source in 0.05s
24.32 s
> ------------
24.32 s
> Nextest run ID fab76fac-11a1-4b66-ad12-da2ae173bce9 with nextest profile: ci_gammaloop
24.32 s
> Starting 24 tests across 1 binary
24.32 s
> ------------
24.32 s
> Summary [ 0.020s] 24 tests run: 24 passed , 0 skipped
24.32 s
>
24.32 s
> ========== nextest test summary ==========
24.32 s
> report: target/nextest/ci_gammaloop/junit.xml
24.32 s
> tests: 24, failures: 0, errors: 0
24.32 s
> No failing testcases found.
24.32 s
> =========================================
24.32 s
> Extracting 2 binaries (including 1 non-test binary) and 1 linked path to /build/source
24.32 s
> Extracted 9 files to /build/source in 0.16s
24.32 s
> ------------
24.32 s
> Nextest run ID 5b05c7c1-f821-4a41-b69a-14ddae0af9af with nextest profile: ci_gammaloop
24.32 s
> Starting 183 tests across 1 binary
24.32 s
> ------------
24.32 s
> Summary [ 0.188s] 183 tests run: 183 passed , 0 skipped
24.32 s
>
24.32 s
> ========== nextest test summary ==========
24.32 s
> report: target/nextest/ci_gammaloop/junit.xml
24.32 s
> tests: 183, failures: 0, errors: 0
24.32 s
> No failing testcases found.
24.32 s
> =========================================
24.32 s
> Extracting 4 binaries (including 3 non-test binaries), 1 build script output directory, and 1 linked path to /build/source
24.32 s
> Extracted 13 files to /build/source in 0.28s
24.32 s
> ------------
24.32 s
> Nextest run ID 9221f694-af18-45ae-b191-a245fa571807 with nextest profile: ci_gammaloop
24.32 s
> Starting 0 tests across 1 binary
24.32 s
> ------------
24.32 s
> Summary [ 0.000s] 0 tests run: 0 passed , 0 skipped
24.32 s
>
24.32 s
> ========== nextest test summary ==========
24.32 s
> report: target/nextest/ci_gammaloop/junit.xml
24.32 s
> tests: 0, failures: 0, errors: 0
24.32 s
> No failing testcases found.
24.32 s
> =========================================
24.32 s
> Extracting 2 binaries (including 1 non-test binary) and 1 linked path to /build/source
24.32 s
> Extracted 9 files to /build/source in 0.08s
24.32 s
> ------------
24.32 s
> Nextest run ID db6721a5-8780-4d60-b1e7-05e22f17d0ee with nextest profile: ci_gammaloop
24.32 s
> Starting 128 tests across 1 binary
24.32 s
> FAIL [ 0.008s] (104/128) linnest tests :: test_graph_structural_axis_merge_preserves_edge_positions_and_constraints
24.32 s
> stdout ---
24.32 s
>
24.32 s
> running 1 test
24.32 s
> test tests::test_graph_structural_axis_merge_preserves_edge_positions_and_constraints ... FAILED
24.32 s
>
24.32 s
> failures:
24.32 s
>
24.32 s
> failures:
24.32 s
> tests::test_graph_structural_axis_merge_preserves_edge_positions_and_constraints
24.32 s
>
24.32 s
> test result: FAILED. 0 passed; 1 failed; 0 ignored; 0 measured; 127 filtered out; finished in 0.00s
24.32 s
>
24.32 s
> stderr ---
24.32 s
>
24.32 s
> thread 'tests::test_graph_structural_axis_merge_preserves_edge_positions_and_constraints' (922) panicked at crates/linnest/src/tests.rs:1721:32:
24.32 s
> no entry found for key
24.32 s
> stack backtrace:
24.32 s
> 0: __rustc::rust_begin_unwind
24.32 s
> 1: core::panicking::panic_fmt
24.32 s
> 2: core::option::expect_failed
24.32 s
> 3: linnest::tests::test_graph_structural_axis_merge_preserves_edge_positions_and_constraints
24.32 s
> 4: <linnest::tests::test_graph_structural_axis_merge_preserves_edge_positions_and_constraints::{closure#0} as core::ops::function::FnOnce<()>>::call_once
24.32 s
> note: Some details are omitted, run with `RUST_BACKTRACE=full` for a verbose backtrace.
24.32 s
>
24.32 s
> ------------
24.32 s
> Summary [ 0.081s] 128 tests run: 127 passed , 1 failed , 0 skipped
24.32 s
> FAIL [ 0.008s] (104/128) linnest tests :: test_graph_structural_axis_merge_preserves_edge_positions_and_constraints
24.32 s
> stdout ---
24.32 s
>
24.32 s
> running 1 test
24.32 s
> test tests::test_graph_structural_axis_merge_preserves_edge_positions_and_constraints ... FAILED
24.32 s
>
24.32 s
> failures:
24.32 s
>
24.32 s
> failures:
24.32 s
> tests::test_graph_structural_axis_merge_preserves_edge_positions_and_constraints
24.32 s
>
24.32 s
> test result: FAILED. 0 passed; 1 failed; 0 ignored; 0 measured; 127 filtered out; finished in 0.00s
24.32 s
>
24.32 s
> stderr ---
24.32 s
>
24.32 s
> thread 'tests::test_graph_structural_axis_merge_preserves_edge_positions_and_constraints' (922) panicked at crates/linnest/src/tests.rs:1721:32:
24.32 s
> no entry found for key
24.32 s
> stack backtrace:
24.32 s
> 0: __rustc::rust_begin_unwind
24.32 s
> 1: core::panicking::panic_fmt
24.32 s
> 2: core::option::expect_failed
24.32 s
> 3: linnest::tests::test_graph_structural_axis_merge_preserves_edge_positions_and_constraints
24.32 s
> 4: <linnest::tests::test_graph_structural_axis_merge_preserves_edge_positions_and_constraints::{closure#0} as core::ops::function::FnOnce<()>>::call_once
24.32 s
> note: Some details are omitted, run with `RUST_BACKTRACE=full` for a verbose backtrace.
24.32 s
>
24.32 s
> error : test run failed
24.32 s
>
24.32 s
> ========== nextest test summary ==========
24.32 s
> report: target/nextest/ci_gammaloop/junit.xml
24.32 s
> tests: 128, failures: 1, errors: 0
24.32 s
>
24.32 s
> 1. linnest::tests::test_graph_structural_axis_merge_preserves_edge_positions_and_constraints
24.32 s
> failure: test failure with exit code 101
24.32 s
> thread 'tests::test_graph_structural_axis_merge_preserves_edge_positions_and_constraints' (922) panicked at crates/linnest/src/tests.rs:1721:32:
24.32 s
> no entry found for key
24.32 s
> stack backtrace:
24.32 s
> 0: __rustc::rust_begin_unwind
24.32 s
> 1: core::panicking::panic_fmt
24.32 s
> 2: core::option::expect_failed
24.32 s
> 3: linnest::tests::test_graph_structural_axis_merge_preserves_edge_positions_and_constraints
24.32 s
> 4: <linnest::tests::test_graph_structural_axis_merge_preserves_edge_positions_and_constraints::{closure#0} as core::ops::function::FnOnce<()>>::call_once
24.32 s
> note: Some details are omitted, run with `RUST_BACKTRACE=full` for a verbose backtrace.
24.32 s
> system-out
24.32 s
> running 1 test
24.32 s
> test tests::test_graph_structural_axis_merge_preserves_edge_positions_and_constraints ... FAILED
24.32 s
>
24.32 s
> failures:
24.32 s
>
24.32 s
> failures:
24.32 s
> tests::test_graph_structural_axis_merge_preserves_edge_positions_and_constraints
24.32 s
>
24.32 s
> test result: FAILED. 0 passed; 1 failed; 0 ignored; 0 measured; 127 filtered out; finished in 0.00s
24.32 s
> system-err
24.32 s
> thread 'tests::test_graph_structural_axis_merge_preserves_edge_positions_and_constraints' (922) panicked at crates/linnest/src/tests.rs:1721:32:
24.32 s
> no entry found for key
24.32 s
> stack backtrace:
24.32 s
> 0: __rustc::rust_begin_unwind
24.32 s
> 1: core::panicking::panic_fmt
24.32 s
> 2: core::option::expect_failed
24.32 s
> 3: linnest::tests::test_graph_structural_axis_merge_preserves_edge_positions_and_constraints
24.32 s
> 4: <linnest::tests::test_graph_structural_axis_merge_preserves_edge_positions_and_constraints::{closure#0} as core::ops::function::FnOnce<()>>::call_once
24.32 s
> note: Some details are omitted, run with `RUST_BACKTRACE=full` for a verbose backtrace.
24.32 s
> =========================================
24.32 s
For full logs, run:
24.32 s
nix log /nix/store/3a6s86hhbf2g1hgbkmcq3zdrmaha78qr-gammaloop-nextest-linnet.drv
24.44 s
[0 built (1 failed ), 0.0 Run failed.